id_mutation,date_mutation,numero_disposition,nature_mutation,valeur_fonciere,adresse_numero,adresse_suffixe,adresse_nom_voie,adresse_code_voie,code_postal,code_commune,nom_commune,code_departement,ancien_code_commune,ancien_nom_commune,id_parcelle,ancien_id_parcelle,numero_volume,lot1_numero,lot1_surface_carrez,lot2_numero,lot2_surface_carrez,lot3_numero,lot3_surface_carrez,lot4_numero,lot4_surface_carrez,lot5_numero,lot5_surface_carrez,nombre_lots,code_type_local,type_local,surface_reelle_bati,nombre_pieces_principales,code_nature_culture,nature_culture,code_nature_culture_speciale,nature_culture_speciale,surface_terrain,longitude,latitude
2023-1079316,2023-01-13,000001,Vente,662000,,,PLANESTEL,B075,83136,83077,Méounes-lès-Montrieux,83,,,830770000E0281,,,,,,,,,,,,,0,,,,,VI,vignes,,,5243,5.984533,43.304803
2023-1079316,2023-01-13,000001,Vente,662000,,,PLANESTEL,B075,83136,83077,Méounes-lès-Montrieux,83,,,830770000E0282,,,,,,,,,,,,,0,,,,,VI,vignes,,,25645,5.984816,43.305475
2023-1079316,2023-01-13,000001,Vente,662000,5355,,PLANESTEL,B075,83136,83077,Méounes-lès-Montrieux,83,,,830770000E0283,,,,,,,,,,,,,0,1,Maison,95,4,S,sols,,,400,5.985171,43.306033
2023-1079316,2023-01-13,000001,Vente,662000,5355,,PLANESTEL,B075,83136,83077,Méounes-lès-Montrieux,83,,,830770000E0283,,,,,,,,,,,,,0,3,Dépendance,,0,S,sols,,,400,5.985171,43.306033
2023-1079316,2023-01-13,000001,Vente,662000,,,PLANESTEL,B075,83136,83077,Méounes-lès-Montrieux,83,,,830770000E0284,,,,,,,,,,,,,0,,,,,BR,futaies résineuses,,,51131,5.985134,43.306967
2023-1079316,2023-01-13,000001,Vente,662000,,,PLANESTEL,B075,83136,83077,Méounes-lès-Montrieux,83,,,830770000E0289,,,,,,,,,,,,,0,,,,,VE,vergers,,,2160,5.986316,43.305995
2023-1079316,2023-01-13,000001,Vente,662000,,,PLANESTEL,B075,83136,83077,Méounes-lès-Montrieux,83,,,830770000E0289,,,,,,,,,,,,,0,,,,,P,prés,,,2680,5.986316,43.305995
2023-1079316,2023-01-13,000001,Vente,662000,,,PLANESTEL,B075,83136,83077,Méounes-lès-Montrieux,83,,,830770000E0290,,,,,,,,,,,,,0,,,,,BR,futaies résineuses,,,35761,5.985492,43.304783
2023-1079337,2023-01-16,000001,Vente,448500,527,,MTE DU CALVAIRE,0009,83136,83077,Méounes-lès-Montrieux,83,,,830770000C1314,,,,,,,,,,,,,0,3,Dépendance,,0,AG,terrains d'agrément,,,534,5.964817,43.278663
2023-1079337,2023-01-16,000001,Vente,448500,527,,MTE DU CALVAIRE,0009,83136,83077,Méounes-lès-Montrieux,83,,,830770000C1314,,,,,,,,,,,,,0,3,Dépendance,,0,AG,terrains d'agrément,,,534,5.964817,43.278663
2023-1079337,2023-01-16,000001,Vente,448500,527,,MTE DU CALVAIRE,0009,83136,83077,Méounes-lès-Montrieux,83,,,830770000C1314,,,,,,,,,,,,,0,1,Maison,110,5,S,sols,,,500,5.964817,43.278663
2023-1079337,2023-01-16,000001,Vente,448500,527,,MTE DU CALVAIRE,0009,83136,83077,Méounes-lès-Montrieux,83,,,830770000C1314,,,,,,,,,,,,,0,3,Dépendance,,0,AG,terrains d'agrément,,,534,5.964817,43.278663
2023-1079337,2023-01-16,000001,Vente,448500,527,,MTE DU CALVAIRE,0009,83136,83077,Méounes-lès-Montrieux,83,,,830770000C1314,,,,,,,,,,,,,0,3,Dépendance,,0,S,sols,,,500,5.964817,43.278663
2023-1079337,2023-01-16,000001,Vente,448500,527,,MTE DU CALVAIRE,0009,83136,83077,Méounes-lès-Montrieux,83,,,830770000C1314,,,,,,,,,,,,,0,1,Maison,110,5,AG,terrains d'agrément,,,534,5.964817,43.278663
2023-1079337,2023-01-16,000001,Vente,448500,527,,MTE DU CALVAIRE,0009,83136,83077,Méounes-lès-Montrieux,83,,,830770000C1314,,,,,,,,,,,,,0,3,Dépendance,,0,S,sols,,,500,5.964817,43.278663
2023-1079337,2023-01-16,000001,Vente,448500,527,,MTE DU CALVAIRE,0009,83136,83077,Méounes-lès-Montrieux,83,,,830770000C1314,,,,,,,,,,,,,0,3,Dépendance,,0,S,sols,,,500,5.964817,43.278663
2023-1079991,2023-01-30,000001,Vente,315000,10,,RTE DE BRIGNOLES,0008,83136,83077,Méounes-lès-Montrieux,83,,,830770000F0067,,,10,,2,,3,,4,,5,,9,2,Appartement,33,2,,,,,,5.969787,43.281689
2023-1079991,2023-01-30,000001,Vente,315000,10,,RTE DE BRIGNOLES,0008,83136,83077,Méounes-lès-Montrieux,83,,,830770000F0067,,,10,,2,,3,,4,,5,,9,2,Appartement,38,2,,,,,,5.969787,43.281689
2023-1079991,2023-01-30,000001,Vente,315000,10,,RTE DE BRIGNOLES,0008,83136,83077,Méounes-lès-Montrieux,83,,,830770000F0067,,,10,,2,,3,,4,,5,,9,2,Appartement,32,2,,,,,,5.969787,43.281689
2023-1079991,2023-01-30,000001,Vente,315000,10,,RTE DE BRIGNOLES,0008,83136,83077,Méounes-lès-Montrieux,83,,,830770000F0067,,,10,,2,,3,,4,,5,,9,2,Appartement,38,2,,,,,,5.969787,43.281689
2023-1079991,2023-01-30,000001,Vente,315000,10,,RTE DE BRIGNOLES,0008,83136,83077,Méounes-lès-Montrieux,83,,,830770000F0067,,,10,,2,,3,,4,,5,,9,2,Appartement,33,2,,,,,,5.969787,43.281689
2023-1080211,2023-01-17,000001,Vente,434000,648,,SAINT LAZARE,B085,83136,83077,Méounes-lès-Montrieux,83,,,830770000C0822,,,,,,,,,,,,,0,1,Maison,135,5,AG,terrains d'agrément,,,2000,5.966275,43.276522
2023-1080211,2023-01-17,000001,Vente,434000,648,,SAINT LAZARE,B085,83136,83077,Méounes-lès-Montrieux,83,,,830770000C0822,,,,,,,,,,,,,0,1,Maison,135,5,VE,vergers,OLIVE,Oliveraie ou oliviers,500,5.966275,43.276522
2023-1080211,2023-01-17,000001,Vente,434000,648,,SAINT LAZARE,B085,83136,83077,Méounes-lès-Montrieux,83,,,830770000C0822,,,,,,,,,,,,,0,3,Dépendance,,0,S,sols,,,500,5.966275,43.276522
2023-1080211,2023-01-17,000001,Vente,434000,648,,SAINT LAZARE,B085,83136,83077,Méounes-lès-Montrieux,83,,,830770000C0822,,,,,,,,,,,,,0,1,Maison,135,5,S,sols,,,500,5.966275,43.276522
2023-1080211,2023-01-17,000001,Vente,434000,648,,SAINT LAZARE,B085,83136,83077,Méounes-lès-Montrieux,83,,,830770000C0822,,,,,,,,,,,,,0,3,Dépendance,,0,AG,terrains d'agrément,,,2000,5.966275,43.276522
2023-1080211,2023-01-17,000001,Vente,434000,648,,SAINT LAZARE,B085,83136,83077,Méounes-lès-Montrieux,83,,,830770000C0822,,,,,,,,,,,,,0,3,Dépendance,,0,VE,vergers,OLIVE,Oliveraie ou oliviers,500,5.966275,43.276522
2023-1080492,2023-02-07,000001,Vente,431700,5606,,LES ESPREVEIRES,B027,83136,83077,Méounes-lès-Montrieux,83,,,830770000C0690,,,,,,,,,,,,,0,1,Maison,122,5,S,sols,,,500,5.969578,43.26942
2023-1080492,2023-02-07,000001,Vente,431700,5606,,LES ESPREVEIRES,B027,83136,83077,Méounes-lès-Montrieux,83,,,830770000C0690,,,,,,,,,,,,,0,1,Maison,122,5,AG,terrains d'agrément,,,1500,5.969578,43.26942
2023-1080612,2023-01-23,000001,Vente,433750,432,,CHE DU NAI,0021,83136,83077,Méounes-lès-Montrieux,83,,,830770000C0186,,,,,,,,,,,,,0,1,Maison,140,5,S,sols,,,770,5.970887,43.277371
2023-1080778,2023-02-07,000001,Vente,633100,57,,LE CROS DE L ESTANG,B025,83136,83077,Méounes-lès-Montrieux,83,,,830770000C1015,,,,,,,,,,,,,0,1,Maison,160,5,AG,terrains d'agrément,,,2000,5.954674,43.27878
2023-1080778,2023-02-07,000001,Vente,633100,57,,LE CROS DE L ESTANG,B025,83136,83077,Méounes-lès-Montrieux,83,,,830770000C1015,,,,,,,,,,,,,0,1,Maison,160,5,T,terres,,,3773,5.954674,43.27878
2023-1080778,2023-02-07,000001,Vente,633100,57,,LE CROS DE L ESTANG,B025,83136,83077,Méounes-lès-Montrieux,83,,,830770000C1015,,,,,,,,,,,,,0,1,Maison,160,5,S,sols,,,500,5.954674,43.27878
2023-1081368,2023-02-16,000001,Vente,14300,,,LA PLATRIERE,B079,83136,83077,Méounes-lès-Montrieux,83,,,830770000A0162,,,,,,,,,,,,,0,,,,,BR,futaies résineuses,,,1500,5.983036,43.291964
2023-1081368,2023-02-16,000001,Vente,14300,,,LA PLATRIERE,B079,83136,83077,Méounes-lès-Montrieux,83,,,830770000A0163,,,,,,,,,,,,,0,,,,,BR,futaies résineuses,,,3620,5.982643,43.290798
2023-1081368,2023-02-16,000001,Vente,14300,,,LA PLATRIERE,B079,83136,83077,Méounes-lès-Montrieux,83,,,830770000A0528,,,,,,,,,,,,,0,,,,,BR,futaies résineuses,,,1220,5.982973,43.291574
2023-1081368,2023-02-16,000001,Vente,14300,,,LA PLATRIERE,B079,83136,83077,Méounes-lès-Montrieux,83,,,830770000A0539,,,,,,,,,,,,,0,,,,,T,terres,,,3189,5.983398,43.291873
2023-1081455,2023-02-09,000001,Vente,315400,100,,LE CROS DE L ESTANG,B025,83136,83077,Méounes-lès-Montrieux,83,,,830770000C0982,,,,,,,,,,,,,0,1,Maison,102,4,AG,terrains d'agrément,,,1840,5.95549,43.276014
2023-1081455,2023-02-09,000001,Vente,315400,100,,LE CROS DE L ESTANG,B025,83136,83077,Méounes-lès-Montrieux,83,,,830770000C0982,,,,,,,,,,,,,0,1,Maison,102,4,S,sols,,,500,5.95549,43.276014
2023-1081694,2023-03-09,000001,Vente,210000,6,,LES FERRAGES,B032,83136,83077,Méounes-lès-Montrieux,83,,,830770000C1247,,,,,,,,,,,,,0,1,Maison,71,3,S,sols,,,360,5.971128,43.275974
2023-1082208,2023-03-13,000001,Vente,752950,1160,,CAPELIERE,B015,83136,83077,Méounes-lès-Montrieux,83,,,830770000C0386,,,,,,,,,,,,,0,3,Dépendance,,0,S,sols,,,445,5.95978,43.27658
2023-1082208,2023-03-13,000001,Vente,752950,1160,,CAPELIERE,B015,83136,83077,Méounes-lès-Montrieux,83,,,830770000C0386,,,,,,,,,,,,,0,1,Maison,230,5,S,sols,,,445,5.95978,43.27658
2023-1082208,2023-03-13,000001,Vente,752950,,,LE CROS DE L ESTANG,B025,83136,83077,Méounes-lès-Montrieux,83,,,830770000C0434,,,,,,,,,,,,,0,,,,,BR,futaies résineuses,,,2045,5.959431,43.276168
2023-1082208,2023-03-13,000001,Vente,752950,,,LE CROS DE L ESTANG,B025,83136,83077,Méounes-lès-Montrieux,83,,,830770000C0434,,,,,,,,,,,,,0,,,,,AB,terrains a bâtir,,,490,5.959431,43.276168
2023-1082208,2023-03-13,000001,Vente,752950,,,LE CROS DE L ESTANG,B025,83136,83077,Méounes-lès-Montrieux,83,,,830770000C0436,,,,,,,,,,,,,0,,,,,BR,futaies résineuses,,,3395,5.958389,43.275852
2023-1082208,2023-03-13,000001,Vente,752950,,,LE CROS DE L ESTANG,B025,83136,83077,Méounes-lès-Montrieux,83,,,830770000C1200,,,,,,,,,,,,,0,,,,,BR,futaies résineuses,,,5058,5.9585,43.275475
2023-1082962,2023-03-31,000001,Vente,90000,,,BIGARRA ET AGNIS,B011,83136,83077,Méounes-lès-Montrieux,83,,,830770000E0110,,,,,,,,,,,,,0,,,,,VE,vergers,OLIVE,Oliveraie ou oliviers,2710,5.954315,43.28865
2023-1082962,2023-03-31,000001,Vente,90000,,,BIGARRA ET AGNIS,B011,83136,83077,Méounes-lès-Montrieux,83,,,830770000E0111,,,,,,,,,,,,,0,,,,,BT,taillis simples,,,116980,5.956622,43.291612
2023-1082962,2023-03-31,000001,Vente,90000,3329,,BIGARRA ET AGNIS,B011,83136,83077,Méounes-lès-Montrieux,83,,,830770000E0112,,,,,,,,,,,,,0,1,Maison,32,1,S,sols,,,500,5.953956,43.291931
2023-1082962,2023-03-31,000001,Vente,90000,3329,,BIGARRA ET AGNIS,B011,83136,83077,Méounes-lès-Montrieux,83,,,830770000E0112,,,,,,,,,,,,,0,1,Maison,32,1,AG,terrains d'agrément,,,2000,5.953956,43.291931
2023-1082962,2023-03-31,000001,Vente,90000,3329,,BIGARRA ET AGNIS,B011,83136,83077,Méounes-lès-Montrieux,83,,,830770000E0112,,,,,,,,,,,,,0,1,Maison,32,1,BT,taillis simples,,,83580,5.953956,43.291931
2023-1082962,2023-03-31,000001,Vente,90000,,,BIGARRA ET AGNIS,B011,83136,83077,Méounes-lès-Montrieux,83,,,830770000E0113,,,,,,,,,,,,,0,,,,,VE,vergers,OLIVE,Oliveraie ou oliviers,3770,5.952391,43.291017
2023-1082962,2023-03-31,000001,Vente,90000,,,BIGARRA ET AGNIS,B011,83136,83077,Méounes-lès-Montrieux,83,,,830770000E0114,,,,,,,,,,,,,0,,,,,BT,taillis simples,,,2440,5.951592,43.291876
2023-1083339,2023-04-04,000001,Vente,2000,,,LES CALOTTES,B012,83136,83077,Méounes-lès-Montrieux,83,,,830770000B0412,,,,,,,,,,,,,0,,,,,P,prés,,,900,5.981998,43.261636
2023-1083745,2023-04-19,000001,Vente,739500,,,CLOS DE SAURIN,B017,83136,83077,Méounes-lès-Montrieux,83,,,830770000E0162,,,,,,,,,,,,,0,,,,,VE,vergers,OLIVE,Oliveraie ou oliviers,2290,5.974462,43.295803
2023-1083745,2023-04-19,000001,Vente,739500,,,CLOS DE SAURIN,B017,83136,83077,Méounes-lès-Montrieux,83,,,830770000E0163,,,,,,,,,,,,,0,,,,,BT,taillis simples,,,34026,5.974603,43.295928
2023-1083745,2023-04-19,000001,Vente,739500,,,PEYROUGIER,B068,83136,83077,Méounes-lès-Montrieux,83,,,830770000E0325,,,,,,,,,,,,,0,,,,,BR,futaies résineuses,,,7623,5.976591,43.294708
2023-1083745,2023-04-19,000001,Vente,739500,,,PEYROUGIER,B068,83136,83077,Méounes-lès-Montrieux,83,,,830770000E0326,,,,,,,,,,,,,0,,,,,T,terres,,,642,5.977364,43.294947
2023-1083745,2023-04-19,000001,Vente,739500,5548,,PEYROUGIER,B068,83136,83077,Méounes-lès-Montrieux,83,,,830770000E0655,,,,,,,,,,,,,0,1,Maison,234,5,S,sols,,,4893,5.977727,43.294671
2023-1083745,2023-04-19,000001,Vente,739500,5548,,PEYROUGIER,B068,83136,83077,Méounes-lès-Montrieux,83,,,830770000E0655,,,,,,,,,,,,,0,3,Dépendance,,0,S,sols,,,4893,5.977727,43.294671
2023-1083745,2023-04-19,000001,Vente,739500,5548,,PEYROUGIER,B068,83136,83077,Méounes-lès-Montrieux,83,,,830770000E0655,,,,,,,,,,,,,0,3,Dépendance,,0,S,sols,,,4893,5.977727,43.294671
2023-1084253,2023-04-27,000001,Vente,380000,,,PLANQUEISSET,B077,83136,83077,Méounes-lès-Montrieux,83,,,830770000B0066,,,,,,,,,,,,,0,,,,,L,landes,,,38,5.979114,43.271705
2023-1084253,2023-04-27,000001,Vente,380000,,,PLANQUEISSET,B077,83136,83077,Méounes-lès-Montrieux,83,,,830770000B0067,,,,,,,,,,,,,0,,,,,BR,futaies résineuses,,,5067,5.979199,43.272104
2023-1084253,2023-04-27,000001,Vente,380000,,,PLANQUEISSET,B077,83136,83077,Méounes-lès-Montrieux,83,,,830770000B0084,,,,,,,,,,,,,0,,,,,P,prés,,,560,5.977982,43.273224
2023-1084253,2023-04-27,000001,Vente,380000,5542,,PLANQUEISSET,B077,83136,83077,Méounes-lès-Montrieux,83,,,830770000B0554,,,,,,,,,,,,,0,1,Maison,59,3,T,terres,,,3830,5.978554,43.272198
2023-1084253,2023-04-27,000001,Vente,380000,5542,,PLANQUEISSET,B077,83136,83077,Méounes-lès-Montrieux,83,,,830770000B0554,,,,,,,,,,,,,0,1,Maison,59,3,S,sols,,,500,5.978554,43.272198
2023-1084253,2023-04-27,000001,Vente,380000,5542,,PLANQUEISSET,B077,83136,83077,Méounes-lès-Montrieux,83,,,830770000B0554,,,,,,,,,,,,,0,1,Maison,59,3,AG,terrains d'agrément,,,2000,5.978554,43.272198
2023-1085924,2023-06-08,000001,Vente,300000,5559,,CAPELIERE,B015,83136,83077,Méounes-lès-Montrieux,83,,,830770000C0517,,,,,,,,,,,,,0,1,Maison,80,3,S,sols,,,500,5.952452,43.272551
2023-1085924,2023-06-08,000001,Vente,300000,5559,,CAPELIERE,B015,83136,83077,Méounes-lès-Montrieux,83,,,830770000C0517,,,,,,,,,,,,,0,1,Maison,80,3,AG,terrains d'agrément,,,1360,5.952452,43.272551
2023-1086388,2023-06-10,000001,Vente,80000,5416,,RTE DE TOULON,0050,83136,83077,Méounes-lès-Montrieux,83,,,830770000F0439,,,10,,11,,12,,9,,,,4,2,Appartement,60,2,,,,,,5.97062,43.27955
2023-1086388,2023-06-10,000001,Vente,80000,5416,,RTE DE TOULON,0050,83136,83077,Méounes-lès-Montrieux,83,,,830770000F0439,,,10,,11,,12,,9,,,,4,3,Dépendance,,0,,,,,,5.97062,43.27955
2023-1086680,2023-06-15,000002,Vente,327000,5386,,LE JAS DE BARRY,B050,83136,83077,Méounes-lès-Montrieux,83,,,830770000A1052,,,,,,,,,,,,,0,3,Dépendance,,0,,,,,,5.980572,43.286438
2023-1086680,2023-06-15,000002,Vente,327000,5386,,LE JAS DE BARRY,B050,83136,83077,Méounes-lès-Montrieux,83,,,830770000A1052,,,,,,,,,,,,,0,3,Dépendance,,0,,,,,,5.980572,43.286438
2023-1086680,2023-06-15,000002,Vente,327000,5386,,LE JAS DE BARRY,B050,83136,83077,Méounes-lès-Montrieux,83,,,830770000A1052,,,,,,,,,,,,,0,1,Maison,105,3,,,,,,5.980572,43.286438
2023-1087187,2023-06-29,000001,Vente,43000,,,PLANQUEISSET,B077,83136,83077,Méounes-lès-Montrieux,83,,,830770000B0096,,,,,,,,,,,,,0,,,,,BR,futaies résineuses,,,11130,5.976427,43.272071
2023-1087187,2023-06-29,000001,Vente,43000,,,PLANQUEISSET,B077,83136,83077,Méounes-lès-Montrieux,83,,,830770000B0097,,,,,,,,,,,,,0,,,,,T,terres,,,6100,5.977948,43.272074
2023-1087187,2023-06-29,000001,Vente,43000,8,,RUE BASSE,0007,83136,83077,Méounes-lès-Montrieux,83,,,830770000F0297,,,,,,,,,,,,,0,1,Maison,24,1,S,sols,,,149,5.971206,43.279665
2023-1087843,2023-07-05,000001,Vente,310000,2895,,FARINE ORIENTALE,B030,83136,83077,Méounes-lès-Montrieux,83,,,830770000A0270,,,,,,,,,,,,,0,1,Maison,223,8,S,sols,,,500,5.991089,43.287077
2023-1087843,2023-07-05,000001,Vente,310000,2895,,FARINE ORIENTALE,B030,83136,83077,Méounes-lès-Montrieux,83,,,830770000A0270,,,,,,,,,,,,,0,3,Dépendance,,0,BT,taillis simples,,,4930,5.991089,43.287077
2023-1087843,2023-07-05,000001,Vente,310000,2895,,FARINE ORIENTALE,B030,83136,83077,Méounes-lès-Montrieux,83,,,830770000A0270,,,,,,,,,,,,,0,1,Maison,223,8,BT,taillis simples,,,4930,5.991089,43.287077
2023-1087843,2023-07-05,000001,Vente,310000,2895,,FARINE ORIENTALE,B030,83136,83077,Méounes-lès-Montrieux,83,,,830770000A0270,,,,,,,,,,,,,0,3,Dépendance,,0,S,sols,,,500,5.991089,43.287077
2023-1087843,2023-07-05,000001,Vente,310000,2895,,FARINE ORIENTALE,B030,83136,83077,Méounes-lès-Montrieux,83,,,830770000A0270,,,,,,,,,,,,,0,3,Dépendance,,0,AG,terrains d'agrément,,,2000,5.991089,43.287077
2023-1087843,2023-07-05,000001,Vente,310000,2895,,FARINE ORIENTALE,B030,83136,83077,Méounes-lès-Montrieux,83,,,830770000A0270,,,,,,,,,,,,,0,1,Maison,223,8,AG,terrains d'agrément,,,2000,5.991089,43.287077
2023-1087843,2023-07-05,000001,Vente,310000,,,PLANESSELVE OCCIDENTALE,B073,83136,83077,Méounes-lès-Montrieux,83,,,830770000A0914,,,,,,,,,,,,,0,,,,,BT,taillis simples,,,1206,5.990798,43.287822
2023-1088267,2023-07-11,000001,Vente,352500,79,,LE CROS DE L ESTANG,B025,83136,83077,Méounes-lès-Montrieux,83,,,830770000C1038,,,,,,,,,,,,,0,1,Maison,95,5,S,sols,,,500,5.953038,43.27652
2023-1088267,2023-07-11,000001,Vente,352500,79,,LE CROS DE L ESTANG,B025,83136,83077,Méounes-lès-Montrieux,83,,,830770000C1038,,,,,,,,,,,,,0,3,Dépendance,,0,S,sols,,,500,5.953038,43.27652
2023-1088267,2023-07-11,000001,Vente,352500,79,,LE CROS DE L ESTANG,B025,83136,83077,Méounes-lès-Montrieux,83,,,830770000C1038,,,,,,,,,,,,,0,3,Dépendance,,0,AG,terrains d'agrément,,,880,5.953038,43.27652
2023-1088267,2023-07-11,000001,Vente,352500,79,,LE CROS DE L ESTANG,B025,83136,83077,Méounes-lès-Montrieux,83,,,830770000C1038,,,,,,,,,,,,,0,1,Maison,95,5,AG,terrains d'agrément,,,880,5.953038,43.27652
2023-1089542,2023-08-30,000001,Vente,432000,3404,,PLANESTEL,B075,83136,83077,Méounes-lès-Montrieux,83,,,830770000E0732,,,,,,,,,,,,,0,1,Maison,104,6,AG,terrains d'agrément,,,1500,5.977966,43.306936
2023-1089542,2023-08-30,000001,Vente,432000,3404,,PLANESTEL,B075,83136,83077,Méounes-lès-Montrieux,83,,,830770000E0732,,,,,,,,,,,,,0,1,Maison,104,6,S,sols,,,500,5.977966,43.306936
2023-1090074,2023-09-06,000001,Vente,1,,,LES FERRAGES,B032,83136,83077,Méounes-lès-Montrieux,83,,,830770000C1167,,,,,,,,,,,,,0,,,,,BR,futaies résineuses,,,322,5.96761,43.27637
2023-1090114,2023-09-01,000001,Vente,570000,5228,,LA LONE,B053,83136,83077,Méounes-lès-Montrieux,83,,,830770000E0069,,,,,,,,,,,,,0,1,Maison,120,4,L,landes,,,1590,5.975113,43.285579
2023-1090114,2023-09-01,000001,Vente,570000,,,PEYFERRIER ET LA SERVI,B066,83136,83077,Méounes-lès-Montrieux,83,,,830770000E0383,,,,,,,,,,,,,0,,,,,P,prés,,,55,5.974661,43.28548
2023-1090220,2023-09-07,000001,Vente,356670,1,,ALL DES PINS,0041,83136,83077,Méounes-lès-Montrieux,83,,,830770000C0462,,,,,,,,,,,,,0,3,Dépendance,,0,S,sols,,,500,5.951711,43.273337
2023-1090220,2023-09-07,000001,Vente,356670,1,,ALL DES PINS,0041,83136,83077,Méounes-lès-Montrieux,83,,,830770000C0462,,,,,,,,,,,,,0,1,Maison,82,4,S,sols,,,500,5.951711,43.273337
2023-1090220,2023-09-07,000001,Vente,356670,1,,ALL DES PINS,0041,83136,83077,Méounes-lès-Montrieux,83,,,830770000C0462,,,,,,,,,,,,,0,3,Dépendance,,0,AG,terrains d'agrément,,,796,5.951711,43.273337
2023-1090220,2023-09-07,000001,Vente,356670,1,,ALL DES PINS,0041,83136,83077,Méounes-lès-Montrieux,83,,,830770000C0462,,,,,,,,,,,,,0,1,Maison,82,4,AG,terrains d'agrément,,,796,5.951711,43.273337
2023-1090835,2023-09-20,000001,Vente,251800,,,LE PLAN,B070,83136,83077,Méounes-lès-Montrieux,83,,,830770000E0296,,,,,,,,,,,,,0,,,,,BR,futaies résineuses,,,16540,5.98589,43.302978
2023-1090835,2023-09-20,000001,Vente,251800,5357,,LE PLAN,B070,83136,83077,Méounes-lès-Montrieux,83,,,830770000E0297,,,,,,,,,,,,,0,1,Maison,34,3,S,sols,,,25,5.986219,43.302629
2023-1090835,2023-09-20,000001,Vente,251800,,,LE PLAN,B070,83136,83077,Méounes-lès-Montrieux,83,,,830770000E0298,,,,,,,,,,,,,0,,,,,VI,vignes,,,5040,5.986671,43.302944
2023-1092145,2023-10-18,000001,Vente,200000,1336,,PEIROOUBARET,B064,83136,83077,Méounes-lès-Montrieux,83,,,830770000E0365,,,,,,,,,,,,,0,1,Maison,72,4,AG,terrains d'agrément,,,2000,5.979652,43.290207
2023-1092145,2023-10-18,000001,Vente,200000,1336,,PEIROOUBARET,B064,83136,83077,Méounes-lès-Montrieux,83,,,830770000E0365,,,,,,,,,,,,,0,1,Maison,72,4,BR,futaies résineuses,,,1980,5.979652,43.290207
2023-1092145,2023-10-18,000001,Vente,200000,1336,,PEIROOUBARET,B064,83136,83077,Méounes-lès-Montrieux,83,,,830770000E0365,,,,,,,,,,,,,0,3,Dépendance,,0,BR,futaies résineuses,,,1980,5.979652,43.290207
2023-1092145,2023-10-18,000001,Vente,200000,1336,,PEIROOUBARET,B064,83136,83077,Méounes-lès-Montrieux,83,,,830770000E0365,,,,,,,,,,,,,0,3,Dépendance,,0,AG,terrains d'agrément,,,2000,5.979652,43.290207
2023-1092145,2023-10-18,000001,Vente,200000,1336,,PEIROOUBARET,B064,83136,83077,Méounes-lès-Montrieux,83,,,830770000E0365,,,,,,,,,,,,,0,1,Maison,72,4,S,sols,,,500,5.979652,43.290207
2023-1092145,2023-10-18,000001,Vente,200000,1336,,PEIROOUBARET,B064,83136,83077,Méounes-lès-Montrieux,83,,,830770000E0365,,,,,,,,,,,,,0,3,Dépendance,,0,S,sols,,,500,5.979652,43.290207
2023-1093072,2023-11-09,000001,Vente,430000,9,,MTE DES ANCIENNES ECOLE,0014,83136,83077,Méounes-lès-Montrieux,83,,,830770000F0050,,,,,,,,,,,,,0,3,Dépendance,,0,S,sols,,,115,5.970219,43.281055
2023-1093072,2023-11-09,000001,Vente,430000,9,,MTE DES ANCIENNES ECOLE,0014,83136,83077,Méounes-lès-Montrieux,83,,,830770000F0050,,,,,,,,,,,,,0,2,Appartement,45,2,S,sols,,,115,5.970219,43.281055
2023-1093072,2023-11-09,000001,Vente,430000,9,,MTE DES ANCIENNES ECOLE,0014,83136,83077,Méounes-lès-Montrieux,83,,,830770000F0050,,,,,,,,,,,,,0,3,Dépendance,,0,S,sols,,,115,5.970219,43.281055
2023-1093072,2023-11-09,000001,Vente,430000,9,,MTE DES ANCIENNES ECOLE,0014,83136,83077,Méounes-lès-Montrieux,83,,,830770000F0050,,,,,,,,,,,,,0,2,Appartement,23,1,S,sols,,,115,5.970219,43.281055
2023-1093072,2023-11-09,000001,Vente,430000,9,,MTE DES ANCIENNES ECOLE,0014,83136,83077,Méounes-lès-Montrieux,83,,,830770000F0050,,,,,,,,,,,,,0,2,Appartement,45,1,S,sols,,,115,5.970219,43.281055
2023-1093072,2023-11-09,000001,Vente,430000,9,,MTE DES ANCIENNES ECOLE,0014,83136,83077,Méounes-lès-Montrieux,83,,,830770000F0050,,,,,,,,,,,,,0,2,Appartement,35,0,S,sols,,,115,5.970219,43.281055
2023-1093072,2023-11-09,000001,Vente,430000,9,,MTE DES ANCIENNES ECOLE,0014,83136,83077,Méounes-lès-Montrieux,83,,,830770000F0050,,,,,,,,,,,,,0,2,Appartement,28,0,S,sols,,,115,5.970219,43.281055
2023-1093072,2023-11-09,000001,Vente,430000,9,,MTE DES ANCIENNES ECOLE,0014,83136,83077,Méounes-lès-Montrieux,83,,,830770000F0050,,,,,,,,,,,,,0,2,Appartement,33,0,S,sols,,,115,5.970219,43.281055
2023-1093072,2023-11-09,000001,Vente,430000,9,,MTE DES ANCIENNES ECOLE,0014,83136,83077,Méounes-lès-Montrieux,83,,,830770000F0050,,,,,,,,,,,,,0,2,Appartement,24,1,S,sols,,,115,5.970219,43.281055
2023-1093275,2023-11-29,000001,Vente,90000,,,LE VILLAGE,B092,83136,83077,Méounes-lès-Montrieux,83,,,830770000F0361,,,,,,,,,,,,,0,,,,,J,jardins,POTAG,Jardin potager,600,5.970043,43.281603
2023-1093275,2023-11-29,000001,Vente,90000,19,,GR GRANDE RUE,0017,83136,83077,Méounes-lès-Montrieux,83,,,830770000F0364,,,,,,,,,,,,,0,1,Maison,91,4,S,sols,,,240,5.970372,43.281463
2023-1093807,2023-11-27,000001,Vente,450000,,,LE COLLET DE SAINT LAZARE,B019,83136,83077,Méounes-lès-Montrieux,83,,,830770000C0141,,,,,,,,,,,,,0,,,,,AG,terrains d'agrément,,,930,5.964082,43.27601
2023-1093807,2023-11-27,000001,Vente,450000,,,LE COLLET DE SAINT LAZARE,B019,83136,83077,Méounes-lès-Montrieux,83,,,830770000C0141,,,,,,,,,,,,,0,,,,,S,sols,,,500,5.964082,43.27601
2023-1093807,2023-11-27,000001,Vente,450000,1965,,AU MIDI DE SAINT LAZARE,B058,83136,83077,Méounes-lès-Montrieux,83,,,830770000C0142,,,,,,,,,,,,,0,3,Dépendance,,0,L,landes,,,3227,5.96446,43.276479
2023-1093807,2023-11-27,000001,Vente,450000,1965,,AU MIDI DE SAINT LAZARE,B058,83136,83077,Méounes-lès-Montrieux,83,,,830770000C0142,,,,,,,,,,,,,0,1,Maison,148,5,L,landes,,,3227,5.96446,43.276479
2023-1093807,2023-11-27,000001,Vente,450000,1965,,AU MIDI DE SAINT LAZARE,B058,83136,83077,Méounes-lès-Montrieux,83,,,830770000C0142,,,,,,,,,,,,,0,1,Maison,148,5,S,sols,,,500,5.96446,43.276479
2023-1093807,2023-11-27,000001,Vente,450000,1965,,AU MIDI DE SAINT LAZARE,B058,83136,83077,Méounes-lès-Montrieux,83,,,830770000C0142,,,,,,,,,,,,,0,3,Dépendance,,0,S,sols,,,500,5.96446,43.276479
2023-1093807,2023-11-27,000001,Vente,450000,1965,,AU MIDI DE SAINT LAZARE,B058,83136,83077,Méounes-lès-Montrieux,83,,,830770000C0142,,,,,,,,,,,,,0,3,Dépendance,,0,S,sols,,,500,5.96446,43.276479