id_mutation,date_mutation,numero_disposition,nature_mutation,valeur_fonciere,adresse_numero,adresse_suffixe,adresse_nom_voie,adresse_code_voie,code_postal,code_commune,nom_commune,code_departement,ancien_code_commune,ancien_nom_commune,id_parcelle,ancien_id_parcelle,numero_volume,lot1_numero,lot1_surface_carrez,lot2_numero,lot2_surface_carrez,lot3_numero,lot3_surface_carrez,lot4_numero,lot4_surface_carrez,lot5_numero,lot5_surface_carrez,nombre_lots,code_type_local,type_local,surface_reelle_bati,nombre_pieces_principales,code_nature_culture,nature_culture,code_nature_culture_speciale,nature_culture_speciale,surface_terrain,longitude,latitude
2023-1079242,2023-01-05,000001,Vente,570000,9001,,RES SAINT ANTOINE,A050,83990,83119,Saint-Tropez,83,,,83119000AI0335,,,24,,72,,,,,,,,2,2,Appartement,97,6,,,,,,6.635919,43.268018
2023-1079242,2023-01-05,000001,Vente,570000,9001,,RES SAINT ANTOINE,A050,83990,83119,Saint-Tropez,83,,,83119000AI0335,,,24,,72,,,,,,,,2,3,Dépendance,,0,,,,,,6.635919,43.268018
2023-1079242,2023-01-05,000001,Vente,570000,9001,,RES SAINT ANTOINE,A050,83990,83119,Saint-Tropez,83,,,83119000AI0335,,,408,,,,,,,,,,1,3,Dépendance,,0,,,,,,6.635919,43.268018
2023-1079242,2023-01-05,000001,Vente,570000,9001,,RES SAINT ANTOINE,A050,83990,83119,Saint-Tropez,83,,,83119000AI0335,,,24,,72,,,,,,,,2,3,Dépendance,,0,,,,,,6.635919,43.268018
2023-1079548,2023-01-11,000001,Vente,315789,9001,,ENS RESIDENTIEL DU BAILLY,A005,83990,83119,Saint-Tropez,83,,,83119000AH0162,,,40,,,,,,,,,,1,2,Appartement,32,1,,,,,,6.632737,43.266985
2023-1079579,2023-01-09,000001,Vente,582000,9001,,SUPER EDEN,A053,83990,83119,Saint-Tropez,83,,,83119000AI0014,,,336,,363,,,,,,,,2,2,Appartement,73,3,,,,,,6.634009,43.266636
2023-1079579,2023-01-09,000001,Vente,582000,9001,,SUPER EDEN,A053,83990,83119,Saint-Tropez,83,,,83119000AI0014,,,336,,363,,,,,,,,2,3,Dépendance,,0,,,,,,6.634009,43.266636
2023-1079579,2023-01-09,000001,Vente,582000,9001,,SUPER EDEN,A053,83990,83119,Saint-Tropez,83,,,83119000AI0014,,,336,,363,,,,,,,,2,3,Dépendance,,0,,,,,,6.634009,43.266636
2023-1079579,2023-01-09,000001,Vente,582000,9001,,SUPER EDEN,A053,83990,83119,Saint-Tropez,83,,,83119000AI0014,,,550,,,,,,,,,,1,3,Dépendance,,0,,,,,,6.634009,43.266636
2023-1079605,2023-01-12,000001,Vente,400000,37,,CHE DES SALINS,1241,83990,83119,Saint-Tropez,83,,,83119000AM0114,,,15,,,,,,,,,,1,3,Dépendance,,0,,,,,,6.654491,43.266597
2023-1079605,2023-01-12,000001,Vente,400000,37,,CHE DES SALINS,1241,83990,83119,Saint-Tropez,83,,,83119000AM0114,,,7,,,,,,,,,,1,3,Dépendance,,0,,,,,,6.654491,43.266597
2023-1079605,2023-01-12,000001,Vente,400000,37,,CHE DES SALINS,1241,83990,83119,Saint-Tropez,83,,,83119000AM0114,,,30,,31,,,,,,,,2,2,Appartement,80,3,,,,,,6.654491,43.266597
2023-1079646,2023-01-10,000001,Vente,130000,4,,AV GENERAL LECLERC,0490,83990,83119,Saint-Tropez,83,,,83119000AE0095,,,14,,,,,,,,,,1,3,Dépendance,,0,,,,,,6.634307,43.268893
2023-1079704,2023-01-13,000001,Vente,625000,3,,RUE DU FOUR,0420,83990,83119,Saint-Tropez,83,,,83119000AA0077,,,,,,,,,,,,,0,2,Appartement,30,1,S,sols,,,32,6.640054,43.273398
2023-1079704,2023-01-13,000001,Vente,625000,3,,RUE DU FOUR,0420,83990,83119,Saint-Tropez,83,,,83119000AA0077,,,,,,,,,,,,,0,2,Appartement,20,1,S,sols,,,32,6.640054,43.273398
2023-1079704,2023-01-13,000001,Vente,625000,3,,RUE DU FOUR,0420,83990,83119,Saint-Tropez,83,,,83119000AA0077,,,,,,,,,,,,,0,2,Appartement,30,1,S,sols,,,32,6.640054,43.273398
2023-1079704,2023-01-13,000002,Vente,625000,1,,RUE DE LA PONCHE,0930,83990,83119,Saint-Tropez,83,,,83119000AA0081,,,15,,,,,,,,,,1,3,Dépendance,,0,,,,,,6.640028,43.273314
2023-1079704,2023-01-13,000002,Vente,625000,3,,RUE DE LA PONCHE,0930,83990,83119,Saint-Tropez,83,,,83119000AA0082,,,1,,,,,,,,,,1,3,Dépendance,,0,,,,,,6.640127,43.273323
2023-1079704,2023-01-13,000002,Vente,625000,3,,RUE DU FOUR,0420,83990,83119,Saint-Tropez,83,,,83119000AA0082,,,3,,,,,,,,,,1,4,Local industriel. commercial ou assimilé,80,0,,,,,,6.640127,43.273323
2023-1079823,2023-01-05,000001,Vente,355000,9001,,SUPER EDEN,A053,83990,83119,Saint-Tropez,83,,,83119000AI0014,,,579,,,,,,,,,,1,3,Dépendance,,0,,,,,,6.634009,43.266636
2023-1079823,2023-01-05,000001,Vente,355000,9001,,SUPER EDEN,A053,83990,83119,Saint-Tropez,83,,,83119000AI0014,,,105,,144,40.11,,,,,,,2,2,Appartement,38,2,,,,,,6.634009,43.266636
2023-1079823,2023-01-05,000001,Vente,355000,9001,,SUPER EDEN,A053,83990,83119,Saint-Tropez,83,,,83119000AI0014,,,105,,144,40.11,,,,,,,2,3,Dépendance,,0,,,,,,6.634009,43.266636
2023-1079823,2023-01-05,000001,Vente,355000,9001,,SUPER EDEN,A053,83990,83119,Saint-Tropez,83,,,83119000AI0014,,,105,,144,40.11,,,,,,,2,3,Dépendance,,0,,,,,,6.634009,43.266636
2023-1079828,2023-01-06,000001,Vente,3365000,7,,CHE DE STE ANNE,1208,83990,83119,Saint-Tropez,83,,,83119000AK0047,,,,,,,,,,,,,0,3,Dépendance,,0,S,sols,,,980,6.641176,43.266105
2023-1079828,2023-01-06,000001,Vente,3365000,7,,CHE DE STE ANNE,1208,83990,83119,Saint-Tropez,83,,,83119000AK0047,,,,,,,,,,,,,0,1,Maison,130,4,S,sols,,,980,6.641176,43.266105
2023-1079829,2023-01-06,000001,Vente,1300000,9,,RUE DE L'ORMEAU,0830,83990,83119,Saint-Tropez,83,,,83119000AA0332,,,,,,,,,,,,,0,1,Maison,89,3,S,sols,,,42,6.64077,43.272301
2023-1079950,2023-01-04,000001,Vente,4150000,136,,CHE DE LA BELLE ISNARDE,0118,83990,83119,Saint-Tropez,83,,,83119000BE0174,,,,,,,,,,,,,0,3,Dépendance,,0,S,sols,,,1022,6.652453,43.257428
2023-1079950,2023-01-04,000001,Vente,4150000,136,,CHE DE LA BELLE ISNARDE,0118,83990,83119,Saint-Tropez,83,,,83119000BE0174,,,,,,,,,,,,,0,3,Dépendance,,0,VI,vignes,,,2264,6.652453,43.257428
2023-1079950,2023-01-04,000001,Vente,4150000,136,,CHE DE LA BELLE ISNARDE,0118,83990,83119,Saint-Tropez,83,,,83119000BE0174,,,,,,,,,,,,,0,1,Maison,251,8,S,sols,,,1022,6.652453,43.257428
2023-1079950,2023-01-04,000001,Vente,4150000,136,,CHE DE LA BELLE ISNARDE,0118,83990,83119,Saint-Tropez,83,,,83119000BE0174,,,,,,,,,,,,,0,1,Maison,251,8,VI,vignes,,,2264,6.652453,43.257428
2023-1079969,2023-01-05,000001,Vente,1120000,8,,RUE DE L'ORMEAU,0830,83990,83119,Saint-Tropez,83,,,83119000AA0335,,,2,,,,,,,,,,1,3,Dépendance,,0,,,,,,6.64055,43.27232
2023-1079969,2023-01-05,000001,Vente,1120000,8,,RUE DE L'ORMEAU,0830,83990,83119,Saint-Tropez,83,,,83119000AA0335,,,3,,4,,5,,,,,,3,2,Appartement,54,2,,,,,,6.64055,43.27232
2023-1079969,2023-01-05,000001,Vente,1120000,8,,RUE DE L'ORMEAU,0830,83990,83119,Saint-Tropez,83,,,83119000AA0335,,,2,,,,,,,,,,1,2,Appartement,20,1,,,,,,6.64055,43.27232
2023-1079969,2023-01-05,000001,Vente,1120000,8,,RUE DE L'ORMEAU,0830,83990,83119,Saint-Tropez,83,,,83119000AA0335,,,3,,4,,5,,,,,,3,3,Dépendance,,0,,,,,,6.64055,43.27232
2023-1080220,2023-01-26,000001,Vente,8730000,3,,IMP DES CONQUETTES,0330,83990,83119,Saint-Tropez,83,,,83119000AC0241,,,,,,,,,,,,,0,3,Dépendance,,0,S,sols,,,633,6.638418,43.269179
2023-1080220,2023-01-26,000001,Vente,8730000,3,,IMP DES CONQUETTES,0330,83990,83119,Saint-Tropez,83,,,83119000AC0241,,,,,,,,,,,,,0,2,Appartement,40,2,S,sols,,,633,6.638418,43.269179
2023-1080220,2023-01-26,000001,Vente,8730000,3,,IMP DES CONQUETTES,0330,83990,83119,Saint-Tropez,83,,,83119000AC0241,,,,,,,,,,,,,0,2,Appartement,50,2,S,sols,,,633,6.638418,43.269179
2023-1080220,2023-01-26,000001,Vente,8730000,3,,IMP DES CONQUETTES,0330,83990,83119,Saint-Tropez,83,,,83119000AC0241,,,,,,,,,,,,,0,2,Appartement,80,2,S,sols,,,633,6.638418,43.269179
2023-1080220,2023-01-26,000001,Vente,8730000,3,,IMP DES CONQUETTES,0330,83990,83119,Saint-Tropez,83,,,83119000AC0241,,,,,,,,,,,,,0,3,Dépendance,,0,S,sols,,,633,6.638418,43.269179
2023-1080220,2023-01-26,000001,Vente,8730000,3,,IMP DES CONQUETTES,0330,83990,83119,Saint-Tropez,83,,,83119000AC0241,,,,,,,,,,,,,0,3,Dépendance,,0,S,sols,,,633,6.638418,43.269179
2023-1080220,2023-01-26,000001,Vente,8730000,3,,IMP DES CONQUETTES,0330,83990,83119,Saint-Tropez,83,,,83119000AC0241,,,,,,,,,,,,,0,2,Appartement,50,2,S,sols,,,633,6.638418,43.269179
2023-1080220,2023-01-26,000001,Vente,8730000,3,,IMP DES CONQUETTES,0330,83990,83119,Saint-Tropez,83,,,83119000AC0241,,,,,,,,,,,,,0,3,Dépendance,,0,S,sols,,,633,6.638418,43.269179
2023-1080220,2023-01-26,000001,Vente,8730000,3,,IMP DES CONQUETTES,0330,83990,83119,Saint-Tropez,83,,,83119000AC0241,,,,,,,,,,,,,0,3,Dépendance,,0,S,sols,,,633,6.638418,43.269179
2023-1080220,2023-01-26,000001,Vente,8730000,3,,IMP DES CONQUETTES,0330,83990,83119,Saint-Tropez,83,,,83119000AC0241,,,,,,,,,,,,,0,3,Dépendance,,0,S,sols,,,633,6.638418,43.269179
2023-1080220,2023-01-26,000001,Vente,8730000,3,,IMP DES CONQUETTES,0330,83990,83119,Saint-Tropez,83,,,83119000AC0241,,,,,,,,,,,,,0,4,Local industriel. commercial ou assimilé,41,0,S,sols,,,633,6.638418,43.269179
2023-1080220,2023-01-26,000001,Vente,8730000,3,,IMP DES CONQUETTES,0330,83990,83119,Saint-Tropez,83,,,83119000AC0241,,,,,,,,,,,,,0,3,Dépendance,,0,S,sols,,,633,6.638418,43.269179
2023-1080220,2023-01-26,000001,Vente,8730000,3,,IMP DES CONQUETTES,0330,83990,83119,Saint-Tropez,83,,,83119000AC0241,,,,,,,,,,,,,0,2,Appartement,80,3,S,sols,,,633,6.638418,43.269179
2023-1080220,2023-01-26,000001,Vente,8730000,3,,IMP DES CONQUETTES,0330,83990,83119,Saint-Tropez,83,,,83119000AC0241,,,,,,,,,,,,,0,3,Dépendance,,0,S,sols,,,633,6.638418,43.269179
2023-1080220,2023-01-26,000001,Vente,8730000,3,,IMP DES CONQUETTES,0330,83990,83119,Saint-Tropez,83,,,83119000AC0241,,,,,,,,,,,,,0,2,Appartement,55,3,S,sols,,,633,6.638418,43.269179
2023-1080220,2023-01-26,000001,Vente,8730000,3,,IMP DES CONQUETTES,0330,83990,83119,Saint-Tropez,83,,,83119000AC0241,,,,,,,,,,,,,0,2,Appartement,35,1,S,sols,,,633,6.638418,43.269179
2023-1080220,2023-01-26,000001,Vente,8730000,3,,IMP DES CONQUETTES,0330,83990,83119,Saint-Tropez,83,,,83119000AC0241,,,,,,,,,,,,,0,3,Dépendance,,0,S,sols,,,633,6.638418,43.269179
2023-1080220,2023-01-26,000001,Vente,8730000,3,,IMP DES CONQUETTES,0330,83990,83119,Saint-Tropez,83,,,83119000AC0241,,,,,,,,,,,,,0,2,Appartement,80,3,S,sols,,,633,6.638418,43.269179
2023-1080220,2023-01-26,000001,Vente,8730000,3,,IMP DES CONQUETTES,0330,83990,83119,Saint-Tropez,83,,,83119000AC0241,,,,,,,,,,,,,0,2,Appartement,10,1,S,sols,,,633,6.638418,43.269179
2023-1080220,2023-01-26,000001,Vente,8730000,3,,IMP DES CONQUETTES,0330,83990,83119,Saint-Tropez,83,,,83119000AC0241,,,,,,,,,,,,,0,2,Appartement,35,2,S,sols,,,633,6.638418,43.269179
2023-1080220,2023-01-26,000001,Vente,8730000,3,,IMP DES CONQUETTES,0330,83990,83119,Saint-Tropez,83,,,83119000AC0241,,,,,,,,,,,,,0,2,Appartement,80,3,S,sols,,,633,6.638418,43.269179
2023-1080220,2023-01-26,000001,Vente,8730000,3,,IMP DES CONQUETTES,0330,83990,83119,Saint-Tropez,83,,,83119000AC0241,,,,,,,,,,,,,0,2,Appartement,80,3,S,sols,,,633,6.638418,43.269179
2023-1080254,2023-01-16,000002,Vente,8500000,1,B,CHE DE STE ANNE,1208,83990,83119,Saint-Tropez,83,,,83119000AK0563,,,,,,,,,,,,,0,1,Maison,150,3,S,sols,,,508,6.640996,43.266621
2023-1080254,2023-01-16,000002,Vente,8500000,1,,CHE DE STE ANNE,1208,83990,83119,Saint-Tropez,83,,,83119000AK0564,,,,,,,,,,,,,0,,,,,S,sols,,,2,6.640856,43.266654
2023-1080254,2023-01-16,000002,Vente,8500000,1,T,CHE DE STE ANNE,1208,83990,83119,Saint-Tropez,83,,,83119000AK0565,,,,,,,,,,,,,0,1,Maison,140,4,,,,,,6.641519,43.266491
2023-1080254,2023-01-16,000002,Vente,8500000,1,T,CHE DE STE ANNE,1208,83990,83119,Saint-Tropez,83,,,83119000AK0565,,,,,,,,,,,,,0,1,Maison,40,2,,,,,,6.641519,43.266491
2023-1080284,2023-01-26,000001,Vente,302500,4,,RUE SAINT PIERRE,1180,83990,83119,Saint-Tropez,83,,,83119000AA0078,,,3,,,,,,,,,,1,2,Appartement,20,1,,,,,,6.640035,43.273432
2023-1080284,2023-01-26,000001,Vente,302500,4,,RUE SAINT PIERRE,1180,83990,83119,Saint-Tropez,83,,,83119000AA0078,,,2,,,,,,,,,,1,2,Appartement,20,1,,,,,,6.640035,43.273432
2023-1080284,2023-01-26,000001,Vente,302500,4,,RUE SAINT PIERRE,1180,83990,83119,Saint-Tropez,83,,,83119000AA0078,,,1,,,,,,,,,,1,2,Appartement,14,1,,,,,,6.640035,43.273432
2023-1080387,2023-01-16,000001,Vente,6000000,1,T,CHE DE STE ANNE,1208,83990,83119,Saint-Tropez,83,,,83119000AK0565,,,,,,,,,,,,,0,1,Maison,40,2,,,,,,6.641519,43.266491
2023-1080387,2023-01-16,000001,Vente,6000000,1,T,CHE DE STE ANNE,1208,83990,83119,Saint-Tropez,83,,,83119000AK0565,,,,,,,,,,,,,0,1,Maison,140,4,,,,,,6.641519,43.266491
2023-1080418,2023-01-30,000001,Vente,2600000,6,B,AV DU PONANT,0931,83990,83119,Saint-Tropez,83,,,83119000AZ0060,,,,,,,,,,,,,0,1,Maison,113,3,AG,terrains d'agrément,,,1182,6.686207,43.254162
2023-1080418,2023-01-30,000001,Vente,2600000,6,B,AV DU PONANT,0931,83990,83119,Saint-Tropez,83,,,83119000AZ0060,,,,,,,,,,,,,0,1,Maison,113,3,S,sols,,,92,6.686207,43.254162
2023-1080501,2023-01-19,000001,Vente,480000,7,,RUE DU FOUR,0420,83990,83119,Saint-Tropez,83,,,83119000AA0076,,,13,35.23,,,,,,,,,1,2,Appartement,37,2,,,,,,6.640115,43.273435
2023-1080523,2023-01-19,000001,Vente,960000,5,,AV PAUL ROUSSEL,0858,83990,83119,Saint-Tropez,83,,,83119000AI0448,,,115,,,,,,,,,,1,3,Dépendance,,0,,,,,,6.638802,43.268778
2023-1080523,2023-01-19,000001,Vente,960000,5,,AV PAUL ROUSSEL,0858,83990,83119,Saint-Tropez,83,,,83119000AI0448,,,105,,,,,,,,,,1,3,Dépendance,,0,,,,,,6.638802,43.268778
2023-1080523,2023-01-19,000001,Vente,960000,5,,AV PAUL ROUSSEL,0858,83990,83119,Saint-Tropez,83,,,83119000AI0448,,,17,79.57,,,,,,,,,1,2,Appartement,81,3,,,,,,6.638802,43.268778
2023-1080582,2023-01-11,000001,Vente,396280,59,,AV GENERAL LECLERC,0490,83990,83119,Saint-Tropez,83,,,83119000AH0158,,,109,,139,,,,,,,,2,2,Appartement,38,2,,,,,,6.631593,43.265933
2023-1080583,2023-01-19,000001,Vente,1850000,26,,RUE DU CEPOUN SAN MARTIN,0247,83990,83119,Saint-Tropez,83,,,83119000AA0263,,,24,,27,,,,,,,,2,2,Appartement,90,3,,,,,,6.639245,43.272555
2023-1080665,2023-01-24,000001,Vente,500000,9001,,RES MOULIN BLANC,A036,83990,83119,Saint-Tropez,83,,,83119000AL0158,,,117,,19,73.9,,,,,,,2,3,Dépendance,,0,,,,,,6.650322,43.267965
2023-1080665,2023-01-24,000001,Vente,500000,9001,,RES MOULIN BLANC,A036,83990,83119,Saint-Tropez,83,,,83119000AL0158,,,261,,,,,,,,,,1,3,Dépendance,,0,,,,,,6.650322,43.267965
2023-1080665,2023-01-24,000001,Vente,500000,9001,,RES MOULIN BLANC,A036,83990,83119,Saint-Tropez,83,,,83119000AL0158,,,117,,19,73.9,,,,,,,2,2,Appartement,73,3,,,,,,6.650322,43.267965
2023-1080666,2023-01-27,000001,Vente,545000,9001,,RES SAINT ANTOINE,A050,83990,83119,Saint-Tropez,83,,,83119000AI0335,,,37,62.44,85,,,,,,,,2,3,Dépendance,,0,,,,,,6.635919,43.268018
2023-1080666,2023-01-27,000001,Vente,545000,9001,,RES SAINT ANTOINE,A050,83990,83119,Saint-Tropez,83,,,83119000AI0335,,,37,62.44,85,,,,,,,,2,2,Appartement,60,3,,,,,,6.635919,43.268018
2023-1080666,2023-01-27,000001,Vente,545000,9001,,RES SAINT ANTOINE,A050,83990,83119,Saint-Tropez,83,,,83119000AI0335,,,37,62.44,85,,,,,,,,2,3,Dépendance,,0,,,,,,6.635919,43.268018
2023-1080666,2023-01-27,000001,Vente,545000,9001,,RES SAINT ANTOINE,A050,83990,83119,Saint-Tropez,83,,,83119000AI0335,,,421,,,,,,,,,,1,3,Dépendance,,0,,,,,,6.635919,43.268018
2023-1080667,2023-01-23,000001,Vente,80000,9001,,LA FLORIDA,A022,83990,83119,Saint-Tropez,83,,,83119000AI0018,,,325,20.03,,,,,,,,,1,3,Dépendance,,0,,,,,,6.635537,43.266564
2023-1080669,2023-01-24,000001,Vente,2000000,1,,RUE GEORGES CLEMENCEAU,0500,83990,83119,Saint-Tropez,83,,,83119000AB0014,,,9,81.44,,,,,,,,,1,2,Appartement,79,4,,,,,,6.638934,43.271241
2023-1080770,2023-02-08,000001,Vente,390000,9001,,IMM LES CAPUCINS,A015,83990,83119,Saint-Tropez,83,,,83119000AK0043,,,13,,,,,,,,,,1,2,Appartement,60,4,,,,,,6.64249,43.266665
2023-1080770,2023-02-08,000001,Vente,390000,9001,,IMM LES CAPUCINS,A015,83990,83119,Saint-Tropez,83,,,83119000AK0043,,,13,,,,,,,,,,1,3,Dépendance,,0,,,,,,6.64249,43.266665
2023-1080787,2023-02-06,000001,Vente,591940,9001,,ENS RESIDENTIEL DU BAILLY,A005,83990,83119,Saint-Tropez,83,,,83119000AH0162,,,63,,,,,,,,,,1,2,Appartement,52,2,,,,,,6.632737,43.266985
2023-1080787,2023-02-06,000001,Vente,591940,9001,,ENS RESIDENTIEL DU BAILLY,A005,83990,83119,Saint-Tropez,83,,,83119000AH0162,,,160,,,,,,,,,,1,3,Dépendance,,0,,,,,,6.632737,43.266985
2023-1080858,2023-01-24,000001,Vente,930000,9001,,RES ESPACE DES LICES,A023,83990,83119,Saint-Tropez,83,,,83119000AC0312,,,88,,,,,,,,,,1,3,Dépendance,,0,,,,,,6.638756,43.269224
2023-1080858,2023-01-24,000001,Vente,930000,15,A,IMP DES CONQUETTES,0330,83990,83119,Saint-Tropez,83,,,83119000AC0312,,,134,,,,,,,,,,1,3,Dépendance,,0,,,,,,6.638756,43.269224
2023-1080898,2023-02-09,000001,Vente,16201000,6,,RUE DOC BOUTIN,0355,83990,83119,Saint-Tropez,83,,,83119000AC0053,,,,,,,,,,,,,0,4,Local industriel. commercial ou assimilé,141,0,S,sols,,,95,6.637156,43.270178
2023-1080898,2023-02-09,000001,Vente,16201000,6,,RUE DOC BOUTIN,0355,83990,83119,Saint-Tropez,83,,,83119000AC0053,,,,,,,,,,,,,0,2,Appartement,54,3,S,sols,,,95,6.637156,43.270178
2023-1080898,2023-02-09,000001,Vente,16201000,6,,RUE DOC BOUTIN,0355,83990,83119,Saint-Tropez,83,,,83119000AC0053,,,,,,,,,,,,,0,2,Appartement,33,4,S,sols,,,95,6.637156,43.270178
2023-1080898,2023-02-09,000001,Vente,16201000,8,,RUE DOC BOUTIN,0355,83990,83119,Saint-Tropez,83,,,83119000AC0054,,,,,,,,,,,,,0,,,,,S,sols,,,160,6.637241,43.270128
2023-1080898,2023-02-09,000001,Vente,16201000,10,,RUE DOC BOUTIN,0355,83990,83119,Saint-Tropez,83,,,83119000AC0055,,,,,,,,,,,,,0,1,Maison,33,2,S,sols,,,126,6.63735,43.270035
2023-1080934,2023-02-09,000001,Vente,22000000,9035,,LA MOUTTE,B030,83990,83119,Saint-Tropez,83,,,83119000AW0106,,,,,,,,,,,,,0,1,Maison,275,6,AG,terrains d'agrément,,,4877,6.693589,43.266994
2023-1080934,2023-02-09,000001,Vente,22000000,9035,,LA MOUTTE,B030,83990,83119,Saint-Tropez,83,,,83119000AW0106,,,,,,,,,,,,,0,1,Maison,275,6,S,sols,,,266,6.693589,43.266994
2023-1080934,2023-02-09,000001,Vente,22000000,9035,,LA MOUTTE,B030,83990,83119,Saint-Tropez,83,,,83119000AW0106,,,,,,,,,,,,,0,3,Dépendance,,0,S,sols,,,266,6.693589,43.266994
2023-1080934,2023-02-09,000001,Vente,22000000,9035,,LA MOUTTE,B030,83990,83119,Saint-Tropez,83,,,83119000AW0106,,,,,,,,,,,,,0,3,Dépendance,,0,AG,terrains d'agrément,,,4877,6.693589,43.266994
2023-1081103,2023-02-10,000001,Vente,1150000,9,,RUE CAVAILLON,0240,83990,83119,Saint-Tropez,83,,,83119000AA0109,,,2,,3,,,,,,,,2,1,Maison,67,4,,,,,,6.641345,43.273025
2023-1081134,2023-01-31,000001,Vente,36925000,,,BELLE VUE,B007,83990,83119,Saint-Tropez,83,,,83119000BE0167,,,,,,,,,,,,,0,,,,,S,sols,,,26,6.651071,43.256537
2023-1081134,2023-01-31,000001,Vente,36925000,9016,,BELLE VUE,B007,83990,83119,Saint-Tropez,83,,,83119000BE0533,,,,,,,,,,,,,0,4,Local industriel. commercial ou assimilé,700,0,VI,vignes,,,5091,6.650975,43.256383
2023-1081134,2023-01-31,000001,Vente,36925000,9016,,BELLE VUE,B007,83990,83119,Saint-Tropez,83,,,83119000BE0533,,,,,,,,,,,,,0,4,Local industriel. commercial ou assimilé,700,0,S,sols,,,5000,6.650975,43.256383
2023-1081134,2023-01-31,000001,Vente,36925000,9016,,BELLE VUE,B007,83990,83119,Saint-Tropez,83,,,83119000BE0533,,,,,,,,,,,,,0,4,Local industriel. commercial ou assimilé,700,0,AG,terrains d'agrément,,,5000,6.650975,43.256383
2023-1081134,2023-01-31,000001,Vente,36925000,9016,,BELLE VUE,B007,83990,83119,Saint-Tropez,83,,,83119000BE0533,,,,,,,,,,,,,0,4,Local industriel. commercial ou assimilé,300,0,S,sols,,,5000,6.650975,43.256383
2023-1081134,2023-01-31,000001,Vente,36925000,9016,,BELLE VUE,B007,83990,83119,Saint-Tropez,83,,,83119000BE0533,,,,,,,,,,,,,0,4,Local industriel. commercial ou assimilé,300,0,VI,vignes,,,5091,6.650975,43.256383
2023-1081134,2023-01-31,000001,Vente,36925000,9016,,BELLE VUE,B007,83990,83119,Saint-Tropez,83,,,83119000BE0533,,,,,,,,,,,,,0,4,Local industriel. commercial ou assimilé,300,0,AG,terrains d'agrément,,,5000,6.650975,43.256383
2023-1081135,2023-01-31,000002,Vente,3575000,9039,,BELLE VUE,B007,83990,83119,Saint-Tropez,83,,,83119000BE0235,,,,,,,,,,,,,0,1,Maison,330,10,S,sols,,,530,6.65175,43.256684
2023-1081135,2023-01-31,000002,Vente,3575000,9039,,BELLE VUE,B007,83990,83119,Saint-Tropez,83,,,83119000BE0235,,,,,,,,,,,,,0,1,Maison,330,10,AG,terrains d'agrément,,,1800,6.65175,43.256684
2023-1081135,2023-01-31,000002,Vente,3575000,,,BELLE VUE,B007,83990,83119,Saint-Tropez,83,,,83119000BE0239,,,,,,,,,,,,,0,,,,,AG,terrains d'agrément,,,1037,6.652002,43.256223
2023-1081135,2023-01-31,000002,Vente,3575000,,,BELLE ISNARDE,B006,83990,83119,Saint-Tropez,83,,,83119000BE0240,,,,,,,,,,,,,0,,,,,AG,terrains d'agrément,,,363,6.652344,43.256411
2023-1081138,2023-02-20,000001,Vente,335000,69,,RUE DU PORTAIL NEUF,0950,83990,83119,Saint-Tropez,83,,,83119000AB0173,,,6,,,,,,,,,,1,2,Appartement,21,1,,,,,,6.640956,43.271602
2023-1081138,2023-02-20,000001,Vente,335000,69,,RUE DU PORTAIL NEUF,0950,83990,83119,Saint-Tropez,83,,,83119000AB0173,,,7,,,,,,,,,,1,2,Appartement,26,1,,,,,,6.640956,43.271602
2023-1081301,2023-02-08,000001,Vente,9200000,134,B,CHE DE LA BELLE ISNARDE,0118,83990,83119,Saint-Tropez,83,,,83119000BE0361,,,,,,,,,,,,,0,1,Maison,380,8,S,sols,,,500,6.651299,43.257542
2023-1081301,2023-02-08,000001,Vente,9200000,134,B,CHE DE LA BELLE ISNARDE,0118,83990,83119,Saint-Tropez,83,,,83119000BE0361,,,,,,,,,,,,,0,3,Dépendance,,0,S,sols,,,500,6.651299,43.257542
2023-1081301,2023-02-08,000001,Vente,9200000,134,B,CHE DE LA BELLE ISNARDE,0118,83990,83119,Saint-Tropez,83,,,83119000BE0361,,,,,,,,,,,,,0,1,Maison,37,2,AG,terrains d'agrément,,,2000,6.651299,43.257542
2023-1081301,2023-02-08,000001,Vente,9200000,134,B,CHE DE LA BELLE ISNARDE,0118,83990,83119,Saint-Tropez,83,,,83119000BE0361,,,,,,,,,,,,,0,3,Dépendance,,0,AG,terrains d'agrément,,,2000,6.651299,43.257542
2023-1081301,2023-02-08,000001,Vente,9200000,134,B,CHE DE LA BELLE ISNARDE,0118,83990,83119,Saint-Tropez,83,,,83119000BE0361,,,,,,,,,,,,,0,3,Dépendance,,0,AG,terrains d'agrément,,,2000,6.651299,43.257542
2023-1081301,2023-02-08,000001,Vente,9200000,134,B,CHE DE LA BELLE ISNARDE,0118,83990,83119,Saint-Tropez,83,,,83119000BE0361,,,,,,,,,,,,,0,1,Maison,380,8,BR,futaies résineuses,PIN,Pins,2500,6.651299,43.257542
2023-1081301,2023-02-08,000001,Vente,9200000,134,B,CHE DE LA BELLE ISNARDE,0118,83990,83119,Saint-Tropez,83,,,83119000BE0361,,,,,,,,,,,,,0,1,Maison,37,2,BR,futaies résineuses,PIN,Pins,2500,6.651299,43.257542
2023-1081301,2023-02-08,000001,Vente,9200000,134,B,CHE DE LA BELLE ISNARDE,0118,83990,83119,Saint-Tropez,83,,,83119000BE0361,,,,,,,,,,,,,0,3,Dépendance,,0,BR,futaies résineuses,PIN,Pins,2500,6.651299,43.257542
2023-1081301,2023-02-08,000001,Vente,9200000,134,B,CHE DE LA BELLE ISNARDE,0118,83990,83119,Saint-Tropez,83,,,83119000BE0361,,,,,,,,,,,,,0,3,Dépendance,,0,BR,futaies résineuses,PIN,Pins,2500,6.651299,43.257542
2023-1081301,2023-02-08,000001,Vente,9200000,134,B,CHE DE LA BELLE ISNARDE,0118,83990,83119,Saint-Tropez,83,,,83119000BE0361,,,,,,,,,,,,,0,3,Dépendance,,0,BR,futaies résineuses,PIN,Pins,2500,6.651299,43.257542
2023-1081301,2023-02-08,000001,Vente,9200000,134,B,CHE DE LA BELLE ISNARDE,0118,83990,83119,Saint-Tropez,83,,,83119000BE0361,,,,,,,,,,,,,0,1,Maison,380,8,AG,terrains d'agrément,,,2000,6.651299,43.257542
2023-1081301,2023-02-08,000001,Vente,9200000,134,B,CHE DE LA BELLE ISNARDE,0118,83990,83119,Saint-Tropez,83,,,83119000BE0361,,,,,,,,,,,,,0,3,Dépendance,,0,AG,terrains d'agrément,,,2000,6.651299,43.257542
2023-1081301,2023-02-08,000001,Vente,9200000,134,B,CHE DE LA BELLE ISNARDE,0118,83990,83119,Saint-Tropez,83,,,83119000BE0361,,,,,,,,,,,,,0,3,Dépendance,,0,S,sols,,,500,6.651299,43.257542
2023-1081301,2023-02-08,000001,Vente,9200000,134,B,CHE DE LA BELLE ISNARDE,0118,83990,83119,Saint-Tropez,83,,,83119000BE0361,,,,,,,,,,,,,0,3,Dépendance,,0,S,sols,,,500,6.651299,43.257542
2023-1081301,2023-02-08,000001,Vente,9200000,134,B,CHE DE LA BELLE ISNARDE,0118,83990,83119,Saint-Tropez,83,,,83119000BE0361,,,,,,,,,,,,,0,1,Maison,37,2,S,sols,,,500,6.651299,43.257542
2023-1081312,2023-02-13,000001,Vente,1920000,9001,,RES LE SINFONIA,A274,83990,83119,Saint-Tropez,83,,,83119000AH0001,,,4,,,,,,,,,,1,3,Dépendance,,0,,,,,,6.624091,43.264967
2023-1081312,2023-02-13,000001,Vente,1920000,9001,,RES LE SINFONIA,A274,83990,83119,Saint-Tropez,83,,,83119000AH0001,,,5,,,,,,,,,,1,3,Dépendance,,0,,,,,,6.624091,43.264967