id_mutation,date_mutation,numero_disposition,nature_mutation,valeur_fonciere,adresse_numero,adresse_suffixe,adresse_nom_voie,adresse_code_voie,code_postal,code_commune,nom_commune,code_departement,ancien_code_commune,ancien_nom_commune,id_parcelle,ancien_id_parcelle,numero_volume,lot1_numero,lot1_surface_carrez,lot2_numero,lot2_surface_carrez,lot3_numero,lot3_surface_carrez,lot4_numero,lot4_surface_carrez,lot5_numero,lot5_surface_carrez,nombre_lots,code_type_local,type_local,surface_reelle_bati,nombre_pieces_principales,code_nature_culture,nature_culture,code_nature_culture_speciale,nature_culture_speciale,surface_terrain,longitude,latitude
2023-1110571,2023-01-16,000001,Vente,790000,,,LES MARTINES SUD,B029,84110,84040,Crestet,84,,,840400000E0617,,,,,,,,,,,,,0,,,,,B,bois,,,2160,5.079392,44.208011
2023-1110571,2023-01-16,000001,Vente,790000,,,LES MARTINES SUD,B029,84110,84040,Crestet,84,,,840400000E0618,,,,,,,,,,,,,0,,,,,B,bois,,,3860,5.078951,44.208213
2023-1110571,2023-01-16,000001,Vente,790000,,,LES MARTINES SUD,B029,84110,84040,Crestet,84,,,840400000E0619,,,,,,,,,,,,,0,,,,,B,bois,,,3850,5.07878,44.208554
2023-1110571,2023-01-16,000001,Vente,790000,,,LES MARTINES SUD,B029,84110,84040,Crestet,84,,,840400000E0620,,,,,,,,,,,,,0,,,,,B,bois,,,47700,5.078015,44.209067
2023-1110571,2023-01-16,000001,Vente,790000,,,LES MARTINES SUD,B029,84110,84040,Crestet,84,,,840400000E0683,,,,,,,,,,,,,0,,,,,S,sols,,,500,5.078848,44.20643
2023-1110571,2023-01-16,000001,Vente,790000,,,LES MARTINES SUD,B029,84110,84040,Crestet,84,,,840400000E0683,,,,,,,,,,,,,0,,,,,B,bois,,,1005,5.078848,44.20643
2023-1110571,2023-01-16,000001,Vente,790000,5041,,LES MARTINES SUD,B029,84110,84040,Crestet,84,,,840400000E0684,,,,,,,,,,,,,0,4,Local industriel. commercial ou assimilé,494,0,B,bois,,,7000,5.078709,44.207235
2023-1110571,2023-01-16,000001,Vente,790000,5041,,LES MARTINES SUD,B029,84110,84040,Crestet,84,,,840400000E0684,,,,,,,,,,,,,0,4,Local industriel. commercial ou assimilé,494,0,S,sols,,,500,5.078709,44.207235
2023-1110571,2023-01-16,000001,Vente,790000,,,LES MARTINES SUD,B029,84110,84040,Crestet,84,,,840400000E0685,,,,,,,,,,,,,0,,,,,B,bois,,,10,5.078791,44.206976
2023-1110571,2023-01-16,000001,Vente,790000,,,LES MARTINES SUD,B029,84110,84040,Crestet,84,,,840400000E0695,,,,,,,,,,,,,0,,,,,S,sols,,,46,5.079775,44.207724
2023-1110571,2023-01-16,000001,Vente,790000,,,LES MARTINES SUD,B029,84110,84040,Crestet,84,,,840400000E0698,,,,,,,,,,,,,0,,,,,B,bois,,,300,5.079358,44.207713
2023-1112498,2023-02-27,000001,Vente,2472,,,LES RAMIERES,B034,84110,84040,Crestet,84,,,840400000B0012,,,,,,,,,,,,,0,,,,,T,terres,,,1480,5.089314,44.227951
2023-1112498,2023-02-27,000001,Vente,2472,,,LES RAMIERES,B034,84110,84040,Crestet,84,,,840400000B0013,,,,,,,,,,,,,0,,,,,B,bois,,,580,5.089674,44.228356
2023-1113213,2023-04-06,000001,Vente,192000,,,LE GRES,B024,84110,84040,Crestet,84,,,840400000B0347,,,,,,,,,,,,,0,,,,,VE,vergers,,,230,5.099493,44.219125
2023-1113213,2023-04-06,000001,Vente,192000,5148,,LE GRES,B024,84110,84040,Crestet,84,,,840400000B0392,,,,,,,,,,,,,0,1,Maison,78,3,S,sols,,,1087,5.099726,44.219165
2023-1113693,2023-04-03,000001,Vente,138000,5289,,LE VILLAGE,B054,84110,84040,Crestet,84,,,840400000E0641,,,,,,,,,,,,,0,4,Local industriel. commercial ou assimilé,96,0,S,sols,,,48,5.083703,44.216575
2023-1116273,2023-06-29,000001,Vente,290000,5213,,LE VILLAGE,B054,84110,84040,Crestet,84,,,840400000E0712,,,,,,,,,,,,,0,1,Maison,120,3,S,sols,,,140,5.084422,44.21768
2023-1116273,2023-06-29,000001,Vente,290000,5213,,LE VILLAGE,B054,84110,84040,Crestet,84,,,840400000E0712,,,,,,,,,,,,,0,2,Appartement,40,2,S,sols,,,140,5.084422,44.21768
2023-1116273,2023-06-29,000001,Vente,290000,5317,,LE VILLAGE,B054,84110,84040,Crestet,84,,,840400000E0713,,,2,,,,,,,,,,1,2,Appartement,70,2,,,,,,5.084391,44.217478
2023-1117516,2023-08-04,000001,Vente,740000,1403,,CHE DE SUBLON,0044,84110,84040,Crestet,84,,,840400000D0286,,,,,,,,,,,,,0,3,Dépendance,,0,VI,vignes,,,2940,5.095539,44.198802
2023-1117516,2023-08-04,000001,Vente,740000,1403,,CHE DE SUBLON,0044,84110,84040,Crestet,84,,,840400000D0290,,,,,,,,,,,,,0,1,Maison,206,7,S,sols,,,350,5.094936,44.198732
2023-1118246,2023-08-21,000001,Vente,42000,,,LE GROZEAU,B025,84110,84040,Crestet,84,,,840400000C0868,,,,,,,,,,,,,0,,,,,T,terres,,,7120,5.107262,44.209187
2023-1118246,2023-08-21,000001,Vente,42000,,,LE GROZEAU,B025,84110,84040,Crestet,84,,,840400000C0869,,,,,,,,,,,,,0,,,,,VI,vignes,,,1297,5.108184,44.209196
2023-1118246,2023-08-21,000001,Vente,42000,,,LE GROZEAU,B025,84110,84040,Crestet,84,,,840400000C0871,,,,,,,,,,,,,0,,,,,L,landes,,,1476,5.106615,44.208691
2023-1118246,2023-08-21,000001,Vente,42000,,,LE GROZEAU,B025,84110,84040,Crestet,84,,,840400000C1319,,,,,,,,,,,,,0,,,,,T,terres,,,10835,5.106733,44.209976
2023-1118246,2023-08-21,000001,Vente,42000,,,LE GROZEAU,B025,84110,84040,Crestet,84,,,840400000C1354,,,,,,,,,,,,,0,,,,,VI,vignes,,,3069,5.107271,44.209529
2023-1121470,2023-12-12,000001,Vente,17000,,,FONT PROUVEYRE,B016,84110,84040,Crestet,84,,,840400000C1161,,,,,,,,,,,,,0,,,,,VI,vignes,,,18630,5.088749,44.214545
