id_mutation,date_mutation,numero_disposition,nature_mutation,valeur_fonciere,adresse_numero,adresse_suffixe,adresse_nom_voie,adresse_code_voie,code_postal,code_commune,nom_commune,code_departement,ancien_code_commune,ancien_nom_commune,id_parcelle,ancien_id_parcelle,numero_volume,lot1_numero,lot1_surface_carrez,lot2_numero,lot2_surface_carrez,lot3_numero,lot3_surface_carrez,lot4_numero,lot4_surface_carrez,lot5_numero,lot5_surface_carrez,nombre_lots,code_type_local,type_local,surface_reelle_bati,nombre_pieces_principales,code_nature_culture,nature_culture,code_nature_culture_speciale,nature_culture_speciale,surface_terrain,longitude,latitude
2023-1123113,2023-01-12,000001,Vente,4570,,,LA TRAPPE,B345,85700,85254,Saint-Mesmin,85,,,852540000A0307,,,,,,,,,,,,,0,,,,,T,terres,,,9405,-0.746922,46.812463
2023-1123113,2023-01-12,000001,Vente,4570,,,LA NOUE,B222,85700,85254,Saint-Mesmin,85,,,852540000A1132,,,,,,,,,,,,,0,,,,,T,terres,,,8875,-0.751628,46.8128
2023-1123122,2023-01-06,000001,Vente,135000,10,,RUE DU SEVREAU,0060,85700,85254,Saint-Mesmin,85,,,85254000AC0250,,,,,,,,,,,,,0,1,Maison,89,4,S,sols,,,500,-0.732064,46.789404
2023-1123122,2023-01-06,000001,Vente,135000,10,,RUE DU SEVREAU,0060,85700,85254,Saint-Mesmin,85,,,85254000AC0250,,,,,,,,,,,,,0,1,Maison,89,4,J,jardins,,,1214,-0.732064,46.789404
2023-1123415,2023-01-12,000001,Vente,41943,,,LE GRAND CHAMP,B155,85700,85254,Saint-Mesmin,85,,,852540000A0290,,,,,,,,,,,,,0,,,,,VI,vignes,,,1786,-0.751871,46.815684
2023-1123415,2023-01-12,000001,Vente,41943,,,LE GRAND CHAMP,B155,85700,85254,Saint-Mesmin,85,,,852540000A0291,,,,,,,,,,,,,0,,,,,T,terres,,,13060,-0.750737,46.815314
2023-1123415,2023-01-12,000001,Vente,41943,,,LE GRAND CHAMP,B155,85700,85254,Saint-Mesmin,85,,,852540000A0292,,,,,,,,,,,,,0,,,,,P,prés,,,4570,-0.750838,46.814433
2023-1123415,2023-01-12,000001,Vente,41943,,,LE GRAND CHAMP,B155,85700,85254,Saint-Mesmin,85,,,852540000A0296,,,,,,,,,,,,,0,,,,,T,terres,,,23300,-0.750569,46.813631
2023-1123415,2023-01-12,000001,Vente,41943,,,LA TAILLEE,B320,85700,85254,Saint-Mesmin,85,,,852540000A0304,,,,,,,,,,,,,0,,,,,BT,taillis simples,,,1240,-0.74667,46.813546
2023-1123415,2023-01-12,000001,Vente,41943,,,LA TRAPPE,B345,85700,85254,Saint-Mesmin,85,,,852540000A0305,,,,,,,,,,,,,0,,,,,VI,vignes,,,1840,-0.746776,46.813424
2023-1123415,2023-01-12,000001,Vente,41943,,,LA TRAPPE,B345,85700,85254,Saint-Mesmin,85,,,852540000A0306,,,,,,,,,,,,,0,,,,,T,terres,,,8860,-0.747832,46.812361
2023-1123415,2023-01-12,000001,Vente,41943,,,LE CHAMP DU CHIRON,B076,85700,85254,Saint-Mesmin,85,,,852540000A0488,,,,,,,,,,,,,0,,,,,T,terres,,,9060,-0.751102,46.812221
2023-1123415,2023-01-12,000001,Vente,41943,,,LE PATIS,B240,85700,85254,Saint-Mesmin,85,,,852540000A0517,,,,,,,,,,,,,0,,,,,T,terres,,,6000,-0.755019,46.809523
2023-1123415,2023-01-12,000001,Vente,41943,,,LE PATIS,B240,85700,85254,Saint-Mesmin,85,,,852540000A0522,,,,,,,,,,,,,0,,,,,T,terres,,,7490,-0.754958,46.810498
2023-1123415,2023-01-12,000001,Vente,41943,,,LE PATIS,B240,85700,85254,Saint-Mesmin,85,,,852540000A0524,,,,,,,,,,,,,0,,,,,P,prés,,,3219,-0.753227,46.81019
2023-1123415,2023-01-12,000001,Vente,41943,,,LA NOUE,B222,85700,85254,Saint-Mesmin,85,,,852540000A0527,,,,,,,,,,,,,0,,,,,P,prés,,,1247,-0.752314,46.810319
2023-1123415,2023-01-12,000001,Vente,41943,,,LE JARDIN DE BAS,B186,85700,85254,Saint-Mesmin,85,,,852540000A0540,,,,,,,,,,,,,0,,,,,T,terres,,,520,-0.754071,46.813983
2023-1123415,2023-01-12,000001,Vente,41943,,,LE JARDIN DE BAS,B186,85700,85254,Saint-Mesmin,85,,,852540000A0541,,,,,,,,,,,,,0,,,,,T,terres,,,390,-0.754188,46.813739
2023-1123415,2023-01-12,000001,Vente,41943,,,LE JARDIN DE BAS,B186,85700,85254,Saint-Mesmin,85,,,852540000A0542,,,,,,,,,,,,,0,,,,,T,terres,,,530,-0.754377,46.81358
2023-1123415,2023-01-12,000001,Vente,41943,,,LE RONDEAU,B312,85700,85254,Saint-Mesmin,85,,,852540000A0543,,,,,,,,,,,,,0,,,,,P,prés,,,5350,-0.754564,46.812921
2023-1123415,2023-01-12,000001,Vente,41943,,,LE RONDEAU,B312,85700,85254,Saint-Mesmin,85,,,852540000A0544,,,,,,,,,,,,,0,,,,,T,terres,,,13650,-0.754647,46.812157
2023-1123415,2023-01-12,000001,Vente,41943,,,LE RONDEAU,B312,85700,85254,Saint-Mesmin,85,,,852540000A0546,,,,,,,,,,,,,0,,,,,P,prés,,,5050,-0.755086,46.811226
2023-1123415,2023-01-12,000001,Vente,41943,,,LE PATIS,B240,85700,85254,Saint-Mesmin,85,,,852540000A0819,,,,,,,,,,,,,0,,,,,T,terres,,,12630,-0.753678,46.810947
2023-1123415,2023-01-12,000001,Vente,41943,,,MARTINET,B205,85700,85254,Saint-Mesmin,85,,,852540000A0885,,,,,,,,,,,,,0,,,,,T,terres,,,9640,-0.748966,46.815536
2023-1123837,2023-02-01,000001,Vente,5000,,,LE TERRIER,B341,85700,85254,Saint-Mesmin,85,,,852540000B0470,,,,,,,,,,,,,0,,,,,T,terres,,,7780,-0.716693,46.804984
2023-1123837,2023-02-01,000001,Vente,5000,,,LES CHAMPS DU VILLAGE,B129,85700,85254,Saint-Mesmin,85,,,852540000B0557,,,,,,,,,,,,,0,,,,,T,terres,,,12835,-0.72301,46.802953
2023-1124598,2023-02-08,000001,Vente,189000,11,,RUE DES PERVENCHES,0057,85700,85254,Saint-Mesmin,85,,,85254000AB0430,,,,,,,,,,,,,0,1,Maison,113,6,S,sols,,,834,-0.734761,46.794785
2023-1124972,2023-02-03,000001,Vente,70000,51,,AV DES MONTS,0051,85700,85254,Saint-Mesmin,85,,,85254000AB0257,,,,,,,,,,,,,0,1,Maison,98,5,S,sols,,,217,-0.739736,46.792779
2023-1124972,2023-02-03,000001,Vente,70000,,,LE BOURG,B041,85700,85254,Saint-Mesmin,85,,,85254000AB0258,,,,,,,,,,,,,0,,,,,S,sols,,,20,-0.739676,46.792596
2023-1124972,2023-02-03,000001,Vente,70000,,,LE BOURG,B041,85700,85254,Saint-Mesmin,85,,,85254000AB0259,,,,,,,,,,,,,0,,,,,VI,vignes,,,197,-0.739598,46.792401
2023-1124972,2023-02-03,000001,Vente,70000,,,LE BOURG,B041,85700,85254,Saint-Mesmin,85,,,85254000AB0260,,,,,,,,,,,,,0,,,,,J,jardins,,,565,-0.7396,46.792527
2023-1125017,2023-02-07,000001,Vente,128100,18,,RUE BEAUSEJOUR,0028,85700,85254,Saint-Mesmin,85,,,85254000AB0369,,,,,,,,,,,,,0,1,Maison,80,4,S,sols,,,768,-0.740511,46.795724
2023-1125242,2023-02-14,000001,Vente,48000,,,LE BOURG,B041,85700,85254,Saint-Mesmin,85,,,85254000AC0260,,,,,,,,,,,,,0,,,,,S,sols,,,56,-0.732672,46.791776
2023-1125242,2023-02-14,000001,Vente,48000,40,,RUE DU COMMERCE,0037,85700,85254,Saint-Mesmin,85,,,85254000AC0261,,,,,,,,,,,,,0,1,Maison,60,2,S,sols,,,90,-0.73276,46.791682
2023-1126224,2023-02-28,000001,Vente,190000,,,LA CHEMILLARDIERE,B136,85700,85254,Saint-Mesmin,85,,,852540000A0818,,,,,,,,,,,,,0,,,,,J,jardins,,,390,-0.754119,46.814907
2023-1126224,2023-02-28,000001,Vente,190000,,,LA CHEMILLARDIERE,B136,85700,85254,Saint-Mesmin,85,,,852540000A1200,,,,,,,,,,,,,0,,,,,J,jardins,,,25,-0.754153,46.815198
2023-1126224,2023-02-28,000001,Vente,190000,5764,F,LA CHEMILLARDIERE,B136,85700,85254,Saint-Mesmin,85,,,852540000A1202,,,,,,,,,,,,,0,1,Maison,102,5,S,sols,,,1555,-0.754252,46.814959
2023-1126468,2023-03-01,000001,Vente,71600,2,,RUE DU CHP DE FOIRE,0032,85700,85254,Saint-Mesmin,85,,,85254000AB0219,,,,,,,,,,,,,0,1,Maison,144,6,S,sols,,,153,-0.736176,46.792848
2023-1126468,2023-03-01,000001,Vente,71600,4,,RUE DU CHP DE FOIRE,0032,85700,85254,Saint-Mesmin,85,,,85254000AB0663,,,2,,,,,,,,,,1,3,Dépendance,,0,,,,,,-0.736199,46.792991
2023-1127890,2023-04-14,000001,Vente,1,37,,AV DES MONTS,0051,85700,85254,Saint-Mesmin,85,,,85254000AB0777,,2,,,,,,,,,,,0,,,,,,,,,,-0.738222,46.793017
2023-1127891,2023-04-14,000002,Vente,36999,35,,AV DES MONTS,0051,85700,85254,Saint-Mesmin,85,,,85254000AB0277,,,,,,,,,,,,,0,1,Maison,67,3,S,sols,,,51,-0.738173,46.793018
2023-1127891,2023-04-14,000002,Vente,36999,,,LE BOURG,B041,85700,85254,Saint-Mesmin,85,,,85254000AB0280,,,,,,,,,,,,,0,,,,,J,jardins,,,252,-0.737863,46.793362
2023-1128001,2023-03-30,000001,Vente,200000,14,,RUE DES POMMIERS,0091,85700,85254,Saint-Mesmin,85,,,852540000B1274,,,,,,,,,,,,,0,3,Dépendance,,0,S,sols,,,760,-0.727119,46.795404
2023-1128001,2023-03-30,000001,Vente,200000,14,,RUE DES POMMIERS,0091,85700,85254,Saint-Mesmin,85,,,852540000B1274,,,,,,,,,,,,,0,1,Maison,88,4,S,sols,,,760,-0.727119,46.795404
2023-1128970,2023-04-21,000001,Vente,241610,11,,LA GUILLERIE,B177,85700,85254,Saint-Mesmin,85,,,852540000C0998,,,,,,,,,,,,,0,1,Maison,112,5,S,sols,,,1238,-0.763346,46.790444
2023-1128970,2023-04-21,000001,Vente,241610,11,,LA GUILLERIE,B177,85700,85254,Saint-Mesmin,85,,,852540000C0998,,,,,,,,,,,,,0,3,Dépendance,,0,S,sols,,,1238,-0.763346,46.790444
2023-1129120,2023-04-13,000001,Vente,80000,14,,AV DE LA SEVRE,0059,85700,85254,Saint-Mesmin,85,,,85254000AB0515,,,,,,,,,,,,,0,1,Maison,152,4,S,sols,,,177,-0.73218,46.793889
2023-1129120,2023-04-13,000001,Vente,80000,,,LE BOURG,B041,85700,85254,Saint-Mesmin,85,,,85254000AB0518,,,,,,,,,,,,,0,,,,,J,jardins,,,223,-0.732055,46.793823
2023-1129929,2023-05-05,000001,Vente,123000,,,LE PRE DE MARTINET,B286,85700,85254,Saint-Mesmin,85,,,852540000A0389,,,,,,,,,,,,,0,,,,,T,terres,,,455,-0.735121,46.814448
2023-1129929,2023-05-05,000001,Vente,123000,,,LE PRE DE MARTINET,B286,85700,85254,Saint-Mesmin,85,,,852540000A0390,,,,,,,,,,,,,0,,,,,VI,vignes,,,468,-0.735206,46.814379
2023-1129929,2023-05-05,000001,Vente,123000,,,LE PRE DE MARTINET,B286,85700,85254,Saint-Mesmin,85,,,852540000A0874,,,,,,,,,,,,,0,,,,,T,terres,,,77,-0.735254,46.814429
2023-1129929,2023-05-05,000001,Vente,123000,,,LE PRE DE MARTINET,B286,85700,85254,Saint-Mesmin,85,,,852540000A0875,,,,,,,,,,,,,0,,,,,T,terres,,,3923,-0.735641,46.814352
2023-1129929,2023-05-05,000001,Vente,123000,,,LE PRE DE MARTINET,B286,85700,85254,Saint-Mesmin,85,,,852540000A1044,,,,,,,,,,,,,0,,,,,T,terres,,,1173,-0.736313,46.814276
2023-1129929,2023-05-05,000001,Vente,123000,3,,LA SAUNERIE,B317,85700,85254,Saint-Mesmin,85,,,852540000B0728,,,,,,,,,,,,,0,1,Maison,75,6,S,sols,,,458,-0.736468,46.812586
2023-1129929,2023-05-05,000001,Vente,123000,3,,LA SAUNERIE,B317,85700,85254,Saint-Mesmin,85,,,852540000B0728,,,,,,,,,,,,,0,3,Dépendance,,0,S,sols,,,458,-0.736468,46.812586
2023-1130303,2023-05-16,000001,Vente,3000,1,T,RUE DU CHP DE FOIRE,0032,85700,85254,Saint-Mesmin,85,,,85254000AB0406,,,,,,,,,,,,,0,3,Dépendance,,0,S,sols,,,32,-0.736327,46.792756
2023-1131020,2023-05-24,000002,Vente,10000,,,LA FILEE,B146,85700,85254,Saint-Mesmin,85,,,852540000A1003,,,,,,,,,,,,,0,,,,,S,sols,,,1300,-0.764594,46.822864
2023-1131020,2023-05-24,000002,Vente,10000,,,LA TALOURDIERE,B322,85700,85254,Saint-Mesmin,85,,,852540000A1373,,,,,,,,,,,,,0,,,,,J,jardins,,,30,-0.766041,46.822339
2023-1131020,2023-05-24,000002,Vente,10000,,,LA TALOURDIERE,B322,85700,85254,Saint-Mesmin,85,,,852540000A1375,,,,,,,,,,,,,0,,,,,S,sols,,,1151,-0.764707,46.822798
2023-1131135,2023-06-01,000001,Vente,230000,5710,,LES DOUTIERES,B144,85700,85254,Saint-Mesmin,85,,,852540000B1010,,,,,,,,,,,,,0,1,Maison,99,4,S,sols,,,1000,-0.717017,46.8157
2023-1131135,2023-06-01,000001,Vente,230000,,,LE MORINEAU,B216,85700,85254,Saint-Mesmin,85,,,852540000B1060,,,,,,,,,,,,,0,,,,,T,terres,,,18394,-0.716559,46.81471
2023-1131495,2023-06-01,000001,Vente,118000,5110,,LA LOGE,B197,85700,85254,Saint-Mesmin,85,,,852540000B0486,,,,,,,,,,,,,0,1,Maison,85,3,S,sols,,,67,-0.720388,46.805146
2023-1131495,2023-06-01,000001,Vente,118000,,,LA LOGE,B197,85700,85254,Saint-Mesmin,85,,,852540000B1145,,,,,,,,,,,,,0,,,,,T,terres,,,30,-0.720323,46.805388
2023-1131495,2023-06-01,000001,Vente,118000,,,LA LOGE,B197,85700,85254,Saint-Mesmin,85,,,852540000B1187,,,,,,,,,,,,,0,,,,,S,sols,,,500,-0.720206,46.805362
2023-1131495,2023-06-01,000001,Vente,118000,,,LA LOGE,B197,85700,85254,Saint-Mesmin,85,,,852540000B1187,,,,,,,,,,,,,0,,,,,T,terres,,,760,-0.720206,46.805362
2023-1132245,2023-06-12,000001,Vente,85000,3,,LA TUILERIE,B348,85700,85254,Saint-Mesmin,85,,,852540000B0455,,,,,,,,,,,,,0,1,Maison,64,3,S,sols,,,442,-0.718794,46.801122
2023-1132245,2023-06-12,000001,Vente,85000,,,LES CHAMPS DE LA VILLE,B112,85700,85254,Saint-Mesmin,85,,,852540000B0780,,,,,,,,,,,,,0,,,,,S,sols,,,85,-0.718746,46.801077
2023-1132279,2023-06-15,000002,Vente,30000,5132,,LES DOUTIERES,B144,85700,85254,Saint-Mesmin,85,,,852540000B0175,,,,,,,,,,,,,0,1,Maison,93,5,S,sols,,,3650,-0.717928,46.816095
2023-1132279,2023-06-15,000002,Vente,30000,,,LES DOUTIERES,B144,85700,85254,Saint-Mesmin,85,,,852540000B0176,,,,,,,,,,,,,0,,,,,S,sols,,,500,-0.71729,46.816281
2023-1132279,2023-06-15,000002,Vente,30000,,,LES DOUTIERES,B144,85700,85254,Saint-Mesmin,85,,,852540000B0176,,,,,,,,,,,,,0,,,,,T,terres,,,940,-0.71729,46.816281
2023-1132294,2023-06-15,000001,Vente,35758.98,,,LA FILEE,B146,85700,85254,Saint-Mesmin,85,,,852540000B0187,,,,,,,,,,,,,0,,,,,P,prés,,,16920,-0.721392,46.819204
2023-1132294,2023-06-15,000001,Vente,35758.98,,,LA FILEE,B146,85700,85254,Saint-Mesmin,85,,,852540000B0188,,,,,,,,,,,,,0,,,,,P,prés,,,19130,-0.720488,46.819826
2023-1132294,2023-06-15,000001,Vente,35758.98,,,LA FILEE,B146,85700,85254,Saint-Mesmin,85,,,852540000B0189,,,,,,,,,,,,,0,,,,,T,terres,,,21645,-0.719442,46.819275
2023-1132294,2023-06-15,000001,Vente,35758.98,,,LA FILEE,B146,85700,85254,Saint-Mesmin,85,,,852540000B0191,,,,,,,,,,,,,0,,,,,BT,taillis simples,,,1020,-0.720555,46.820935
2023-1132294,2023-06-15,000001,Vente,35758.98,,,LA FILEE,B146,85700,85254,Saint-Mesmin,85,,,852540000B0696,,,,,,,,,,,,,0,,,,,T,terres,,,7273,-0.721281,46.8204
2023-1132294,2023-06-15,000001,Vente,35758.98,,,LE MORINEAU,B216,85700,85254,Saint-Mesmin,85,,,852540000B1009,,,,,,,,,,,,,0,,,,,T,terres,,,150,-0.717041,46.815836
2023-1132294,2023-06-15,000001,Vente,35758.98,,,LES DOUTIERES,B144,85700,85254,Saint-Mesmin,85,,,852540000B1052,,,,,,,,,,,,,0,,,,,T,terres,,,53420,-0.72073,46.81639
2023-1132294,2023-06-15,000001,Vente,35758.98,,,LES DOUTIERES,B144,85700,85254,Saint-Mesmin,85,,,852540000B1052,,,,,,,,,,,,,0,,,,,P,prés,,,7297,-0.72073,46.81639
2023-1132339,2023-06-15,000001,Vente,90682.75,,,LES DOUTIERES,B144,85700,85254,Saint-Mesmin,85,,,852540000B1326,,,,,,,,,,,,,0,,,,,T,terres,,,3574,-0.717818,46.816946
2023-1132339,2023-06-15,000001,Vente,90682.75,,,LES DOUTIERES,B144,85700,85254,Saint-Mesmin,85,,,852540000B1326,,,,,,,,,,,,,0,,,,,S,sols,,,3000,-0.717818,46.816946
2023-1132384,2023-06-15,000001,Vente,17178,,,LES GRANDS PATIS,B175,85700,85254,Saint-Mesmin,85,,,852540000B0180,,,,,,,,,,,,,0,,,,,P,prés,,,9955,-0.71926,46.817953
2023-1132384,2023-06-15,000001,Vente,17178,,,LA FILEE,B146,85700,85254,Saint-Mesmin,85,,,852540000B0190,,,,,,,,,,,,,0,,,,,P,prés,,,2760,-0.720182,46.820879
2023-1132384,2023-06-15,000001,Vente,17178,,,LES BOIS DES MARMENIERES,B031,85700,85254,Saint-Mesmin,85,,,852540000B0194,,,,,,,,,,,,,0,,,,,BT,taillis simples,,,11370,-0.719678,46.820863
2023-1132384,2023-06-15,000001,Vente,17178,,,LES BOIS DES MARMENIERES,B031,85700,85254,Saint-Mesmin,85,,,852540000B0197,,,,,,,,,,,,,0,,,,,E,eaux,,,4751,-0.71705,46.818136
2023-1132384,2023-06-15,000001,Vente,17178,,,LES BOIS DES MARMENIERES,B031,85700,85254,Saint-Mesmin,85,,,852540000B0197,,,,,,,,,,,,,0,,,,,P,prés,,,17149,-0.71705,46.818136
2023-1132384,2023-06-15,000001,Vente,17178,,,LE MORINEAU,B216,85700,85254,Saint-Mesmin,85,,,852540000B0239,,,,,,,,,,,,,0,,,,,T,terres,,,12200,-0.71648,46.816228
2023-1132384,2023-06-15,000001,Vente,17178,,,LES BOIS DES MARMENIERES,B031,85700,85254,Saint-Mesmin,85,,,852540000B0697,,,,,,,,,,,,,0,,,,,P,prés,,,10527,-0.720172,46.821838
2023-1132731,2023-06-22,000001,Vente,235000,34,,AV DES MONTS,0051,85700,85254,Saint-Mesmin,85,,,85254000AB0167,,,,,,,,,,,,,0,1,Maison,207,8,S,sols,,,707,-0.735957,46.793819
2023-1132731,2023-06-22,000001,Vente,235000,34,,AV DES MONTS,0051,85700,85254,Saint-Mesmin,85,,,85254000AB0167,,,,,,,,,,,,,0,3,Dépendance,,0,S,sols,,,707,-0.735957,46.793819
2023-1132759,2023-06-20,000001,Vente,208700,6,,LA SEMELIERE,B318,85700,85254,Saint-Mesmin,85,,,852540000D0492,,,,,,,,,,,,,0,,,,,S,sols,,,400,-0.759959,46.776706
2023-1132759,2023-06-20,000001,Vente,208700,6,,LA SEMELIERE,B318,85700,85254,Saint-Mesmin,85,,,852540000D0493,,,,,,,,,,,,,0,1,Maison,88,4,S,sols,,,640,-0.759807,46.77654
2023-1132759,2023-06-20,000001,Vente,208700,6,,LA SEMELIERE,B318,85700,85254,Saint-Mesmin,85,,,852540000D0493,,,,,,,,,,,,,0,3,Dépendance,,0,S,sols,,,640,-0.759807,46.77654
2023-1132759,2023-06-20,000001,Vente,208700,,,LE PERRAIL,B259,85700,85254,Saint-Mesmin,85,,,852540000D0528,,,,,,,,,,,,,0,,,,,T,terres,,,980,-0.759994,46.776416
2023-1133052,2023-06-27,000002,Vente,145000,6,,ALL DES MORINEAUX,0080,85700,85254,Saint-Mesmin,85,,,852540000C1162,,,,,,,,,,,,,0,,,,,S,sols,,,538,-0.735878,46.799252
2023-1133814,2023-07-04,000001,Vente,5000,,,BOIS DE LA REMISSIERE,B028,85700,85254,Saint-Mesmin,85,,,852540000D0992,,,,,,,,,,,,,0,,,,,BT,taillis simples,,,10990,-0.760342,46.770146
2023-1133921,2023-07-10,000001,Vente,136000,,,LE CHAMP DE LA VERGNAIE,B065,85700,85254,Saint-Mesmin,85,,,852540000A1360,,,,,,,,,,,,,0,,,,,P,prés,,,71,-0.75217,46.825805
2023-1133921,2023-07-10,000001,Vente,136000,2,,LA GROSSIERE,B176,85700,85254,Saint-Mesmin,85,,,852540000A1366,,,,,,,,,,,,,0,,,,,S,sols,,,35,-0.752155,46.825622
2023-1133921,2023-07-10,000001,Vente,136000,2,,LA GROSSIERE,B176,85700,85254,Saint-Mesmin,85,,,852540000A1367,,,,,,,,,,,,,0,,,,,S,sols,,,56,-0.751888,46.825525
2023-1133921,2023-07-10,000001,Vente,136000,1,,LA GROSSIERE,B176,85700,85254,Saint-Mesmin,85,,,852540000A1369,,,,,,,,,,,,,0,1,Maison,73,3,AG,terrains d'agrément,,,758,-0.751937,46.825677
2023-1133921,2023-07-10,000001,Vente,136000,1,,LA GROSSIERE,B176,85700,85254,Saint-Mesmin,85,,,852540000A1369,,,,,,,,,,,,,0,3,Dépendance,,0,AG,terrains d'agrément,,,758,-0.751937,46.825677
2023-1133921,2023-07-10,000001,Vente,136000,1,,LA GROSSIERE,B176,85700,85254,Saint-Mesmin,85,,,852540000A1369,,,,,,,,,,,,,0,1,Maison,73,3,S,sols,,,500,-0.751937,46.825677
2023-1133921,2023-07-10,000001,Vente,136000,1,,LA GROSSIERE,B176,85700,85254,Saint-Mesmin,85,,,852540000A1369,,,,,,,,,,,,,0,3,Dépendance,,0,S,sols,,,500,-0.751937,46.825677
2023-1134264,2023-07-20,000001,Vente,2000,,,LE PINEAU,B273,85700,85254,Saint-Mesmin,85,,,852540000B0251,,,,,,,,,,,,,0,,,,,BT,taillis simples,,,940,-0.717798,46.813305
2023-1134264,2023-07-20,000001,Vente,2000,,,LE PINEAU,B273,85700,85254,Saint-Mesmin,85,,,852540000B0252,,,,,,,,,,,,,0,,,,,T,terres,,,780,-0.717463,46.813629
2023-1134264,2023-07-20,000001,Vente,2000,,,LE PINEAU,B273,85700,85254,Saint-Mesmin,85,,,852540000B0253,,,,,,,,,,,,,0,,,,,VI,vignes,,,2265,-0.717802,46.813509
2023-1134264,2023-07-20,000001,Vente,2000,,,LE PINEAU,B273,85700,85254,Saint-Mesmin,85,,,852540000B0254,,,,,,,,,,,,,0,,,,,T,terres,,,2635,-0.718323,46.81354
2023-1134451,2023-07-24,000001,Vente,72000,38,,AV DES MONTS,0051,85700,85254,Saint-Mesmin,85,,,85254000AB0165,,,,,,,,,,,,,0,3,Dépendance,,0,S,sols,,,222,-0.736113,46.793701
2023-1134451,2023-07-24,000001,Vente,72000,38,,AV DES MONTS,0051,85700,85254,Saint-Mesmin,85,,,85254000AB0165,,,,,,,,,,,,,0,1,Maison,76,3,S,sols,,,222,-0.736113,46.793701
2023-1134451,2023-07-24,000001,Vente,72000,27,,AV DES MONTS,0051,85700,85254,Saint-Mesmin,85,,,85254000AB0340,,,,,,,,,,,,,0,3,Dépendance,,0,S,sols,,,93,-0.735998,46.793347
2023-1137278,2023-09-20,000001,Vente,240000,,,LE PONT MORAIN,B276,85700,85254,Saint-Mesmin,85,,,85254000AC0205,,,,,,,,,,,,,0,,,,,J,jardins,,,66,-0.731022,46.790489
2023-1137278,2023-09-20,000001,Vente,240000,5000,,CHE DE L AUBEPINE,0022,85700,85254,Saint-Mesmin,85,,,85254000AC0207,,,,,,,,,,,,,0,3,Dépendance,,0,S,sols,,,68,-0.730586,46.790192
2023-1137278,2023-09-20,000001,Vente,240000,2,,CHE DE L AUBEPINE,0022,85700,85254,Saint-Mesmin,85,,,85254000AC0749,,,,,,,,,,,,,0,1,Maison,113,4,S,sols,,,500,-0.730814,46.790269
2023-1137278,2023-09-20,000001,Vente,240000,2,,CHE DE L AUBEPINE,0022,85700,85254,Saint-Mesmin,85,,,85254000AC0749,,,,,,,,,,,,,0,3,Dépendance,,0,S,sols,,,500,-0.730814,46.790269
2023-1137278,2023-09-20,000001,Vente,240000,2,,CHE DE L AUBEPINE,0022,85700,85254,Saint-Mesmin,85,,,85254000AC0749,,,,,,,,,,,,,0,3,Dépendance,,0,S,sols,,,500,-0.730814,46.790269
2023-1137278,2023-09-20,000001,Vente,240000,2,,CHE DE L AUBEPINE,0022,85700,85254,Saint-Mesmin,85,,,85254000AC0749,,,,,,,,,,,,,0,1,Maison,113,4,J,jardins,,,655,-0.730814,46.790269
2023-1137278,2023-09-20,000001,Vente,240000,2,,CHE DE L AUBEPINE,0022,85700,85254,Saint-Mesmin,85,,,85254000AC0749,,,,,,,,,,,,,0,3,Dépendance,,0,J,jardins,,,655,-0.730814,46.790269
2023-1137278,2023-09-20,000001,Vente,240000,2,,CHE DE L AUBEPINE,0022,85700,85254,Saint-Mesmin,85,,,85254000AC0749,,,,,,,,,,,,,0,3,Dépendance,,0,J,jardins,,,655,-0.730814,46.790269
2023-1137347,2023-09-15,000001,Vente,2439.36,,,TENEMENT DU ROBINEAU,B336,85700,85254,Saint-Mesmin,85,,,852540000B0440,,,,,,,,,,,,,0,,,,,P,prés,,,9880,-0.709974,46.805836
2023-1137347,2023-09-15,000001,Vente,2439.36,,,LES PRES DE LA DALLE,B295,85700,85254,Saint-Mesmin,85,,,852540000B0441,,,,,,,,,,,,,0,,,,,P,prés,,,9480,-0.71125,46.805641
2023-1137399,2023-09-05,000001,Vente,17000,5738,F,LA GLAMIERE,B152,85700,85254,Saint-Mesmin,85,,,852540000D2137,,,,,,,,,,,,,0,3,Dépendance,,0,E,eaux,,,4284,-0.752903,46.782467
2023-1138307,2023-09-13,000002,Vente,100000,1,,RUE BEAUSEJOUR,0028,85700,85254,Saint-Mesmin,85,,,85254000AB0740,,,,,,,,,,,,,0,1,Maison,125,5,S,sols,,,639,-0.738154,46.794232
2023-1138307,2023-09-13,000002,Vente,100000,1,,RUE BEAUSEJOUR,0028,85700,85254,Saint-Mesmin,85,,,85254000AB0740,,,,,,,,,,,,,0,3,Dépendance,,0,S,sols,,,639,-0.738154,46.794232
2023-1138307,2023-09-13,000002,Vente,100000,,,L AUGOIRE,B193,85700,85254,Saint-Mesmin,85,,,85254000AB0742,,,,,,,,,,,,,0,,,,,T,terres,,,6,-0.738118,46.794347
2023-1138307,2023-09-13,000002,Vente,100000,,,LE BOURG,B041,85700,85254,Saint-Mesmin,85,,,85254000AB0747,,,,,,,,,,,,,0,,,,,T,terres,,,85,-0.738172,46.794075
2023-1138307,2023-09-13,000002,Vente,100000,,,RUE BEAUSEJOUR,0028,85700,85254,Saint-Mesmin,85,,,85254000AB0785,,,,,,,,,,,,,0,,,,,J,jardins,,,324,-0.737938,46.794083
2023-1138682,2023-09-21,000001,Vente,56653.58,,,LE MORINEAU,B216,85700,85254,Saint-Mesmin,85,,,852540000B0245,,,,,,,,,,,,,0,,,,,T,terres,,,9540,-0.716314,46.812721
2023-1138682,2023-09-21,000001,Vente,56653.58,,,LES JUSTICES DE LA CROIX,B189,85700,85254,Saint-Mesmin,85,,,852540000B0298,,,,,,,,,,,,,0,,,,,T,terres,,,36795,-0.721525,46.807803
2023-1138682,2023-09-21,000001,Vente,56653.58,,,LE BOIS BRULE,B020,85700,85254,Saint-Mesmin,85,,,852540000B0313,,,,,,,,,,,,,0,,,,,VI,vignes,,,1000,-0.718446,46.809731
2023-1138682,2023-09-21,000001,Vente,56653.58,,,LE BOIS BRULE,B020,85700,85254,Saint-Mesmin,85,,,852540000B0313,,,,,,,,,,,,,0,,,,,T,terres,,,6700,-0.718446,46.809731
2023-1138682,2023-09-21,000001,Vente,56653.58,,,LE BOIS BRULE,B020,85700,85254,Saint-Mesmin,85,,,852540000B0314,,,,,,,,,,,,,0,,,,,T,terres,,,31750,-0.716407,46.810721
2023-1138682,2023-09-21,000001,Vente,56653.58,,,LE BOIS BRULE,B020,85700,85254,Saint-Mesmin,85,,,852540000B0315,,,,,,,,,,,,,0,,,,,T,terres,,,14740,-0.716507,46.811709
2023-1138682,2023-09-21,000001,Vente,56653.58,,,LE BOIS BRULE,B020,85700,85254,Saint-Mesmin,85,,,852540000B0316,,,,,,,,,,,,,0,,,,,BT,taillis simples,,,1990,-0.714657,46.810759
2023-1138682,2023-09-21,000001,Vente,56653.58,,,LE BOIS BRULE,B020,85700,85254,Saint-Mesmin,85,,,852540000B0319,,,,,,,,,,,,,0,,,,,BT,taillis simples,,,545,-0.71486,46.810389
2023-1138682,2023-09-21,000001,Vente,56653.58,,,LE BOIS BRULE,B020,85700,85254,Saint-Mesmin,85,,,852540000B0320,,,,,,,,,,,,,0,,,,,T,terres,,,1095,-0.715069,46.810247
2023-1138682,2023-09-21,000001,Vente,56653.58,,,LES GRANDES BLANDINIERES,B171,85700,85254,Saint-Mesmin,85,,,852540000B0344,,,,,,,,,,,,,0,,,,,BT,taillis simples,,,1440,-0.713683,46.811182
2023-1138682,2023-09-21,000001,Vente,56653.58,,,LES GRANDES BLANDINIERES,B171,85700,85254,Saint-Mesmin,85,,,852540000B0345,,,,,,,,,,,,,0,,,,,T,terres,,,16450,-0.714631,46.81178
2023-1138682,2023-09-21,000001,Vente,56653.58,,,LES GRANDES BLANDINIERES,B171,85700,85254,Saint-Mesmin,85,,,852540000B0346,,,,,,,,,,,,,0,,,,,T,terres,,,35630,-0.71357,46.811538
2023-1138682,2023-09-21,000001,Vente,56653.58,,,TENEMENT DE LA GRANDE BRAN,B326,85700,85254,Saint-Mesmin,85,,,852540000B0716,,,,,,,,,,,,,0,,,,,P,prés,,,17192,-0.711916,46.811921
2023-1138682,2023-09-21,000001,Vente,56653.58,,,TENEMENT DE LA LOUISIERE,B328,85700,85254,Saint-Mesmin,85,,,852540000B1230,,,,,,,,,,,,,0,,,,,P,prés,,,29497,-0.707233,46.809833