id_mutation,date_mutation,numero_disposition,nature_mutation,valeur_fonciere,adresse_numero,adresse_suffixe,adresse_nom_voie,adresse_code_voie,code_postal,code_commune,nom_commune,code_departement,ancien_code_commune,ancien_nom_commune,id_parcelle,ancien_id_parcelle,numero_volume,lot1_numero,lot1_surface_carrez,lot2_numero,lot2_surface_carrez,lot3_numero,lot3_surface_carrez,lot4_numero,lot4_surface_carrez,lot5_numero,lot5_surface_carrez,nombre_lots,code_type_local,type_local,surface_reelle_bati,nombre_pieces_principales,code_nature_culture,nature_culture,code_nature_culture_speciale,nature_culture_speciale,surface_terrain,longitude,latitude
2023-1144178,2023-01-09,000001,Vente,90000,,,LA ROCHE,B202,86450,86072,Chenevelles,86,,,860720000D0460,,,,,,,,,,,,,0,,,,,T,terres,,,400,0.70124,46.714937
2023-1144178,2023-01-09,000001,Vente,90000,5121,,LA ROCHE,B202,86450,86072,Chenevelles,86,,,860720000D0461,,,,,,,,,,,,,0,1,Maison,57,1,S,sols,,,2425,0.701595,46.71472
2023-1144178,2023-01-09,000001,Vente,90000,,,LA ROCHE,B202,86450,86072,Chenevelles,86,,,860720000D0462,,,,,,,,,,,,,0,,,,,T,terres,,,1155,0.701908,46.714727
2023-1144178,2023-01-09,000001,Vente,90000,,,LA ROCHE,B202,86450,86072,Chenevelles,86,,,860720000D0463,,,,,,,,,,,,,0,,,,,P,prés,,,1263,0.701496,46.714489
2023-1144178,2023-01-09,000001,Vente,90000,,,LA ROCHE,B202,86450,86072,Chenevelles,86,,,860720000D0464,,,,,,,,,,,,,0,,,,,P,prés,,,684,0.701645,46.714254
2023-1144178,2023-01-09,000001,Vente,90000,,,LA ROCHE,B202,86450,86072,Chenevelles,86,,,860720000D0465,,,,,,,,,,,,,0,,,,,J,jardins,,,1022,0.701358,46.714096
2023-1144367,2023-01-19,000001,Vente,3310,,,LA TAILLE A GUIGNARD EST,B213,86450,86072,Chenevelles,86,,,860720000D0621,,,,,,,,,,,,,0,,,,,T,terres,,,4331,0.721298,46.713707
2023-1144367,2023-01-19,000001,Vente,3310,,,LA TAILLE A GUIGNARD EST,B213,86450,86072,Chenevelles,86,,,860720000D0622,,,,,,,,,,,,,0,,,,,T,terres,,,5349,0.721821,46.714228
2023-1144367,2023-01-19,000001,Vente,3310,,,LA TAILLE A GUIGNARD EST,B213,86450,86072,Chenevelles,86,,,860720000D0623,,,,,,,,,,,,,0,,,,,T,terres,,,1310,0.722009,46.714478
2023-1144367,2023-01-19,000001,Vente,3310,,,LA TAILLE A GUIGNARD EST,B213,86450,86072,Chenevelles,86,,,860720000D0627,,,,,,,,,,,,,0,,,,,T,terres,,,3400,0.721842,46.714837
2023-1145188,2023-02-14,000001,Vente,600,,,LE CHAMP DU MARCHAIS,B045,86450,86072,Chenevelles,86,,,860720000C0133,,,,,,,,,,,,,0,,,,,T,terres,,,1601,0.70662,46.727306
2023-1145444,2023-02-16,000001,Vente,1000,,,LA CHAPELLEROUX,B054,86450,86072,Chenevelles,86,,,860720000E0589,,,,,,,,,,,,,0,,,,,T,terres,,,2724,0.694718,46.712142
2023-1146069,2023-03-08,000001,Vente,66500,45,,RUE RAYMOND D ARGENCE,0040,86450,86072,Chenevelles,86,,,860720000H0611,,,,,,,,,,,,,0,1,Maison,83,4,T,terres,,,2007,0.658403,46.730933
2023-1146069,2023-03-08,000001,Vente,66500,45,,RUE RAYMOND D ARGENCE,0040,86450,86072,Chenevelles,86,,,860720000H0611,,,,,,,,,,,,,0,1,Maison,83,4,S,sols,,,1000,0.658403,46.730933
2023-1147592,2023-05-03,000001,Vente,3110,,,LE CHAMP DES ORMEAUX,B043,86450,86072,Chenevelles,86,,,860720000D0741,,,,,,,,,,,,,0,,,,,T,terres,,,2757,0.720532,46.712743
2023-1147592,2023-05-03,000001,Vente,3110,,,LE CHAMP DES ORMEAUX,B043,86450,86072,Chenevelles,86,,,860720000D0742,,,,,,,,,,,,,0,,,,,T,terres,,,1830,0.721031,46.712615
2023-1147592,2023-05-03,000001,Vente,3110,,,LE CHAMP DES ORMEAUX,B043,86450,86072,Chenevelles,86,,,860720000D0743,,,,,,,,,,,,,0,,,,,T,terres,,,7153,0.72112,46.712311
2023-1147592,2023-05-03,000001,Vente,3110,,,LE CHAMP DES ORMEAUX,B043,86450,86072,Chenevelles,86,,,860720000D0894,,,,,,,,,,,,,0,,,,,T,terres,,,243,0.721012,46.712059
2023-1147592,2023-05-03,000001,Vente,3110,,,LE CHAMP DES ORMEAUX,B043,86450,86072,Chenevelles,86,,,860720000D0897,,,,,,,,,,,,,0,,,,,T,terres,,,1539,0.72004,46.71198
2023-1147727,2023-05-03,000001,Vente,81663.3,,,PRISES DE L AVOCAT,B194,86450,86072,Chenevelles,86,,,860720000F0341,,,,,,,,,,,,,0,,,,,T,terres,,,13910,0.651312,46.694003
2023-1148032,2023-05-26,000001,Vente,90000,5066,,BOIS VERT,B018,86450,86072,Chenevelles,86,,,860720000A0211,,,,,,,,,,,,,0,1,Maison,50,2,S,sols,,,125,0.672536,46.740977
2023-1148032,2023-05-26,000001,Vente,90000,5066,,BOIS VERT,B018,86450,86072,Chenevelles,86,,,860720000A0211,,,,,,,,,,,,,0,3,Dépendance,,0,S,sols,,,125,0.672536,46.740977
2023-1148032,2023-05-26,000001,Vente,90000,5066,,BOIS VERT,B018,86450,86072,Chenevelles,86,,,860720000A0211,,,,,,,,,,,,,0,3,Dépendance,,0,S,sols,,,125,0.672536,46.740977
2023-1148032,2023-05-26,000001,Vente,90000,,,BOIS VERT,B018,86450,86072,Chenevelles,86,,,860720000A0217,,,,,,,,,,,,,0,,,,,S,sols,,,1730,0.673018,46.740728
2023-1148032,2023-05-26,000001,Vente,90000,,,BOIS VERT,B018,86450,86072,Chenevelles,86,,,860720000A0218,,,,,,,,,,,,,0,,,,,J,jardins,,,645,0.673506,46.740288
2023-1148109,2023-05-11,000001,Vente,5000,5256,,LES BILLAUX,B012,86450,86072,Chenevelles,86,,,860720000H0309,,,,,,,,,,,,,0,3,Dépendance,,0,S,sols,,,368,0.640078,46.727868
2023-1148109,2023-05-11,000001,Vente,5000,5256,,LES BILLAUX,B012,86450,86072,Chenevelles,86,,,860720000H0309,,,,,,,,,,,,,0,3,Dépendance,,0,AG,terrains d'agrément,,,4122,0.640078,46.727868
2023-1148109,2023-05-11,000001,Vente,5000,,,BIARD,B011,86450,86072,Chenevelles,86,,,860720000H0311,,,,,,,,,,,,,0,,,,,P,prés,,,2810,0.639443,46.727056
2023-1148552,2023-06-05,000001,Vente,160000,27,,RUE DE L ETOILE,0015,86450,86072,Chenevelles,86,,,86072000AB0054,,,,,,,,,,,,,0,1,Maison,169,5,S,sols,,,670,0.654357,46.726237
2023-1148552,2023-06-05,000001,Vente,160000,27,,RUE DE L ETOILE,0015,86450,86072,Chenevelles,86,,,86072000AB0054,,,,,,,,,,,,,0,3,Dépendance,,0,S,sols,,,670,0.654357,46.726237
2023-1148552,2023-06-05,000001,Vente,160000,,,LE BOURG,B024,86450,86072,Chenevelles,86,,,86072000AB0253,,,,,,,,,,,,,0,,,,,J,jardins,,,1075,0.654561,46.726155
2023-1148552,2023-06-05,000001,Vente,160000,,,LES TERRES CHAUDES,B222,86450,86072,Chenevelles,86,,,860720000G0564,,,,,,,,,,,,,0,,,,,T,terres,,,4500,0.655192,46.726412
2023-1149511,2023-07-07,000001,Vente,4000,,,LES LANDAVAUX,B131,86450,86072,Chenevelles,86,,,860720000H0054,,,,,,,,,,,,,0,,,,,L,landes,,,935,0.637497,46.740544
2023-1149511,2023-07-07,000001,Vente,4000,,,LES LANDAVAUX,B131,86450,86072,Chenevelles,86,,,860720000H0055,,,,,,,,,,,,,0,,,,,L,landes,,,1870,0.637779,46.73996
2023-1150034,2023-07-27,000001,Vente,49500,24,,RUE RAYMOND D ARGENCE,0040,86450,86072,Chenevelles,86,,,860720000B0826,,,,,,,,,,,,,0,4,Local industriel. commercial ou assimilé,20,0,J,jardins,,,412,0.656795,46.729653
2023-1150034,2023-07-27,000001,Vente,49500,24,,RUE RAYMOND D ARGENCE,0040,86450,86072,Chenevelles,86,,,860720000B0826,,,,,,,,,,,,,0,4,Local industriel. commercial ou assimilé,20,0,S,sols,,,1000,0.656795,46.729653
2023-1150034,2023-07-27,000001,Vente,49500,24,,RUE RAYMOND D ARGENCE,0040,86450,86072,Chenevelles,86,,,860720000B0826,,,,,,,,,,,,,0,4,Local industriel. commercial ou assimilé,314,0,J,jardins,,,412,0.656795,46.729653
2023-1150034,2023-07-27,000001,Vente,49500,24,,RUE RAYMOND D ARGENCE,0040,86450,86072,Chenevelles,86,,,860720000B0826,,,,,,,,,,,,,0,1,Maison,78,3,S,sols,,,1000,0.656795,46.729653
2023-1150034,2023-07-27,000001,Vente,49500,24,,RUE RAYMOND D ARGENCE,0040,86450,86072,Chenevelles,86,,,860720000B0826,,,,,,,,,,,,,0,4,Local industriel. commercial ou assimilé,314,0,S,sols,,,1000,0.656795,46.729653
2023-1150034,2023-07-27,000001,Vente,49500,24,,RUE RAYMOND D ARGENCE,0040,86450,86072,Chenevelles,86,,,860720000B0826,,,,,,,,,,,,,0,1,Maison,78,3,J,jardins,,,412,0.656795,46.729653
2023-1150456,2023-07-21,000001,Vente,15393,,,LES AUMONERIES,B004,86450,86072,Chenevelles,86,,,860720000G0012,,,,,,,,,,,,,0,,,,,T,terres,,,4950,0.648435,46.726472
2023-1150456,2023-07-21,000001,Vente,15393,,,LES AUMONERIES,B004,86450,86072,Chenevelles,86,,,860720000G0026,,,,,,,,,,,,,0,,,,,T,terres,,,15645,0.646268,46.726388
2023-1150456,2023-07-21,000001,Vente,15393,,,LES AUMONERIES,B004,86450,86072,Chenevelles,86,,,860720000G0031,,,,,,,,,,,,,0,,,,,P,prés,,,5610,0.647272,46.725492
2023-1150456,2023-07-21,000001,Vente,15393,,,LES AUMONERIES,B004,86450,86072,Chenevelles,86,,,860720000G0032,,,,,,,,,,,,,0,,,,,T,terres,,,12925,0.648306,46.725943
2023-1150456,2023-07-21,000001,Vente,15393,,,LES AUMONERIES,B004,86450,86072,Chenevelles,86,,,860720000G0033,,,,,,,,,,,,,0,,,,,T,terres,,,17235,0.649948,46.725084
2023-1150456,2023-07-21,000001,Vente,15393,,,LES CORMIERS,B070,86450,86072,Chenevelles,86,,,860720000G0205,,,,,,,,,,,,,0,,,,,P,prés,,,6360,0.651632,46.724159
2023-1150456,2023-07-21,000001,Vente,15393,,,LES LIGNES,B132,86450,86072,Chenevelles,86,,,860720000G0282,,,,,,,,,,,,,0,,,,,T,terres,,,1411,0.638982,46.718476
2023-1150515,2023-07-21,000001,Vente,16000,,,LES AUMONERIES,B004,86450,86072,Chenevelles,86,,,860720000G0023,,,,,,,,,,,,,0,,,,,BT,taillis simples,,,1620,0.644881,46.725934
2023-1150515,2023-07-21,000001,Vente,16000,,,LES AUMONERIES,B004,86450,86072,Chenevelles,86,,,860720000G0028,,,,,,,,,,,,,0,,,,,BT,taillis simples,,,700,0.646926,46.725985
2023-1150515,2023-07-21,000001,Vente,16000,,,LES AUMONERIES,B004,86450,86072,Chenevelles,86,,,860720000G0030,,,,,,,,,,,,,0,,,,,BT,taillis simples,,,6540,0.646318,46.725159
2023-1150515,2023-07-21,000001,Vente,16000,,,LA GARDE,B099,86450,86072,Chenevelles,86,,,860720000G0306,,,,,,,,,,,,,0,,,,,T,terres,,,6055,0.643368,46.723904
2023-1150515,2023-07-21,000001,Vente,16000,,,LA GARDE,B099,86450,86072,Chenevelles,86,,,860720000G0467,,,,,,,,,,,,,0,,,,,T,terres,,,13980,0.643641,46.722805
2023-1150515,2023-07-21,000001,Vente,16000,,,LES LIGNES,B132,86450,86072,Chenevelles,86,,,860720000G0475,,,,,,,,,,,,,0,,,,,T,terres,,,1058,0.643464,46.722782
2023-1150515,2023-07-21,000001,Vente,16000,,,LA GARDE,B099,86450,86072,Chenevelles,86,,,860720000G0581,,,,,,,,,,,,,0,,,,,J,jardins,,,3,0.644623,46.724189
2023-1150515,2023-07-21,000001,Vente,16000,,,LA GARDE,B099,86450,86072,Chenevelles,86,,,860720000G0583,,,,,,,,,,,,,0,,,,,T,terres,,,7437,0.644457,46.723688
2023-1150515,2023-07-21,000001,Vente,16000,,,LA GARDE,B099,86450,86072,Chenevelles,86,,,860720000G0584,,,,,,,,,,,,,0,,,,,T,terres,,,51,0.644679,46.724239
2023-1150515,2023-07-21,000001,Vente,16000,,,LA GARDE,B099,86450,86072,Chenevelles,86,,,860720000G0585,,,,,,,,,,,,,0,,,,,T,terres,,,691,0.643885,46.723864
2023-1150515,2023-07-21,000001,Vente,16000,,,LES GROSERIES,B125,86450,86072,Chenevelles,86,,,860720000G0589,,,,,,,,,,,,,0,,,,,T,terres,,,24000,0.647832,46.724441
2023-1150515,2023-07-21,000001,Vente,16000,,,LES GROSERIES,B125,86450,86072,Chenevelles,86,,,860720000G0589,,,,,,,,,,,,,0,,,,,BT,taillis simples,,,3406,0.647832,46.724441
2023-1150686,2023-08-01,000001,Vente,700,,,LES LANDAVAUX,B131,86450,86072,Chenevelles,86,,,860720000H0009,,,,,,,,,,,,,0,,,,,L,landes,,,2198,0.640806,46.743027
2023-1150686,2023-08-01,000001,Vente,700,,,LES LANDAVAUX,B131,86450,86072,Chenevelles,86,,,860720000H0041,,,,,,,,,,,,,0,,,,,VI,vignes,,,2030,0.639437,46.741825
2023-1150686,2023-08-01,000001,Vente,700,,,LES LANDAVAUX,B131,86450,86072,Chenevelles,86,,,860720000H0042,,,,,,,,,,,,,0,,,,,T,terres,,,1360,0.639351,46.741665
2023-1150686,2023-08-01,000001,Vente,700,,,LES LANDAVAUX,B131,86450,86072,Chenevelles,86,,,860720000H0047,,,,,,,,,,,,,0,,,,,L,landes,,,1126,0.639216,46.740516
2023-1150686,2023-08-01,000001,Vente,700,,,LES LANDAVAUX,B131,86450,86072,Chenevelles,86,,,860720000H0048,,,,,,,,,,,,,0,,,,,T,terres,,,3178,0.638522,46.741094
2023-1150690,2023-07-25,000001,Vente,33280,,,LES MOLLACS,B148,86450,86072,Chenevelles,86,,,860720000B0649,,,,,,,,,,,,,0,,,,,T,terres,,,615,0.69514,46.733048
2023-1150690,2023-07-25,000001,Vente,33280,,,LE CHENE GRANDIN,B063,86450,86072,Chenevelles,86,,,860720000C0017,,,,,,,,,,,,,0,,,,,T,terres,,,32265,0.694974,46.731468
2023-1150690,2023-07-25,000001,Vente,33280,,,LE CHENE GRANDIN,B063,86450,86072,Chenevelles,86,,,860720000C0018,,,,,,,,,,,,,0,,,,,T,terres,,,2275,0.694945,46.732553
2023-1150690,2023-07-25,000001,Vente,33280,,,LE CHENE GRANDIN,B063,86450,86072,Chenevelles,86,,,860720000C0019,,,,,,,,,,,,,0,,,,,T,terres,,,14725,0.695812,46.733388
2023-1150690,2023-07-25,000001,Vente,33280,,,LA PRISE A BIRLY,B191,86450,86072,Chenevelles,86,,,860720000C0032,,,,,,,,,,,,,0,,,,,T,terres,,,67590,0.699423,46.731618
2023-1150690,2023-07-25,000001,Vente,33280,,,LE CHENE GRANDIN,B063,86450,86072,Chenevelles,86,,,860720000C0321,,,,,,,,,,,,,0,,,,,T,terres,,,1384,0.695777,46.732696
2023-1151311,2023-09-07,000001,Vente,134000,5,,RUE DE GUERSTLING,0025,86450,86072,Chenevelles,86,,,86072000AB0041,,,,,,,,,,,,,0,1,Maison,105,4,S,sols,,,442,0.654057,46.728262
2023-1151311,2023-09-07,000001,Vente,134000,5,,RUE DE GUERSTLING,0025,86450,86072,Chenevelles,86,,,86072000AB0041,,,,,,,,,,,,,0,3,Dépendance,,0,S,sols,,,442,0.654057,46.728262
2023-1151311,2023-09-07,000001,Vente,134000,,,LE BOURG,B024,86450,86072,Chenevelles,86,,,86072000AB0171,,,,,,,,,,,,,0,,,,,S,sols,,,16,0.654231,46.728747
2023-1151311,2023-09-07,000001,Vente,134000,,,LE BOURG,B024,86450,86072,Chenevelles,86,,,86072000AB0173,,,,,,,,,,,,,0,,,,,S,sols,,,9,0.654356,46.728543
2023-1151311,2023-09-07,000001,Vente,134000,,,LE BOURG,B024,86450,86072,Chenevelles,86,,,86072000AB0213,,,,,,,,,,,,,0,,,,,S,sols,,,12,0.654031,46.728332
2023-1151311,2023-09-07,000001,Vente,134000,,,LE BOURG,B024,86450,86072,Chenevelles,86,,,86072000AB0216,,,,,,,,,,,,,0,,,,,S,sols,,,1,0.654109,46.7284
2023-1151311,2023-09-07,000001,Vente,134000,,,LE BOURG,B024,86450,86072,Chenevelles,86,,,86072000AB0217,,,,,,,,,,,,,0,,,,,S,sols,,,2,0.654071,46.72836
2023-1151311,2023-09-07,000001,Vente,134000,,,LE BOURG,B024,86450,86072,Chenevelles,86,,,86072000AB0218,,,,,,,,,,,,,0,,,,,S,sols,,,4,0.653981,46.72832
2023-1151311,2023-09-07,000001,Vente,134000,,,LE BOURG,B024,86450,86072,Chenevelles,86,,,86072000AB0219,,,,,,,,,,,,,0,,,,,S,sols,,,77,0.653925,46.728311
2023-1151311,2023-09-07,000001,Vente,134000,,,LE BOURG,B024,86450,86072,Chenevelles,86,,,86072000AB0221,,,,,,,,,,,,,0,,,,,J,jardins,,,1292,0.654249,46.728507
2023-1151392,2023-09-08,000001,Vente,100000,,,LE BOURG,B024,86450,86072,Chenevelles,86,,,86072000AB0232,,,,,,,,,,,,,0,,,,,S,sols,,,10,0.65377,46.728711
2023-1151392,2023-09-08,000001,Vente,100000,15,,RUE RAYMOND D ARGENCE,0040,86450,86072,Chenevelles,86,,,86072000AB0234,,,,,,,,,,,,,0,1,Maison,71,3,S,sols,,,301,0.653686,46.728678
2023-1151392,2023-09-08,000001,Vente,100000,,,LE BOURG,B024,86450,86072,Chenevelles,86,,,86072000AB0242,,,,,,,,,,,,,0,,,,,S,sols,,,72,0.653522,46.728774
2023-1151395,2023-09-13,000001,Vente,500,,,LE BOURG,B024,86450,86072,Chenevelles,86,,,86072000AB0055,,,,,,,,,,,,,0,,,,,T,terres,,,932,0.654105,46.725991
