id_mutation,date_mutation,numero_disposition,nature_mutation,valeur_fonciere,adresse_numero,adresse_suffixe,adresse_nom_voie,adresse_code_voie,code_postal,code_commune,nom_commune,code_departement,ancien_code_commune,ancien_nom_commune,id_parcelle,ancien_id_parcelle,numero_volume,lot1_numero,lot1_surface_carrez,lot2_numero,lot2_surface_carrez,lot3_numero,lot3_surface_carrez,lot4_numero,lot4_surface_carrez,lot5_numero,lot5_surface_carrez,nombre_lots,code_type_local,type_local,surface_reelle_bati,nombre_pieces_principales,code_nature_culture,nature_culture,code_nature_culture_speciale,nature_culture_speciale,surface_terrain,longitude,latitude
2023-1144844,2023-01-20,000001,Vente,37500,6,,RUE DU TREUIL,0380,86600,86080,Cloué,86,,,860800000B1320,,,,,,,,,,,,,0,3,Dépendance,,0,S,sols,,,463,0.162597,46.442485
2023-1144844,2023-01-20,000001,Vente,37500,6,,RUE DU TREUIL,0380,86600,86080,Cloué,86,,,860800000B1320,,,,,,,,,,,,,0,1,Maison,48,2,S,sols,,,463,0.162597,46.442485
2023-1144844,2023-01-20,000001,Vente,37500,6,,RUE DU TREUIL,0380,86600,86080,Cloué,86,,,860800000B1320,,,,,,,,,,,,,0,3,Dépendance,,0,S,sols,,,463,0.162597,46.442485
2023-1144844,2023-01-20,000001,Vente,37500,6,,RUE DU TREUIL,0380,86600,86080,Cloué,86,,,860800000B1320,,,,,,,,,,,,,0,3,Dépendance,,0,S,sols,,,463,0.162597,46.442485
2023-1145849,2023-03-09,000001,Vente,129000,,,LA GAUGRENIERE,B060,86600,86080,Cloué,86,,,860800000A0169,,,,,,,,,,,,,0,,,,,T,terres,,,3425,0.168903,46.448579
2023-1145849,2023-03-09,000001,Vente,129000,,,LA GAUGRENIERE,B060,86600,86080,Cloué,86,,,860800000A0170,,,,,,,,,,,,,0,,,,,P,prés,,,6045,0.169942,46.448961
2023-1145849,2023-03-09,000001,Vente,129000,,,LA GAUGRENIERE,B060,86600,86080,Cloué,86,,,860800000A0171,,,,,,,,,,,,,0,,,,,S,sols,,,300,0.169474,46.449258
2023-1145849,2023-03-09,000001,Vente,129000,,,LA GAUGRENIERE,B060,86600,86080,Cloué,86,,,860800000A0171,,,,,,,,,,,,,0,,,,,P,prés,,,1540,0.169474,46.449258
2023-1145849,2023-03-09,000001,Vente,129000,5113,,LA GAUGRENIERE,B060,86600,86080,Cloué,86,,,860800000A0172,,,,,,,,,,,,,0,1,Maison,85,3,S,sols,,,2990,0.168913,46.449164
2023-1145849,2023-03-09,000001,Vente,129000,,,LA GAUGRENIERE,B060,86600,86080,Cloué,86,,,860800000A0173,,,,,,,,,,,,,0,,,,,J,jardins,,,1560,0.168934,46.449597
2023-1145849,2023-03-09,000001,Vente,129000,,,LA GAUGRENIERE,B060,86600,86080,Cloué,86,,,860800000A0755,,,,,,,,,,,,,0,,,,,VI,vignes,,,1200,0.168605,46.449223
2023-1146574,2023-04-03,000001,Vente,28363.2,,,LES RENFERMES DU MOULIN A,B119,86600,86080,Cloué,86,,,860800000B1314,,,,,,,,,,,,,0,,,,,AB,terrains a bâtir,,,622,0.16377,46.444631
2023-1148617,2023-06-15,000001,Vente,97000,2,,RUE DE BEAULIEU,0050,86600,86080,Cloué,86,,,860800000B0197,,,,,,,,,,,,,0,3,Dépendance,,0,S,sols,,,315,0.161745,46.440896
2023-1148617,2023-06-15,000001,Vente,97000,2,,RUE DE BEAULIEU,0050,86600,86080,Cloué,86,,,860800000B0197,,,,,,,,,,,,,0,1,Maison,98,3,S,sols,,,315,0.161745,46.440896
2023-1148617,2023-06-15,000001,Vente,97000,,,BEAULIEU,B005,86600,86080,Cloué,86,,,860800000B1128,,,,,,,,,,,,,0,,,,,S,sols,,,37,0.16159,46.440941
2023-1148977,2023-06-08,000001,Vente,29275.2,,,LES RENFERMES DU MOULIN A,B119,86600,86080,Cloué,86,,,860800000B1313,,,,,,,,,,,,,0,,,,,AB,terrains a bâtir,,,642,0.164041,46.444569
2023-1149463,2023-06-30,000001,Vente,196800,,,LE HAUT DE LEIGNE,B073,86600,86080,Cloué,86,,,860800000C0101,,,,,,,,,,,,,0,,,,,P,prés,,,4830,0.153909,46.432815
2023-1149463,2023-06-30,000001,Vente,196800,5082,,LE HAUT DE LEIGNE,B073,86600,86080,Cloué,86,,,860800000C0102,,,,,,,,,,,,,0,1,Maison,85,4,S,sols,,,2970,0.153555,46.432918
2023-1149463,2023-06-30,000001,Vente,196800,5082,,LE HAUT DE LEIGNE,B073,86600,86080,Cloué,86,,,860800000C0102,,,,,,,,,,,,,0,3,Dépendance,,0,S,sols,,,2970,0.153555,46.432918
2023-1149463,2023-06-30,000001,Vente,196800,,,LE HAUT DE LEIGNE,B073,86600,86080,Cloué,86,,,860800000C0103,,,,,,,,,,,,,0,,,,,T,terres,,,2485,0.154177,46.433418
2023-1149463,2023-06-30,000001,Vente,196800,,,LE HAUT DE LEIGNE,B073,86600,86080,Cloué,86,,,860800000C0104,,,,,,,,,,,,,0,,,,,L,landes,,,8630,0.154639,46.434081
2023-1150704,2023-08-01,000001,Vente,190000,5215,,LA GAUGRENIERE,B060,86600,86080,Cloué,86,,,860800000A0168,,,,,,,,,,,,,0,1,Maison,147,5,S,sols,,,500,0.168064,46.448492
2023-1150704,2023-08-01,000001,Vente,190000,5215,,LA GAUGRENIERE,B060,86600,86080,Cloué,86,,,860800000A0168,,,,,,,,,,,,,0,1,Maison,147,5,J,jardins,,,10810,0.168064,46.448492
2023-1152046,2023-09-29,000001,Vente,761,,,LIBERRIERE,B076,86600,86080,Cloué,86,,,860800000A1235,,,,,,,,,,,,,0,,,,,T,terres,,,1121,0.17281,46.45782
2023-1152046,2023-09-29,000001,Vente,761,,,LIBERRIERE,B076,86600,86080,Cloué,86,,,860800000A1236,,,,,,,,,,,,,0,,,,,T,terres,,,400,0.172998,46.457733
2023-1152046,2023-09-29,000001,Vente,761,,,LIBERRIERE,B076,86600,86080,Cloué,86,,,860800000A1237,,,,,,,,,,,,,0,,,,,T,terres,,,2,0.173229,46.457584
2023-1153647,2023-11-27,000001,Vente,199,,,LIBERRIERE,B076,86600,86080,Cloué,86,,,860800000A1239,,,,,,,,,,,,,0,,,,,AB,terrains a bâtir,,,398,0.17307,46.457785
2023-1154041,2023-12-08,000001,Vente,220000,1,,RUE DU MEUNIER,0353,86600,86080,Cloué,86,,,860800000B1287,,,,,,,,,,,,,0,1,Maison,112,5,S,sols,,,1100,0.162191,46.444709
2023-1155202,2023-10-10,000001,Adjudication,60000,5249,F,LA MAROTTE,B083,86600,86080,Cloué,86,,,860800000B0722,,,,,,,,,,,,,0,4,Local industriel. commercial ou assimilé,474,0,S,sols,,,2410,0.160639,46.44136
