id_mutation,date_mutation,numero_disposition,nature_mutation,valeur_fonciere,adresse_numero,adresse_suffixe,adresse_nom_voie,adresse_code_voie,code_postal,code_commune,nom_commune,code_departement,ancien_code_commune,ancien_nom_commune,id_parcelle,ancien_id_parcelle,numero_volume,lot1_numero,lot1_surface_carrez,lot2_numero,lot2_surface_carrez,lot3_numero,lot3_surface_carrez,lot4_numero,lot4_surface_carrez,lot5_numero,lot5_surface_carrez,nombre_lots,code_type_local,type_local,surface_reelle_bati,nombre_pieces_principales,code_nature_culture,nature_culture,code_nature_culture_speciale,nature_culture_speciale,surface_terrain,longitude,latitude
2023-1144439,2023-01-17,000001,Echange,7888,,,FOSSE GRANDE,B037,86800,86135,Liniers,86,,,861350000C0058,,,,,,,,,,,,,0,,,,,T,terres,,,6390,0.551238,46.610023
2023-1144439,2023-01-17,000001,Echange,7888,,,FOSSE GRANDE,B037,86800,86135,Liniers,86,,,861350000C0070,,,,,,,,,,,,,0,,,,,T,terres,,,1500,0.54552,46.603746
2023-1144439,2023-01-17,000001,Echange,7888,,,FOSSE GRANDE,B037,86800,86135,Liniers,86,,,861350000C0071,,,,,,,,,,,,,0,,,,,T,terres,,,730,0.545545,46.60364
2023-1144439,2023-01-17,000001,Echange,7888,,,FOSSE GRANDE,B037,86800,86135,Liniers,86,,,861350000C0072,,,,,,,,,,,,,0,,,,,T,terres,,,1520,0.545581,46.603558
2023-1144439,2023-01-17,000001,Echange,7888,,,FOSSE GRANDE,B037,86800,86135,Liniers,86,,,861350000C0073,,,,,,,,,,,,,0,,,,,T,terres,,,6250,0.545875,46.603315
2023-1144439,2023-01-17,000002,Echange,7888,,,LA BREMONDIERE,B013,86800,86135,Liniers,86,,,86135000ZB0031,,,,,,,,,,,,,0,,,,,T,terres,,,7010,0.559707,46.604993
2023-1144439,2023-01-17,000002,Echange,7888,,,LA BREMONDIERE,B013,86800,86135,Liniers,86,,,86135000ZB0032,,,,,,,,,,,,,0,,,,,T,terres,,,12710,0.558967,46.605412
2023-1144571,2023-01-13,000001,Vente,20000,,,CLOS DE LA CURE,B025,86800,86135,Liniers,86,,,861350000D0851,,,,,,,,,,,,,0,,,,,T,terres,,,619,0.534797,46.60719
2023-1145185,2023-02-15,000001,Vente,145000,,,LES TIFFOLIERES,B065,86800,86135,Liniers,86,,,86135000ZA0088,,,,,,,,,,,,,0,,,,,T,terres,,,332,0.561669,46.62276
2023-1145185,2023-02-15,000001,Vente,145000,,,LES TIFFOLIERES,B065,86800,86135,Liniers,86,,,86135000ZA0089,,,,,,,,,,,,,0,,,,,S,sols,,,671,0.562169,46.622804
2023-1146163,2023-03-16,000001,Vente,3000,,,LES TIFFOLIERES,B065,86800,86135,Liniers,86,,,86135000ZA0090,,,,,,,,,,,,,0,,,,,S,sols,,,63,0.562309,46.622791
2023-1147019,2023-04-14,000001,Vente,12000,5063,A,FOSSE MARION,B038,86800,86135,Liniers,86,,,861350000D0523,,,,,,,,,,,,,0,3,Dépendance,,0,J,jardins,,,2085,0.533698,46.60602
2023-1147019,2023-04-14,000001,Vente,12000,5063,A,FOSSE MARION,B038,86800,86135,Liniers,86,,,861350000D0523,,,,,,,,,,,,,0,3,Dépendance,,0,J,jardins,,,2085,0.533698,46.60602
2023-1147019,2023-04-14,000001,Vente,12000,5063,A,FOSSE MARION,B038,86800,86135,Liniers,86,,,861350000D0523,,,,,,,,,,,,,0,1,Maison,18,1,J,jardins,,,2085,0.533698,46.60602
2023-1147019,2023-04-14,000001,Vente,12000,5063,A,FOSSE MARION,B038,86800,86135,Liniers,86,,,861350000D0523,,,,,,,,,,,,,0,1,Maison,18,1,S,sols,,,30,0.533698,46.60602
2023-1147019,2023-04-14,000001,Vente,12000,5063,A,FOSSE MARION,B038,86800,86135,Liniers,86,,,861350000D0523,,,,,,,,,,,,,0,3,Dépendance,,0,S,sols,,,30,0.533698,46.60602
2023-1147019,2023-04-14,000001,Vente,12000,5063,A,FOSSE MARION,B038,86800,86135,Liniers,86,,,861350000D0523,,,,,,,,,,,,,0,3,Dépendance,,0,S,sols,,,30,0.533698,46.60602
2023-1147019,2023-04-14,000001,Vente,12000,,,FOSSE MARION,B038,86800,86135,Liniers,86,,,861350000D0753,,,,,,,,,,,,,0,,,,,J,jardins,,,35,0.533969,46.606282
2023-1149686,2023-06-30,000001,Vente,1000,,,LES MOEURS,B051,86800,86135,Liniers,86,,,861350000E0115,,,,,,,,,,,,,0,,,,,T,terres,,,385,0.4953,46.617824
2023-1149686,2023-06-30,000001,Vente,1000,,,LES MOEURS,B051,86800,86135,Liniers,86,,,861350000E0241,,,,,,,,,,,,,0,,,,,BT,taillis simples,,,1978,0.494014,46.616386
2023-1149686,2023-06-30,000001,Vente,1000,,,LES MOEURS,B051,86800,86135,Liniers,86,,,861350000E0253,,,,,,,,,,,,,0,,,,,T,terres,,,1661,0.495407,46.617672
2023-1149687,2023-06-30,000002,Vente,234000,,,LES MOEURS,B051,86800,86135,Liniers,86,,,861350000E0114,,,,,,,,,,,,,0,,,,,T,terres,,,500,0.495386,46.616816
2023-1149687,2023-06-30,000002,Vente,234000,,,LES MOEURS,B051,86800,86135,Liniers,86,,,861350000E0118,,,,,,,,,,,,,0,,,,,L,landes,,,1715,0.494484,46.616731
2023-1149687,2023-06-30,000002,Vente,234000,,,LES MOEURS,B051,86800,86135,Liniers,86,,,861350000E0237,,,,,,,,,,,,,0,,,,,T,terres,,,1490,0.495693,46.617396
2023-1149687,2023-06-30,000002,Vente,234000,,,LES MOEURS,B051,86800,86135,Liniers,86,,,861350000E0239,,,,,,,,,,,,,0,,,,,BT,taillis simples,,,2048,0.494071,46.618311
2023-1149687,2023-06-30,000002,Vente,234000,,,LES MOEURS,B051,86800,86135,Liniers,86,,,861350000E0240,,,,,,,,,,,,,0,,,,,BT,taillis simples,,,2990,0.494122,46.617267
2023-1149687,2023-06-30,000002,Vente,234000,5182,,LES MOEURS,B051,86800,86135,Liniers,86,,,861350000E0252,,,,,,,,,,,,,0,1,Maison,140,5,S,sols,,,1227,0.495781,46.616339
2023-1149687,2023-06-30,000002,Vente,234000,,,LES MOEURS,B051,86800,86135,Liniers,86,,,861350000E0254,,,,,,,,,,,,,0,,,,,T,terres,,,1661,0.495517,46.616859
2023-1149687,2023-06-30,000002,Vente,234000,,,LES MOEURS,B051,86800,86135,Liniers,86,,,861350000E0287,,,,,,,,,,,,,0,,,,,L,landes,,,1074,0.494469,46.617164
2023-1149687,2023-06-30,000002,Vente,234000,,,LES MOEURS,B051,86800,86135,Liniers,86,,,861350000E0289,,,,,,,,,,,,,0,,,,,L,landes,,,218,0.494784,46.61654
2023-1151587,2023-09-06,000001,Echange,200,,,LA LOGE,B044,86800,86135,Liniers,86,,,861350000B0702,,,,,,,,,,,,,0,,,,,S,sols,,,16,0.545262,46.614031
2023-1151587,2023-09-06,000002,Echange,200,,,LA LOGE,B044,86800,86135,Liniers,86,,,861350000B0705,,,,,,,,,,,,,0,,,,,S,sols,,,32,0.545213,46.614131
2023-1152321,2023-09-19,000001,Vente,110525,,,LA TOUCHE MATOUZEAU,B067,86800,86135,Liniers,86,,,86135000ZK0016,,,,,,,,,,,,,0,,,,,T,terres,,,13610,0.550028,46.623271
2023-1152321,2023-09-19,000001,Vente,110525,,,LA TOUCHE MATOUZEAU,B067,86800,86135,Liniers,86,,,86135000ZK0016,,,,,,,,,,,,,0,,,,,L,landes,,,820,0.550028,46.623271
2023-1152321,2023-09-19,000001,Vente,110525,5112,,RTE DE LA TOUCHE,0080,86800,86135,Liniers,86,,,86135000ZK0048,,,,,,,,,,,,,0,1,Maison,109,4,S,sols,,,1008,0.549931,46.623117
2023-1152321,2023-09-19,000001,Vente,110525,5112,,RTE DE LA TOUCHE,0080,86800,86135,Liniers,86,,,86135000ZK0048,,,,,,,,,,,,,0,3,Dépendance,,0,S,sols,,,1008,0.549931,46.623117
2023-1152614,2023-10-09,000001,Vente,1000,,,LE BROUILLAC,B014,86800,86135,Liniers,86,,,861350000C0180,,,,,,,,,,,,,0,,,,,T,terres,,,2835,0.538526,46.604743
2023-1152698,2023-10-10,000001,Vente,290000,,,LA BOULARDIERE,B007,86800,86135,Liniers,86,,,861350000B0541,,,,,,,,,,,,,0,,,,,T,terres,,,1353,0.547333,46.615498
2023-1152698,2023-10-10,000001,Vente,290000,2,,IMP DE L'ADOUE,0004,86800,86135,Liniers,86,,,861350000B0543,,,,,,,,,,,,,0,3,Dépendance,,0,S,sols,,,395,0.546841,46.615409
2023-1152698,2023-10-10,000001,Vente,290000,2,,IMP DE L'ADOUE,0004,86800,86135,Liniers,86,,,861350000B0543,,,,,,,,,,,,,0,1,Maison,200,5,S,sols,,,395,0.546841,46.615409
2023-1152698,2023-10-10,000001,Vente,290000,2,,IMP DE L'ADOUE,0004,86800,86135,Liniers,86,,,861350000B0543,,,,,,,,,,,,,0,3,Dépendance,,0,S,sols,,,395,0.546841,46.615409
2023-1152698,2023-10-10,000001,Vente,290000,2,,IMP DE L'ADOUE,0004,86800,86135,Liniers,86,,,861350000B0543,,,,,,,,,,,,,0,3,Dépendance,,0,S,sols,,,395,0.546841,46.615409
2023-1152698,2023-10-10,000001,Vente,290000,,,LA BOULARDIERE,B007,86800,86135,Liniers,86,,,861350000B0545,,,,,,,,,,,,,0,,,,,S,sols,,,14,0.546677,46.615474
2023-1152698,2023-10-10,000001,Vente,290000,,,LA BOULARDIERE,B007,86800,86135,Liniers,86,,,861350000B0547,,,,,,,,,,,,,0,,,,,T,terres,,,817,0.547733,46.615289
2023-1152698,2023-10-10,000001,Vente,290000,,,LA BOULARDIERE,B007,86800,86135,Liniers,86,,,861350000B0549,,,,,,,,,,,,,0,,,,,S,sols,,,73,0.546616,46.615441
2023-1152698,2023-10-10,000001,Vente,290000,,,LA BOULARDIERE,B007,86800,86135,Liniers,86,,,861350000B0590,,,,,,,,,,,,,0,,,,,T,terres,,,736,0.547838,46.615466
2023-1152698,2023-10-10,000001,Vente,290000,,,LA BOULARDIERE,B007,86800,86135,Liniers,86,,,861350000B0692,,,,,,,,,,,,,0,,,,,T,terres,,,414,0.547171,46.615697
2023-1152698,2023-10-10,000001,Vente,290000,,,LA BOULARDIERE,B007,86800,86135,Liniers,86,,,861350000B0694,,,,,,,,,,,,,0,,,,,T,terres,,,816,0.547065,46.615836
2023-1152698,2023-10-10,000001,Vente,290000,,,LA MAISON NEUVE,B047,86800,86135,Liniers,86,,,861350000B0695,,,,,,,,,,,,,0,,,,,T,terres,,,2031,0.547493,46.616027
2023-1152698,2023-10-10,000001,Vente,290000,,,LA MAISON NEUVE,B047,86800,86135,Liniers,86,,,861350000B0696,,,,,,,,,,,,,0,,,,,T,terres,,,849,0.54729,46.616053
2023-1152698,2023-10-10,000001,Vente,290000,,,LA BOULARDIERE,B007,86800,86135,Liniers,86,,,861350000B0697,,,,,,,,,,,,,0,,,,,T,terres,,,140,0.5472,46.615947
