id_mutation,date_mutation,numero_disposition,nature_mutation,valeur_fonciere,adresse_numero,adresse_suffixe,adresse_nom_voie,adresse_code_voie,code_postal,code_commune,nom_commune,code_departement,ancien_code_commune,ancien_nom_commune,id_parcelle,ancien_id_parcelle,numero_volume,lot1_numero,lot1_surface_carrez,lot2_numero,lot2_surface_carrez,lot3_numero,lot3_surface_carrez,lot4_numero,lot4_surface_carrez,lot5_numero,lot5_surface_carrez,nombre_lots,code_type_local,type_local,surface_reelle_bati,nombre_pieces_principales,code_nature_culture,nature_culture,code_nature_culture_speciale,nature_culture_speciale,surface_terrain,longitude,latitude
2023-1164722,2023-01-17,000001,Vente,40000,22,,RUE GRANDE RUE,0040,88320,88062,Blevaincourt,88,,,88062000ZA0081,,,,,,,,,,,,,0,1,Maison,60,3,S,sols,,,403,5.682158,48.123991
2023-1164722,2023-01-17,000001,Vente,40000,22,,RUE GRANDE RUE,0040,88320,88062,Blevaincourt,88,,,88062000ZA0081,,,,,,,,,,,,,0,1,Maison,60,3,J,jardins,,,560,5.682158,48.123991
2023-1165107,2023-02-08,000001,Vente,14500,14,,RUE DE L EGLISE,B157,88320,88062,Blevaincourt,88,,,88062000ZA0119,,,,,,,,,,,,,0,1,Maison,148,4,S,sols,,,606,5.682748,48.124909
2023-1165107,2023-02-08,000001,Vente,14500,14,,RUE DE L EGLISE,B157,88320,88062,Blevaincourt,88,,,88062000ZA0119,,,,,,,,,,,,,0,1,Maison,148,4,J,jardins,,,534,5.682748,48.124909
2023-1167442,2023-04-28,000001,Vente,318376,,,VOYE DE GERMAINVILLERS,B182,88320,88062,Blevaincourt,88,,,88062000ZL0005,,,,,,,,,,,,,0,,,,,P,prés,,,20000,5.674588,48.119302
2023-1167442,2023-04-28,000001,Vente,318376,,,VOYE DE GERMAINVILLERS,B182,88320,88062,Blevaincourt,88,,,88062000ZL0005,,,,,,,,,,,,,0,,,,,P,prés,,,13842,5.674588,48.119302
2023-1167442,2023-04-28,000001,Vente,318376,,,VOYE DE GERMAINVILLERS,B182,88320,88062,Blevaincourt,88,,,88062000ZL0005,,,,,,,,,,,,,0,,,,,S,sols,,,9000,5.674588,48.119302
2023-1169279,2023-07-17,000001,Vente,12000,3,,RUE GRANDE RUE,0040,88320,88062,Blevaincourt,88,,,88062000ZA0103,,,,,,,,,,,,,0,1,Maison,55,2,J,jardins,,,74,5.681178,48.125444
2023-1169279,2023-07-17,000001,Vente,12000,3,,RUE GRANDE RUE,0040,88320,88062,Blevaincourt,88,,,88062000ZA0103,,,,,,,,,,,,,0,1,Maison,55,2,S,sols,,,276,5.681178,48.125444
2023-1169786,2023-08-02,000001,Vente,2500,,,LE SAUVEUIL,B194,88320,88062,Blevaincourt,88,,,88062000ZA0004,,,,,,,,,,,,,0,,,,,P,prés,,,1053,5.678127,48.124667
