id_mutation,date_mutation,numero_disposition,nature_mutation,valeur_fonciere,adresse_numero,adresse_suffixe,adresse_nom_voie,adresse_code_voie,code_postal,code_commune,nom_commune,code_departement,ancien_code_commune,ancien_nom_commune,id_parcelle,ancien_id_parcelle,numero_volume,lot1_numero,lot1_surface_carrez,lot2_numero,lot2_surface_carrez,lot3_numero,lot3_surface_carrez,lot4_numero,lot4_surface_carrez,lot5_numero,lot5_surface_carrez,nombre_lots,code_type_local,type_local,surface_reelle_bati,nombre_pieces_principales,code_nature_culture,nature_culture,code_nature_culture_speciale,nature_culture_speciale,surface_terrain,longitude,latitude
2023-1167767,2023-05-30,000001,Vente,300000,52,,MOULIN DE VANEL,B128,88800,88285,Mandres-sur-Vair,88,,,882850000D1115,,,,,,,,,,,,,0,4,Local industriel. commercial ou assimilé,1386,0,S,sols,,,965,5.894936,48.240143
2023-1167767,2023-05-30,000001,Vente,300000,52,,MOULIN DE VANEL,B128,88800,88285,Mandres-sur-Vair,88,,,882850000D1115,,,,,,,,,,,,,0,2,Appartement,50,2,S,sols,,,965,5.894936,48.240143
2023-1167767,2023-05-30,000001,Vente,300000,52,,MOULIN DE VANEL,B128,88800,88285,Mandres-sur-Vair,88,,,882850000D1115,,,,,,,,,,,,,0,3,Dépendance,,0,S,sols,,,965,5.894936,48.240143
2023-1167767,2023-05-30,000001,Vente,300000,52,,MOULIN DE VANEL,B128,88800,88285,Mandres-sur-Vair,88,,,882850000D1115,,,,,,,,,,,,,0,3,Dépendance,,0,S,sols,,,965,5.894936,48.240143
2023-1167767,2023-05-30,000001,Vente,300000,52,,MOULIN DE VANEL,B128,88800,88285,Mandres-sur-Vair,88,,,882850000D1115,,,,,,,,,,,,,0,3,Dépendance,,0,S,sols,,,965,5.894936,48.240143
2023-1167767,2023-05-30,000001,Vente,300000,52,,MOULIN DE VANEL,B128,88800,88285,Mandres-sur-Vair,88,,,882850000D1115,,,,,,,,,,,,,0,2,Appartement,160,10,S,sols,,,965,5.894936,48.240143
2023-1167767,2023-05-30,000001,Vente,300000,52,,MOULIN DE VANEL,B128,88800,88285,Mandres-sur-Vair,88,,,882850000D1115,,,,,,,,,,,,,0,2,Appartement,75,4,S,sols,,,965,5.894936,48.240143
2023-1167767,2023-05-30,000001,Vente,300000,52,,MOULIN DE VANEL,B128,88800,88285,Mandres-sur-Vair,88,,,882850000D1115,,,,,,,,,,,,,0,2,Appartement,65,3,S,sols,,,965,5.894936,48.240143
2023-1167767,2023-05-30,000001,Vente,300000,52,,MOULIN DE VANEL,B128,88800,88285,Mandres-sur-Vair,88,,,882850000D1115,,,,,,,,,,,,,0,2,Appartement,45,2,S,sols,,,965,5.894936,48.240143
2023-1167767,2023-05-30,000001,Vente,300000,,,MOULIN DE VANEL,B128,88800,88285,Mandres-sur-Vair,88,,,882850000D1116,,,,,,,,,,,,,0,,,,,S,sols,,,16,5.895211,48.240332
2023-1167767,2023-05-30,000001,Vente,300000,,,MOULIN DE VANEL,B128,88800,88285,Mandres-sur-Vair,88,,,882850000D1117,,,,,,,,,,,,,0,,,,,S,sols,,,27,5.895176,48.240417
2023-1167767,2023-05-30,000001,Vente,300000,32,,MOULIN DE VANEL,B128,88800,88285,Mandres-sur-Vair,88,,,882850000D1118,,,,,,,,,,,,,0,3,Dépendance,,0,S,sols,,,279,5.894652,48.240499
2023-1167767,2023-05-30,000001,Vente,300000,32,,MOULIN DE VANEL,B128,88800,88285,Mandres-sur-Vair,88,,,882850000D1118,,,,,,,,,,,,,0,3,Dépendance,,0,S,sols,,,279,5.894652,48.240499
2023-1167767,2023-05-30,000001,Vente,300000,,,MOULIN DE VANEL,B128,88800,88285,Mandres-sur-Vair,88,,,882850000D1119,,,,,,,,,,,,,0,,,,,S,sols,,,13,5.894507,48.24085
2023-1167767,2023-05-30,000001,Vente,300000,,,MOULIN DE VANEL,B128,88800,88285,Mandres-sur-Vair,88,,,882850000D1120,,,,,,,,,,,,,0,,,,,S,sols,,,121,5.894924,48.240216
2023-1167767,2023-05-30,000001,Vente,300000,,,MOULIN DE VANEL,B128,88800,88285,Mandres-sur-Vair,88,,,882850000D1121,,,,,,,,,,,,,0,,,,,S,sols,,,828,5.895101,48.240128
2023-1167767,2023-05-30,000001,Vente,300000,,,MOULIN DE VANEL,B128,88800,88285,Mandres-sur-Vair,88,,,882850000D1218,,,,,,,,,,,,,0,,,,,S,sols,,,1887,5.894762,48.240811
2023-1167767,2023-05-30,000001,Vente,300000,,,MOULIN DE VANEL,B128,88800,88285,Mandres-sur-Vair,88,,,882850000D1219,,,,,,,,,,,,,0,,,,,S,sols,,,2038,5.895082,48.24044
2023-1167767,2023-05-30,000001,Vente,300000,,,MOULIN DE VANEL,B128,88800,88285,Mandres-sur-Vair,88,,,882850000D1275,,,,,,,,,,,,,0,,,,,S,sols,,,1162,5.894525,48.241167
2023-1167767,2023-05-30,000001,Vente,300000,,,MOULIN DE VANEL,B128,88800,88285,Mandres-sur-Vair,88,,,882850000D1276,,,,,,,,,,,,,0,,,,,S,sols,,,584,5.894509,48.241012
2023-1167767,2023-05-30,000001,Vente,300000,,,MOULIN DE VANEL,B128,88800,88285,Mandres-sur-Vair,88,,,882850000D1607,,,,,,,,,,,,,0,,,,,P,prés,,,2216,5.894115,48.241652
2023-1167896,2023-06-02,000001,Vente,25000,,,LES BOUVEROTS,B016,88800,88285,Mandres-sur-Vair,88,,,882850000A0397,,,,,,,,,,,,,0,,,,,P,prés,,,4579,5.901146,48.218166
2023-1167896,2023-06-02,000001,Vente,25000,,,LES BOUVEROTS,B016,88800,88285,Mandres-sur-Vair,88,,,882850000A0398,,,,,,,,,,,,,0,,,,,P,prés,,,717,5.901383,48.217529
2023-1167896,2023-06-02,000001,Vente,25000,,,LES BOUVEROTS,B016,88800,88285,Mandres-sur-Vair,88,,,882850000A0399,,,,,,,,,,,,,0,,,,,VE,vergers,,,1809,5.900506,48.218038
2023-1167896,2023-06-02,000001,Vente,25000,,,LES BOUVEROTS,B016,88800,88285,Mandres-sur-Vair,88,,,882850000A0400,,,,,,,,,,,,,0,,,,,J,jardins,,,520,5.90055,48.218128
2023-1167896,2023-06-02,000001,Vente,25000,1,,LES BOUVEROTS,B016,88800,88285,Mandres-sur-Vair,88,,,882850000A0401,,,,,,,,,,,,,0,4,Local industriel. commercial ou assimilé,30,0,S,sols,,,699,5.900327,48.21841
2023-1167896,2023-06-02,000001,Vente,25000,1,,LES BOUVEROTS,B016,88800,88285,Mandres-sur-Vair,88,,,882850000A0401,,,,,,,,,,,,,0,1,Maison,80,4,S,sols,,,699,5.900327,48.21841
2023-1167896,2023-06-02,000001,Vente,25000,,,LES BOUVEROTS,B016,88800,88285,Mandres-sur-Vair,88,,,882850000A0418,,,,,,,,,,,,,0,,,,,S,sols,,,220,5.900752,48.218406
2023-1167896,2023-06-02,000001,Vente,25000,,,PRE MEGUIN,B148,88800,88285,Mandres-sur-Vair,88,,,882850000B0036,,,,,,,,,,,,,0,,,,,P,prés,,,840,5.901,48.217537
2023-1169254,2023-07-11,000001,Vente,12000,,,DEVANT LE MOULIN DE VANEL,B062,88800,88285,Mandres-sur-Vair,88,,,882850000D1741,,,,,,,,,,,,,0,,,,,T,terres,,,2088,5.894008,48.238051
2023-1169254,2023-07-11,000001,Vente,12000,,,DEVANT LE MOULIN DE VANEL,B062,88800,88285,Mandres-sur-Vair,88,,,882850000D1741,,,,,,,,,,,,,0,,,,,VE,vergers,,,890,5.894008,48.238051
2023-1169254,2023-07-11,000001,Vente,12000,,,DEVANT LE MOULIN DE VANEL,B062,88800,88285,Mandres-sur-Vair,88,,,882850000D1741,,,,,,,,,,,,,0,,,,,T,terres,,,5282,5.894008,48.238051
2023-1171880,2023-10-10,000001,Vente,110000,19,,RUE MONSEIGNEUR RODHAIN,0024,88800,88285,Mandres-sur-Vair,88,,,882850000D0108,,,,,,,,,,,,,0,1,Maison,110,3,S,sols,,,443,5.891647,48.223082
