id_mutation,date_mutation,numero_disposition,nature_mutation,valeur_fonciere,adresse_numero,adresse_suffixe,adresse_nom_voie,adresse_code_voie,code_postal,code_commune,nom_commune,code_departement,ancien_code_commune,ancien_nom_commune,id_parcelle,ancien_id_parcelle,numero_volume,lot1_numero,lot1_surface_carrez,lot2_numero,lot2_surface_carrez,lot3_numero,lot3_surface_carrez,lot4_numero,lot4_surface_carrez,lot5_numero,lot5_surface_carrez,nombre_lots,code_type_local,type_local,surface_reelle_bati,nombre_pieces_principales,code_nature_culture,nature_culture,code_nature_culture_speciale,nature_culture_speciale,surface_terrain,longitude,latitude
2023-1165975,2023-03-17,000001,Vente,250,,,CHAMPS ROUGY ET CHAMP VOSG,B021,88270,88365,Racécourt,88,,,88365000ZD0014,,,,,,,,,,,,,0,,,,,P,prés,,,683,6.194254,48.260267
2023-1166854,2023-04-13,000001,Vente,3181.63,,,HAIE CHAUDRONNIERE OUEST,B086,88270,88365,Racécourt,88,,,88365000ZC0057,,,,,,,,,,,,,0,,,,,B,bois,AULN,Aulnaie,1020,6.203216,48.269387
2023-1166854,2023-04-13,000001,Vente,3181.63,,,HAIE CHAUDRONNIERE OUEST,B086,88270,88365,Racécourt,88,,,88365000ZC0060,,,,,,,,,,,,,0,,,,,B,bois,AULN,Aulnaie,1474,6.203279,48.268958
2023-1170985,2023-09-18,000001,Vente,190380,4,,RTE D AHEVILLE,0001,88270,88365,Racécourt,88,,,88365000AA0075,,,,,,,,,,,,,0,1,Maison,87,3,T,terres,,,2000,6.187986,48.259181
2023-1170985,2023-09-18,000001,Vente,190380,4,,RTE D AHEVILLE,0001,88270,88365,Racécourt,88,,,88365000AA0075,,,,,,,,,,,,,0,1,Maison,87,3,S,sols,,,680,6.187986,48.259181
2023-1171792,2023-10-20,000001,Vente,102800,,,A LA CHAPELLE,B025,88270,88365,Racécourt,88,,,88365000ZB0121,,,,,,,,,,,,,0,,,,,T,terres,,,1202,6.191417,48.259505
2023-1171792,2023-10-20,000001,Vente,102800,,,A LA CHAPELLE,B025,88270,88365,Racécourt,88,,,88365000ZB0129,,,,,,,,,,,,,0,,,,,T,terres,,,586,6.191122,48.259499
2023-1171811,2023-10-19,000001,Vente,73225.95,,,LA MARERIE DE BAZEGNEY,B104,88270,88365,Racécourt,88,,,88365000ZA0008,,,,,,,,,,,,,0,,,,,P,prés,,,28520,6.214713,48.265634
2023-1171811,2023-10-19,000001,Vente,73225.95,,,HAIE DES MIOTTES,B088,88270,88365,Racécourt,88,,,88365000ZC0047,,,,,,,,,,,,,0,,,,,T,terres,,,3585,6.212272,48.261724
2023-1171811,2023-10-19,000001,Vente,73225.95,,,HAIE DES MIOTTES,B088,88270,88365,Racécourt,88,,,88365000ZC0048,,,,,,,,,,,,,0,,,,,T,terres,,,15934,6.213027,48.260874
2023-1172057,2023-10-30,000001,Vente,80000,5,,RUE DES GRANDS CHAMPS,0035,88270,88365,Racécourt,88,,,88365000AA0017,,,,,,,,,,,,,0,1,Maison,85,3,S,sols,,,613,6.194285,48.257512
2023-1172212,2023-11-13,000001,Vente,850,,,CHAMPS DE VIGNE,B033,88270,88365,Racécourt,88,,,883650000A0058,,,,,,,,,,,,,0,,,,,VI,vignes,,,851,6.209859,48.26836
2023-1172212,2023-11-13,000001,Vente,850,,,CHAMPS DE VIGNE,B033,88270,88365,Racécourt,88,,,883650000A0059,,,,,,,,,,,,,0,,,,,VE,vergers,,,290,6.209263,48.268371
2023-1172212,2023-11-13,000001,Vente,850,,,CHAMPS DE VIGNE,B033,88270,88365,Racécourt,88,,,883650000A0062,,,,,,,,,,,,,0,,,,,VE,vergers,,,538,6.209139,48.268506
2023-1172212,2023-11-13,000001,Vente,850,,,CHAMPS DE VIGNE,B033,88270,88365,Racécourt,88,,,883650000A0063,,,,,,,,,,,,,0,,,,,VE,vergers,,,1430,6.209827,48.268523
2023-1172212,2023-11-13,000001,Vente,850,,,PAQUIS DE CHERPEGNOTTES,B121,88270,88365,Racécourt,88,,,883650000A0104,,,,,,,,,,,,,0,,,,,B,bois,AULN,Aulnaie,801,6.200815,48.272099
2023-1172484,2023-11-20,000001,Vente,2700,,,CHENILIEU,B030,88270,88365,Racécourt,88,,,883650000A0170,,,,,,,,,,,,,0,,,,,B,bois,AULN,Aulnaie,4758,6.196557,48.267745
2023-1172484,2023-11-20,000001,Vente,2700,,,LA GRANDE FLEURASSE,B079,88270,88365,Racécourt,88,,,883650000A0177,,,,,,,,,,,,,0,,,,,BR,futaies résineuses,,,11884,6.197148,48.269668
2023-1172484,2023-11-20,000001,Vente,2700,,,LA PETITE FLEURASSE,B129,88270,88365,Racécourt,88,,,883650000A0220,,,,,,,,,,,,,0,,,,,BR,futaies résineuses,,,13635,6.194992,48.267962
2023-1172672,2023-12-29,000001,Vente,1251,,,EFFATEUILLE,B063,88270,88365,Racécourt,88,,,88365000ZD0084,,,,,,,,,,,,,0,,,,,B,bois,AULN,Aulnaie,520,6.209222,48.259288
2023-1172672,2023-12-29,000001,Vente,1251,,,EFFATEUILLE,B063,88270,88365,Racécourt,88,,,88365000ZD0090,,,,,,,,,,,,,0,,,,,B,bois,AULN,Aulnaie,4731,6.208469,48.260141
