id_mutation,date_mutation,numero_disposition,nature_mutation,valeur_fonciere,adresse_numero,adresse_suffixe,adresse_nom_voie,adresse_code_voie,code_postal,code_commune,nom_commune,code_departement,ancien_code_commune,ancien_nom_commune,id_parcelle,ancien_id_parcelle,numero_volume,lot1_numero,lot1_surface_carrez,lot2_numero,lot2_surface_carrez,lot3_numero,lot3_surface_carrez,lot4_numero,lot4_surface_carrez,lot5_numero,lot5_surface_carrez,nombre_lots,code_type_local,type_local,surface_reelle_bati,nombre_pieces_principales,code_nature_culture,nature_culture,code_nature_culture_speciale,nature_culture_speciale,surface_terrain,longitude,latitude
2023-1172959,2023-01-28,000001,Vente,51000,,,SUR LE TUREAU,B083,89200,89044,Blannay,89,,,890440000C0015,,,,,,,,,,,,,0,,,,,L,landes,,,880,3.775404,47.535342
2023-1172959,2023-01-28,000001,Vente,51000,,,LES CHAMPS DESSOUS,B020,89200,89044,Blannay,89,,,89044000ZE0194,,,,,,,,,,,,,0,,,,,J,jardins,,,128,3.783364,47.5287
2023-1172959,2023-01-28,000001,Vente,51000,,,LES CHAMPS DESSOUS,B020,89200,89044,Blannay,89,,,89044000ZE0195,,,,,,,,,,,,,0,,,,,J,jardins,,,119,3.783472,47.528847
2023-1172959,2023-01-28,000001,Vente,51000,16,,RUE DE DERRIERE LES MURS,0040,89200,89044,Blannay,89,,,89044000ZE0196,,,,,,,,,,,,,0,1,Maison,100,6,S,sols,,,235,3.783608,47.528956
2023-1172959,2023-01-28,000001,Vente,51000,16,,RUE DE DERRIERE LES MURS,0040,89200,89044,Blannay,89,,,89044000ZE0196,,,,,,,,,,,,,0,3,Dépendance,,0,S,sols,,,235,3.783608,47.528956
2023-1172959,2023-01-28,000001,Vente,51000,16,,RUE DE DERRIERE LES MURS,0040,89200,89044,Blannay,89,,,89044000ZE0196,,,,,,,,,,,,,0,3,Dépendance,,0,S,sols,,,235,3.783608,47.528956
2023-1173800,2023-02-14,000001,Vente,3650,,,CHAMPS DE L ILE,B019,89200,89044,Blannay,89,,,89044000ZE0120,,,,,,,,,,,,,0,,,,,P,prés,,,14586,3.779014,47.523903
2023-1174601,2023-03-06,000001,Vente,240000,15,,RUE BASSE,0030,89200,89044,Blannay,89,,,890440000D0987,,,,,,,,,,,,,0,1,Maison,110,4,S,sols,,,388,3.782737,47.528938
2023-1174601,2023-03-06,000001,Vente,240000,,,LE VILLAGE,B091,89200,89044,Blannay,89,,,890440000D1004,,,,,,,,,,,,,0,,,,,AG,terrains d'agrément,,,1168,3.782429,47.528977
2023-1174601,2023-03-06,000001,Vente,240000,,,LE VILLAGE,B091,89200,89044,Blannay,89,,,890440000D1236,,,,,,,,,,,,,0,,,,,J,jardins,,,60,3.781742,47.529631
2023-1174601,2023-03-06,000001,Vente,240000,,,LE VILLAGE,B091,89200,89044,Blannay,89,,,890440000D1259,,,,,,,,,,,,,0,,,,,T,terres,,,699,3.782277,47.529226
2023-1174601,2023-03-06,000001,Vente,240000,,,LE VILLAGE,B091,89200,89044,Blannay,89,,,890440000D1260,,,,,,,,,,,,,0,,,,,T,terres,,,1249,3.781843,47.529224
2023-1174601,2023-03-06,000001,Vente,240000,,,LE VILLAGE,B091,89200,89044,Blannay,89,,,890440000D1281,,,,,,,,,,,,,0,,,,,T,terres,,,732,3.782288,47.529284
2023-1178754,2023-09-15,000001,Vente,97000,27,,RUE HAUTE,0050,89200,89044,Blannay,89,,,890440000D1041,,,,,,,,,,,,,0,1,Maison,88,3,S,sols,,,311,3.780594,47.528226
2023-1178754,2023-09-15,000001,Vente,97000,27,,RUE HAUTE,0050,89200,89044,Blannay,89,,,890440000D1041,,,,,,,,,,,,,0,3,Dépendance,,0,S,sols,,,311,3.780594,47.528226
2023-1178754,2023-09-15,000001,Vente,97000,,,LE VILLAGE,B091,89200,89044,Blannay,89,,,890440000D1042,,,,,,,,,,,,,0,,,,,J,jardins,,,280,3.780683,47.528329
2023-1179453,2023-10-25,000001,Vente,14000,,,LES QUARTIERS,B063,89200,89044,Blannay,89,,,89044000ZE0163,,,,,,,,,,,,,0,,,,,T,terres,,,511,3.780281,47.526381
2023-1179453,2023-10-25,000001,Vente,14000,,,LES QUARTIERS,B063,89200,89044,Blannay,89,,,89044000ZE0173,,,,,,,,,,,,,0,,,,,S,sols,,,217,3.780083,47.526516
2023-1179453,2023-10-25,000001,Vente,14000,,,LES QUARTIERS,B063,89200,89044,Blannay,89,,,89044000ZE0174,,,,,,,,,,,,,0,,,,,J,jardins,,,306,3.780285,47.526419
2023-1179454,2023-10-25,000001,Vente,42000,,,LES QUARTIERS,B063,89200,89044,Blannay,89,,,89044000ZE0038,,,,,,,,,,,,,0,,,,,T,terres,,,300,3.781049,47.526526
2023-1179454,2023-10-25,000001,Vente,42000,3,,RTE DE VEZELAY,0150,89200,89044,Blannay,89,,,89044000ZE0175,,,,,,,,,,,,,0,1,Maison,130,6,S,sols,,,676,3.780781,47.526579
2023-1179454,2023-10-25,000001,Vente,42000,3,,RTE DE VEZELAY,0150,89200,89044,Blannay,89,,,89044000ZE0175,,,,,,,,,,,,,0,3,Dépendance,,0,S,sols,,,676,3.780781,47.526579
2023-1179454,2023-10-25,000001,Vente,42000,3,,RTE DE VEZELAY,0150,89200,89044,Blannay,89,,,89044000ZE0175,,,,,,,,,,,,,0,3,Dépendance,,0,S,sols,,,676,3.780781,47.526579
2023-1180105,2023-11-20,000001,Vente,85500,3,,RUE HAUTE,0050,89200,89044,Blannay,89,,,890440000D1222,,,,,,,,,,,,,0,1,Maison,64,5,S,sols,,,299,3.781214,47.529595
2023-1180105,2023-11-20,000001,Vente,85500,3,,RUE HAUTE,0050,89200,89044,Blannay,89,,,890440000D1222,,,,,,,,,,,,,0,3,Dépendance,,0,S,sols,,,299,3.781214,47.529595
2023-1180105,2023-11-20,000001,Vente,85500,,,LE VILLAGE,B091,89200,89044,Blannay,89,,,890440000D1224,,,,,,,,,,,,,0,,,,,J,jardins,,,304,3.781413,47.529518
