id_mutation,date_mutation,numero_disposition,nature_mutation,valeur_fonciere,adresse_numero,adresse_suffixe,adresse_nom_voie,adresse_code_voie,code_postal,code_commune,nom_commune,code_departement,ancien_code_commune,ancien_nom_commune,id_parcelle,ancien_id_parcelle,numero_volume,lot1_numero,lot1_surface_carrez,lot2_numero,lot2_surface_carrez,lot3_numero,lot3_surface_carrez,lot4_numero,lot4_surface_carrez,lot5_numero,lot5_surface_carrez,nombre_lots,code_type_local,type_local,surface_reelle_bati,nombre_pieces_principales,code_nature_culture,nature_culture,code_nature_culture_speciale,nature_culture_speciale,surface_terrain,longitude,latitude
2023-1173174,2023-01-17,000001,Vente,250,,,MARRAULT HAMEAU,B273,89200,89235,Magny,89,,,892350000G0088,,,,,,,,,,,,,0,,,,,J,jardins,,,380,3.95799,47.446555
2023-1174865,2023-04-14,000001,Vente,85000,4,,PL FRANCOIS GIBON,0081,89200,89235,Magny,89,,,892350000D1216,,,,,,,,,,,,,0,1,Maison,65,3,S,sols,,,1298,3.979693,47.48174
2023-1174865,2023-04-14,000001,Vente,85000,,,LE VILLAGE,B521,89200,89235,Magny,89,,,892350000D1218,,,,,,,,,,,,,0,,,,,J,jardins,,,335,3.979827,47.48177
2023-1174865,2023-04-14,000001,Vente,85000,,,LE VILLAGE,B521,89200,89235,Magny,89,,,892350000D1228,,,,,,,,,,,,,0,,,,,J,jardins,,,470,3.979442,47.481483
2023-1175116,2023-04-26,000001,Vente,17453.31,,,LES MERDALLES,B284,89200,89235,Magny,89,,,89235000ZX0023,,,,,,,,,,,,,0,,,,,P,prés,,,2912,3.946637,47.43761
2023-1175116,2023-04-26,000001,Vente,17453.31,,,LES MERDALLES,B284,89200,89235,Magny,89,,,89235000ZX0023,,,,,,,,,,,,,0,,,,,P,prés,,,75193,3.946637,47.43761
2023-1175304,2023-04-14,000001,Vente,3355000,,,LE CHAUFFAGE,B142,89200,89235,Magny,89,,,892350000F0030,,,,,,,,,,,,,0,,,,,BR,futaies résineuses,PIN,Pins,4002,3.945556,47.450479
2023-1175304,2023-04-14,000001,Vente,3355000,,,ANCIEN MOULIN DE MARRAULT,B004,89200,89235,Magny,89,,,892350000F0085,,,,,,,,,,,,,0,,,,,J,jardins,,,1278,3.947348,47.447415
2023-1175304,2023-04-14,000001,Vente,3355000,,,ANCIEN MOULIN DE MARRAULT,B004,89200,89235,Magny,89,,,892350000F0086,,,,,,,,,,,,,0,,,,,J,jardins,,,834,3.947539,47.447426
2023-1175304,2023-04-14,000001,Vente,3355000,46,,RUE PASTEUR,0178,89200,89235,Magny,89,,,892350000F0087,,,,,,,,,,,,,0,1,Maison,120,5,S,sols,,,2387,3.947685,47.447643
2023-1175304,2023-04-14,000001,Vente,3355000,,,ANCIEN MOULIN DE MARRAULT,B004,89200,89235,Magny,89,,,892350000F0088,,,,,,,,,,,,,0,,,,,E,eaux,ETANG,Etangs,516,3.947091,47.447815
2023-1175304,2023-04-14,000001,Vente,3355000,,,SOUS LE CHATEAU,B492,89200,89235,Magny,89,,,892350000F0090,,,,,,,,,,,,,0,,,,,AG,terrains d'agrément,,,34896,3.948486,47.450049
2023-1175304,2023-04-14,000001,Vente,3355000,,,CHATEAU DE MARRAULT,B139,89200,89235,Magny,89,,,892350000F0091,,,,,,,,,,,,,0,,,,,P,prés,,,4554,3.949486,47.450165
2023-1175304,2023-04-14,000001,Vente,3355000,,,CHATEAU DE MARRAULT,B139,89200,89235,Magny,89,,,892350000F0092,,,,,,,,,,,,,0,,,,,P,prés,,,5607,3.950081,47.450015
2023-1175304,2023-04-14,000001,Vente,3355000,,,CHATEAU DE MARRAULT,B139,89200,89235,Magny,89,,,892350000F0093,,,,,,,,,,,,,0,,,,,S,sols,,,41,3.949935,47.44979
2023-1175304,2023-04-14,000001,Vente,3355000,44,,RUE PASTEUR,0178,89200,89235,Magny,89,,,892350000F0094,,,,,,,,,,,,,0,1,Maison,94,5,S,sols,,,1734,3.949242,47.449899
2023-1175304,2023-04-14,000001,Vente,3355000,44,,RUE PASTEUR,0178,89200,89235,Magny,89,,,892350000F0094,,,,,,,,,,,,,0,4,Local industriel. commercial ou assimilé,400,0,S,sols,,,1734,3.949242,47.449899
2023-1175304,2023-04-14,000001,Vente,3355000,,,CHATEAU DE MARRAULT,B139,89200,89235,Magny,89,,,892350000F0095,,,,,,,,,,,,,0,,,,,AG,terrains d'agrément,,,1733,3.94868,47.449738
2023-1175304,2023-04-14,000001,Vente,3355000,,,CHATEAU DE MARRAULT,B139,89200,89235,Magny,89,,,892350000F0096,,,,,,,,,,,,,0,,,,,AG,terrains d'agrément,,,3884,3.948296,47.448935
2023-1175304,2023-04-14,000001,Vente,3355000,,,CHATEAU DE MARRAULT,B139,89200,89235,Magny,89,,,892350000F0097,,,,,,,,,,,,,0,,,,,AG,terrains d'agrément,,,11539,3.948591,47.449214
2023-1175304,2023-04-14,000001,Vente,3355000,,,CHATEAU DE MARRAULT,B139,89200,89235,Magny,89,,,892350000F0098,,,,,,,,,,,,,0,,,,,J,jardins,,,2749,3.949657,47.44883
2023-1175304,2023-04-14,000001,Vente,3355000,,,CHATEAU DE MARRAULT,B139,89200,89235,Magny,89,,,892350000F0099,,,,,,,,,,,,,0,,,,,J,jardins,,,939,3.949947,47.44945
2023-1175304,2023-04-14,000001,Vente,3355000,,,CHATEAU DE MARRAULT,B139,89200,89235,Magny,89,,,892350000F0100,,,,,,,,,,,,,0,,,,,E,eaux,ETANG,Etangs,212,3.950235,47.44925
2023-1175304,2023-04-14,000001,Vente,3355000,,,CHATEAU DE MARRAULT,B139,89200,89235,Magny,89,,,892350000F0101,,,,,,,,,,,,,0,,,,,VE,vergers,,,1987,3.950534,47.449303
2023-1175304,2023-04-14,000001,Vente,3355000,,,CHATEAU DE MARRAULT,B139,89200,89235,Magny,89,,,892350000F0102,,,,,,,,,,,,,0,,,,,J,jardins,,,1193,3.949832,47.448833
2023-1175304,2023-04-14,000001,Vente,3355000,,,CHATEAU DE MARRAULT,B139,89200,89235,Magny,89,,,892350000F0103,,,,,,,,,,,,,0,,,,,AG,terrains d'agrément,,,7210,3.949541,47.448636
2023-1175304,2023-04-14,000001,Vente,3355000,,,CHATEAU DE MARRAULT,B139,89200,89235,Magny,89,,,892350000F0105,,,,,,,,,,,,,0,,,,,AG,terrains d'agrément,,,8946,3.94868,47.447911
2023-1175304,2023-04-14,000001,Vente,3355000,,,CHATEAU DE MARRAULT,B139,89200,89235,Magny,89,,,892350000F0106,,,,,,,,,,,,,0,,,,,S,sols,,,144,3.949252,47.44762
2023-1175304,2023-04-14,000001,Vente,3355000,,,CHATEAU DE MARRAULT,B139,89200,89235,Magny,89,,,892350000F0107,,,,,,,,,,,,,0,,,,,BT,taillis simples,,,1821,3.948997,47.447613
2023-1175304,2023-04-14,000001,Vente,3355000,,,CHATEAU DE MARRAULT,B139,89200,89235,Magny,89,,,892350000F0110,,,,,,,,,,,,,0,,,,,P,prés,,,6803,3.950441,47.448503
2023-1175304,2023-04-14,000001,Vente,3355000,,,CHATEAU DE MARRAULT,B139,89200,89235,Magny,89,,,892350000F0111,,,,,,,,,,,,,0,,,,,P,prés,,,4795,3.950953,47.448645
2023-1175304,2023-04-14,000001,Vente,3355000,,,LE VERGER,B509,89200,89235,Magny,89,,,892350000F0112,,,,,,,,,,,,,0,,,,,T,terres,,,11211,3.951373,47.450363
2023-1175304,2023-04-14,000001,Vente,3355000,,,PRE DU MOULIN,B387,89200,89235,Magny,89,,,892350000F0422,,,,,,,,,,,,,0,,,,,P,prés,,,143,3.947288,47.447991
2023-1175304,2023-04-14,000001,Vente,3355000,,,PRE DU MOULIN,B387,89200,89235,Magny,89,,,892350000F0442,,,,,,,,,,,,,0,,,,,P,prés,,,14632,3.946769,47.448978
2023-1175304,2023-04-14,000001,Vente,3355000,44,,RUE PASTEUR,0178,89200,89235,Magny,89,,,892350000F0451,,,,,,,,,,,,,0,4,Local industriel. commercial ou assimilé,,0,S,sols,,,415,3.948604,47.448655
2023-1175304,2023-04-14,000001,Vente,3355000,44,,RUE PASTEUR,0178,89200,89235,Magny,89,,,892350000F0451,,,,,,,,,,,,,0,4,Local industriel. commercial ou assimilé,126,0,S,sols,,,415,3.948604,47.448655
2023-1175304,2023-04-14,000001,Vente,3355000,44,,RUE PASTEUR,0178,89200,89235,Magny,89,,,892350000F0452,,,,,,,,,,,,,0,4,Local industriel. commercial ou assimilé,115,0,S,sols,,,137,3.948473,47.44897
2023-1175304,2023-04-14,000001,Vente,3355000,,,CHAMP DU MOULIN,B084,89200,89235,Magny,89,,,89235000ZR0008,,,,,,,,,,,,,0,,,,,T,terres,,,4193,3.94615,47.449599
2023-1175304,2023-04-14,000001,Vente,3355000,,,CHAMP DU MOULIN,B084,89200,89235,Magny,89,,,89235000ZR0059,,,,,,,,,,,,,0,,,,,BR,futaies résineuses,PIN,Pins,10354,3.946836,47.450687
2023-1175304,2023-04-14,000001,Vente,3355000,,,ETANG DE MARRAULT,B204,89200,89235,Magny,89,,,89235000ZX0053,,,,,,,,,,,,,0,,,,,L,landes,,,9803,3.94957,47.438904
2023-1175304,2023-04-14,000001,Vente,3355000,,,ETANG DE MARRAULT,B204,89200,89235,Magny,89,,,89235000ZX0054,,,,,,,,,,,,,0,,,,,E,eaux,ETANG,Etangs,145558,3.949112,47.442623
2023-1175304,2023-04-14,000001,Vente,3355000,,,ETANG DE MARRAULT,B204,89200,89235,Magny,89,,,89235000ZX0055,,,,,,,,,,,,,0,,,,,L,landes,,,1540,3.949724,47.447098
2023-1175411,2023-05-11,000001,Vente,350,,,LE PLESSIS(HAMEAU),B348,89200,89235,Magny,89,,,892350000F0439,,,,,,,,,,,,,0,,,,,S,sols,,,5,3.954719,47.452087
2023-1175967,2023-05-15,000001,Vente,58500,19,,RUE PASTEUR,0178,89200,89235,Magny,89,,,892350000F0207,,,,,,,,,,,,,0,1,Maison,53,2,S,sols,,,1274,3.953578,47.450616
2023-1177072,2023-06-30,000001,Vente,250000,12,B,RUE DES CHAUMES DU POUGIN,0030,89200,89235,Magny,89,,,89235000ZL0157,,,,,,,,,,,,,0,1,Maison,147,6,S,sols,,,1164,3.973286,47.474054
2023-1177072,2023-06-30,000001,Vente,250000,12,B,RUE DES CHAUMES DU POUGIN,0030,89200,89235,Magny,89,,,89235000ZL0157,,,,,,,,,,,,,0,1,Maison,147,6,AG,terrains d'agrément,,,987,3.973286,47.474054
2023-1177072,2023-06-30,000001,Vente,250000,,,LES CHOMES DU POUGIN,B160,89200,89235,Magny,89,,,89235000ZL0160,,,,,,,,,,,,,0,,,,,S,sols,,,603,3.973681,47.474169
2023-1177861,2023-07-20,000001,Vente,70000,,,LE PLESSIS(HAMEAU),B348,89200,89235,Magny,89,,,892350000F0202,,,,,,,,,,,,,0,,,,,VE,vergers,,,927,3.954226,47.45074
2023-1177861,2023-07-20,000001,Vente,70000,,,LE PLESSIS(HAMEAU),B348,89200,89235,Magny,89,,,892350000F0203,,,,,,,,,,,,,0,,,,,P,prés,,,556,3.9544,47.45085
2023-1177861,2023-07-20,000001,Vente,70000,,,LE PLESSIS(HAMEAU),B348,89200,89235,Magny,89,,,892350000F0204,,,,,,,,,,,,,0,,,,,J,jardins,,,323,3.953868,47.450697
2023-1177861,2023-07-20,000001,Vente,70000,17,,RUE PASTEUR,0178,89200,89235,Magny,89,,,892350000F0205,,,,,,,,,,,,,0,1,Maison,63,3,S,sols,,,483,3.95393,47.450858
2023-1177861,2023-07-20,000001,Vente,70000,17,,RUE PASTEUR,0178,89200,89235,Magny,89,,,892350000F0205,,,,,,,,,,,,,0,3,Dépendance,,0,S,sols,,,483,3.95393,47.450858
2023-1178063,2023-08-18,000001,Vente,2000,,,SUR LA SEREE,B485,89200,89235,Magny,89,,,89235000ZI0042,,,,,,,,,,,,,0,,,,,P,prés,,,15835,3.999436,47.478472
2023-1178063,2023-08-18,000001,Vente,2000,,,SUR LA SEREE,B485,89200,89235,Magny,89,,,89235000ZI0042,,,,,,,,,,,,,0,,,,,P,prés,,,7917,3.999436,47.478472
2023-1179119,2023-10-12,000001,Vente,166000,4,,CHE GOUJON,0082,89200,89235,Magny,89,,,892350000C0340,,,,,,,,,,,,,0,3,Dépendance,,0,S,sols,,,1375,3.992065,47.478838
2023-1179119,2023-10-12,000001,Vente,166000,4,,CHE GOUJON,0082,89200,89235,Magny,89,,,892350000C0340,,,,,,,,,,,,,0,1,Maison,100,4,S,sols,,,1375,3.992065,47.478838
2023-1179119,2023-10-12,000001,Vente,166000,4,,CHE GOUJON,0082,89200,89235,Magny,89,,,892350000C0340,,,,,,,,,,,,,0,3,Dépendance,,0,S,sols,,,1375,3.992065,47.478838
2023-1179422,2023-10-21,000001,Vente,375250,8,,RUE DU PLESSIS,0182,89200,89235,Magny,89,,,892350000F0177,,,,,,,,,,,,,0,3,Dépendance,,0,S,sols,,,717,3.956439,47.451463
2023-1179422,2023-10-21,000001,Vente,375250,8,,RUE DU PLESSIS,0182,89200,89235,Magny,89,,,892350000F0177,,,,,,,,,,,,,0,1,Maison,170,4,S,sols,,,717,3.956439,47.451463
2023-1179422,2023-10-21,000001,Vente,375250,,,LE PLESSIS(HAMEAU),B348,89200,89235,Magny,89,,,892350000F0178,,,,,,,,,,,,,0,,,,,J,jardins,,,300,3.956682,47.451309
2023-1179422,2023-10-21,000001,Vente,375250,,,LE PLESSIS(HAMEAU),B348,89200,89235,Magny,89,,,892350000F0179,,,,,,,,,,,,,0,,,,,P,prés,,,2113,3.956342,47.451093
2023-1180193,2023-10-31,000001,Vente,165286.23,,,PATIS NOLIN,B320,89200,89235,Magny,89,,,89235000ZB0117,,,,,,,,,,,,,0,,,,,T,terres,,,12687,3.989628,47.506778
