id_mutation,date_mutation,numero_disposition,nature_mutation,valeur_fonciere,adresse_numero,adresse_suffixe,adresse_nom_voie,adresse_code_voie,code_postal,code_commune,nom_commune,code_departement,ancien_code_commune,ancien_nom_commune,id_parcelle,ancien_id_parcelle,numero_volume,lot1_numero,lot1_surface_carrez,lot2_numero,lot2_surface_carrez,lot3_numero,lot3_surface_carrez,lot4_numero,lot4_surface_carrez,lot5_numero,lot5_surface_carrez,nombre_lots,code_type_local,type_local,surface_reelle_bati,nombre_pieces_principales,code_nature_culture,nature_culture,code_nature_culture_speciale,nature_culture_speciale,surface_terrain,longitude,latitude
2023-1263562,2023-01-23,000001,Vente,3000,,,LES ROULIERES,B071,95780,95301,Haute-Isle,95,,,953010000A0235,,,,,,,,,,,,,0,,,,,L,landes,FRICH,Friche,125,1.648748,49.085232
2023-1263562,2023-01-23,000001,Vente,3000,,,LES FOUTURES,B035,95780,95301,Haute-Isle,95,,,953010000A0443,,,,,,,,,,,,,0,,,,,T,terres,,,710,1.658772,49.086147
2023-1263562,2023-01-23,000001,Vente,3000,,,LES ZIAUMES,B082,95780,95301,Haute-Isle,95,,,953010000A0582,,,,,,,,,,,,,0,,,,,T,terres,,,460,1.659805,49.085806
2023-1263562,2023-01-23,000001,Vente,3000,,,LES ROUGES VIGNES,B070,95780,95301,Haute-Isle,95,,,953010000A0651,,,,,,,,,,,,,0,,,,,T,terres,,,375,1.662623,49.084159
2023-1263562,2023-01-23,000001,Vente,3000,,,LES ROUGES VIGNES,B070,95780,95301,Haute-Isle,95,,,953010000A0664,,,,,,,,,,,,,0,,,,,T,terres,,,2590,1.661608,49.084627
2023-1263562,2023-01-23,000001,Vente,3000,,,LE FOND DE BON VALE,B030,95780,95301,Haute-Isle,95,,,953010000A0771,,,,,,,,,,,,,0,,,,,T,terres,,,165,1.666252,49.083554
2023-1263562,2023-01-23,000001,Vente,3000,,,LES LONGS BARDES,B052,95780,95301,Haute-Isle,95,,,953010000A0848,,,,,,,,,,,,,0,,,,,T,terres,,,492,1.665091,49.085466
2023-1263562,2023-01-23,000001,Vente,3000,,,LES LONGS BARDES,B052,95780,95301,Haute-Isle,95,,,953010000A0849,,,,,,,,,,,,,0,,,,,T,terres,,,33,1.664844,49.084982
2023-1263562,2023-01-23,000001,Vente,3000,,,LES LONGS BARDES,B052,95780,95301,Haute-Isle,95,,,953010000A0890,,,,,,,,,,,,,0,,,,,T,terres,,,1470,1.667232,49.084569
2023-1263562,2023-01-23,000001,Vente,3000,,,LE FOND DES VOIES,B032,95780,95301,Haute-Isle,95,,,953010000A1055,,,,,,,,,,,,,0,,,,,T,terres,,,300,1.669886,49.081824
2023-1263562,2023-01-23,000001,Vente,3000,,,LE FOND DES VOIES,B032,95780,95301,Haute-Isle,95,,,953010000A1067,,,,,,,,,,,,,0,,,,,T,terres,,,230,1.670744,49.081524
2023-1263562,2023-01-23,000001,Vente,3000,,,LE FOND DES VOIES,B032,95780,95301,Haute-Isle,95,,,953010000A1105,,,,,,,,,,,,,0,,,,,T,terres,,,175,1.668956,49.082946
2023-1263562,2023-01-23,000001,Vente,3000,,,COCRIMONT,B019,95780,95301,Haute-Isle,95,,,953010000A1158,,,,,,,,,,,,,0,,,,,T,terres,,,210,1.671735,49.082832
2023-1263562,2023-01-23,000001,Vente,3000,,,LES TERRES DE LA VILLE,B077,95780,95301,Haute-Isle,95,,,953010000A1184,,,,,,,,,,,,,0,,,,,T,terres,,,210,1.672134,49.081777
2023-1263562,2023-01-23,000001,Vente,3000,,,LE HAUT DES RICHEUX,B047,95780,95301,Haute-Isle,95,,,953010000B0166,,,,,,,,,,,,,0,,,,,T,terres,,,140,1.679432,49.079557
2023-1263562,2023-01-23,000001,Vente,3000,,,LE HAUT DES RICHEUX,B047,95780,95301,Haute-Isle,95,,,953010000B0176,,,,,,,,,,,,,0,,,,,T,terres,,,720,1.679394,49.079168
2023-1263562,2023-01-23,000001,Vente,3000,,,LES BEAUX HUS,B007,95780,95301,Haute-Isle,95,,,953010000B0328,,,,,,,,,,,,,0,,,,,T,terres,,,568,1.673522,49.079606
2023-1263562,2023-01-23,000001,Vente,3000,,,LE CHAMP POIRIER,B014,95780,95301,Haute-Isle,95,,,953010000B0731,,,,,,,,,,,,,0,,,,,T,terres,,,20,1.686911,49.076766
2023-1263562,2023-01-23,000001,Vente,3000,,,LE CHAMP POIRIER,B014,95780,95301,Haute-Isle,95,,,953010000B0760,,,,,,,,,,,,,0,,,,,L,landes,FRICH,Friche,50,1.685699,49.077512
2023-1263723,2023-01-23,000001,Vente,45000,,,CHANTEMESLE,B015,95780,95301,Haute-Isle,95,,,953010000B0883,,,,,,,,,,,,,0,,,,,J,jardins,POTAG,Jardin potager,1049,1.67872,49.076566
2023-1263727,2023-01-23,000001,Vente,10000,,,LES RIVIERES,B068,95780,95301,Haute-Isle,95,,,953010000B0803,,,,,,,,,,,,,0,,,,,AG,terrains d'agrément,,,497,1.683071,49.074269
2023-1263727,2023-01-23,000001,Vente,10000,,,LES RIVIERES,B068,95780,95301,Haute-Isle,95,,,953010000B0878,,,,,,,,,,,,,0,,,,,VE,vergers,,,7752,1.683305,49.074505
2023-1263727,2023-01-23,000001,Vente,10000,,,LES RIVIERES,B068,95780,95301,Haute-Isle,95,,,953010000B0879,,,,,,,,,,,,,0,,,,,J,jardins,POTAG,Jardin potager,1585,1.684001,49.074383
2023-1263733,2023-01-20,000001,Vente,463000,,,CHANTEMESLE,B015,95780,95301,Haute-Isle,95,,,953010000B0488,,,,,,,,,,,,,0,,,,,J,jardins,POTAG,Jardin potager,1008,1.673041,49.078786
2023-1263733,2023-01-20,000001,Vente,463000,,,CHANTEMESLE,B015,95780,95301,Haute-Isle,95,,,953010000B0489,,,,,,,,,,,,,0,,,,,AG,terrains d'agrément,,,53,1.672817,49.078567
2023-1263733,2023-01-20,000001,Vente,463000,,,CHANTEMESLE,B015,95780,95301,Haute-Isle,95,,,953010000B0490,,,,,,,,,,,,,0,,,,,AG,terrains d'agrément,,,44,1.672581,49.078663
2023-1263733,2023-01-20,000001,Vente,463000,,,CHANTEMESLE,B015,95780,95301,Haute-Isle,95,,,953010000B0491,,,,,,,,,,,,,0,,,,,J,jardins,POTAG,Jardin potager,17,1.672511,49.078701
2023-1263733,2023-01-20,000001,Vente,463000,,,CHANTEMESLE,B015,95780,95301,Haute-Isle,95,,,953010000B0492,,,,,,,,,,,,,0,,,,,S,sols,,,608,1.672676,49.078821
2023-1263733,2023-01-20,000001,Vente,463000,,,CHANTEMESLE,B015,95780,95301,Haute-Isle,95,,,953010000B0833,,,,,,,,,,,,,0,,,,,AG,terrains d'agrément,,,99,1.67247,49.078706
2023-1263733,2023-01-20,000001,Vente,463000,,,CHANTEMESLE,B015,95780,95301,Haute-Isle,95,,,953010000B0977,,,,,,,,,,,,,0,,,,,S,sols,,,209,1.672833,49.079057
2023-1263733,2023-01-20,000001,Vente,463000,2,,CHE DU BOUT GRAND JEAN,0141,95780,95301,Haute-Isle,95,,,953010000B0978,,,,,,,,,,,,,0,3,Dépendance,,0,S,sols,,,662,1.672811,49.078882
2023-1263733,2023-01-20,000001,Vente,463000,2,,CHE DU BOUT GRAND JEAN,0141,95780,95301,Haute-Isle,95,,,953010000B0978,,,,,,,,,,,,,0,1,Maison,175,5,S,sols,,,662,1.672811,49.078882
2023-1263870,2023-02-07,000001,Vente,650,,,CHANTEMESLE,B015,95780,95301,Haute-Isle,95,,,953010000B0428,,,,,,,,,,,,,0,,,,,AG,terrains d'agrément,,,37,1.679702,49.07593
2023-1266378,2023-03-27,000001,Vente,1500,,,CHANTEMESLE,B015,95780,95301,Haute-Isle,95,,,953010000B0428,,,,,,,,,,,,,0,,,,,AG,terrains d'agrément,,,37,1.679702,49.07593
2023-1267517,2023-04-28,000001,Vente,530000,,,LES ILES VOLANTES,B048,95780,95301,Haute-Isle,95,,,953010000A1295,,,,,,,,,,,,,0,,,,,T,terres,,,300,1.662611,49.080359
2023-1267517,2023-04-28,000001,Vente,530000,,,LA FOSSE AU MOINE,B033,95780,95301,Haute-Isle,95,,,953010000A1333,,,,,,,,,,,,,0,,,,,S,sols,,,375,1.665437,49.081216
2023-1267517,2023-04-28,000001,Vente,530000,5,,LES ILES VOLANTES,B048,95780,95301,Haute-Isle,95,,,953010000A1457,,,,,,,,,,,,,0,1,Maison,175,7,S,sols,,,190,1.662915,49.080313
2023-1267517,2023-04-28,000001,Vente,530000,5,,LES ILES VOLANTES,B048,95780,95301,Haute-Isle,95,,,953010000A1457,,,,,,,,,,,,,0,3,Dépendance,,0,S,sols,,,190,1.662915,49.080313
2023-1267517,2023-04-28,000001,Vente,530000,,,LES ILES VOLANTES,B048,95780,95301,Haute-Isle,95,,,953010000A1458,,,,,,,,,,,,,0,,,,,S,sols,,,36,1.663199,49.08035
2023-1267517,2023-04-28,000001,Vente,530000,,,LES ILES VOLANTES,B048,95780,95301,Haute-Isle,95,,,953010000A1460,,,,,,,,,,,,,0,,,,,J,jardins,POTAG,Jardin potager,2797,1.663001,49.080324
2023-1267517,2023-04-28,000001,Vente,530000,,,LES ILES VOLANTES,B048,95780,95301,Haute-Isle,95,,,953010000A1477,,,,,,,,,,,,,0,,,,,AG,terrains d'agrément,,,1000,1.663598,49.080196
2023-1267517,2023-04-28,000001,Vente,530000,,,LES ILES VOLANTES,B048,95780,95301,Haute-Isle,95,,,953010000A1477,,,,,,,,,,,,,0,,,,,S,sols,,,186,1.663598,49.080196
2023-1270231,2023-06-28,000001,Vente,140000,6,B,CHE DU VILLAGE,0177,95780,95301,Haute-Isle,95,,,953010000A1509,,,,,,,,,,,,,0,3,Dépendance,,0,S,sols,,,213,1.656666,49.083978
2023-1270231,2023-06-28,000001,Vente,140000,6,B,CHE DU VILLAGE,0177,95780,95301,Haute-Isle,95,,,953010000A1509,,,,,,,,,,,,,0,1,Maison,50,3,S,sols,,,213,1.656666,49.083978
2023-1271493,2023-07-17,000001,Vente,217500,,,CHANTEMESLE,B015,95780,95301,Haute-Isle,95,,,953010000B0548,,,,,,,,,,,,,0,,,,,AG,terrains d'agrément,,,99,1.669316,49.079357
2023-1271493,2023-07-17,000001,Vente,217500,91,,RTE DE LA VALLEE,0040,95780,95301,Haute-Isle,95,,,953010000B0556,,,,,,,,,,,,,0,1,Maison,82,3,S,sols,,,333,1.669882,49.08026
2023-1271493,2023-07-17,000001,Vente,217500,,,CHANTEMESLE,B015,95780,95301,Haute-Isle,95,,,953010000B0886,,,,,,,,,,,,,0,,,,,J,jardins,POTAG,Jardin potager,184,1.669748,49.080141
2023-1273716,2023-09-08,000001,Vente,104000,38,,RTE DE LA VALLEE,0040,95780,95301,Haute-Isle,95,,,953010000B1008,,,,,,,,,,,,,0,1,Maison,103,4,S,sols,,,500,1.679874,49.076924
2023-1273716,2023-09-08,000001,Vente,104000,38,,RTE DE LA VALLEE,0040,95780,95301,Haute-Isle,95,,,953010000B1008,,,,,,,,,,,,,0,1,Maison,103,4,J,jardins,POTAG,Jardin potager,937,1.679874,49.076924
