id_mutation,date_mutation,numero_disposition,nature_mutation,valeur_fonciere,adresse_numero,adresse_suffixe,adresse_nom_voie,adresse_code_voie,code_postal,code_commune,nom_commune,code_departement,ancien_code_commune,ancien_nom_commune,id_parcelle,ancien_id_parcelle,numero_volume,lot1_numero,lot1_surface_carrez,lot2_numero,lot2_surface_carrez,lot3_numero,lot3_surface_carrez,lot4_numero,lot4_surface_carrez,lot5_numero,lot5_surface_carrez,nombre_lots,code_type_local,type_local,surface_reelle_bati,nombre_pieces_principales,code_nature_culture,nature_culture,code_nature_culture_speciale,nature_culture_speciale,surface_terrain,longitude,latitude
2023-1262621,2023-01-06,000001,Vente,396000,6,,RUE DU PETIT ROBINSON,0810,95520,95476,Osny,95,,,95476000AI0198,,,,,,,,,,,,,0,1,Maison,137,6,S,sols,,,468,2.072896,49.064094
2023-1262629,2023-01-10,000001,Vente,390000,1,T,AV DE LA VIOSNE,0990,95520,95476,Osny,95,,,95476000AS0306,,,,,,,,,,,,,0,3,Dépendance,,0,S,sols,,,500,2.040055,49.064859
2023-1262629,2023-01-10,000001,Vente,390000,1,T,AV DE LA VIOSNE,0990,95520,95476,Osny,95,,,95476000AS0306,,,,,,,,,,,,,0,1,Maison,109,5,S,sols,,,500,2.040055,49.064859
2023-1262634,2023-01-03,000001,Vente,195000,9,,RUE PASTEUR,0760,95520,95476,Osny,95,,,95476000AM0221,,,206,,,,,,,,,,1,3,Dépendance,,0,,,,,,2.068364,49.061623
2023-1262634,2023-01-03,000001,Vente,195000,11,,RUE PASTEUR,0760,95520,95476,Osny,95,,,95476000AM0221,,,112,44.54,,,,,,,,,1,2,Appartement,45,2,,,,,,2.068364,49.061623
2023-1262634,2023-01-03,000001,Vente,195000,11,,RUE PASTEUR,0760,95520,95476,Osny,95,,,95476000AM0221,,,157,,,,,,,,,,1,3,Dépendance,,0,,,,,,2.068364,49.061623
2023-1262652,2023-01-11,000001,Vente,95000,5,B,RUE DE PUISEUX,0865,95520,95476,Osny,95,,,95476000AP0163,,,6,21.47,,,,,,,,,1,2,Appartement,23,1,,,,,,2.056608,49.06153
2023-1262691,2023-01-10,000001,Vente en l'état futur d'achèvement,196000,,,LE MOULINARD,B047,95520,95476,Osny,95,,,95476000AR0934,,,54,,,,,,,,,,1,,,,,,,,,,2.049044,49.064656
2023-1262691,2023-01-10,000001,Vente en l'état futur d'achèvement,196000,,,LE MOULINARD,B047,95520,95476,Osny,95,,,95476000AR0934,,,142,,,,,,,,,,1,,,,,,,,,,2.049044,49.064656
2023-1262707,2023-01-04,000001,Vente,283000,9,,RUE PASTEUR,0760,95520,95476,Osny,95,,,95476000AM0221,,,23,80.55,,,,,,,,,1,2,Appartement,80,4,,,,,,2.068364,49.061623
2023-1262707,2023-01-04,000001,Vente,283000,9,,RUE PASTEUR,0760,95520,95476,Osny,95,,,95476000AM0221,,,54,5,,,,,,,,,1,3,Dépendance,,0,,,,,,2.068364,49.061623
2023-1262707,2023-01-04,000001,Vente,283000,9,,RUE PASTEUR,0760,95520,95476,Osny,95,,,95476000AM0221,,,241,3,,,,,,,,,1,3,Dépendance,,0,,,,,,2.068364,49.061623
2023-1262801,2023-01-10,000001,Vente,278000,7,,RUE DES CHATAIGNIERS,0210,95520,95476,Osny,95,,,95476000AO0131,,,,,,,,,,,,,0,3,Dépendance,,0,S,sols,,,409,2.052245,49.059199
2023-1262801,2023-01-10,000001,Vente,278000,7,,RUE DES CHATAIGNIERS,0210,95520,95476,Osny,95,,,95476000AO0131,,,,,,,,,,,,,0,3,Dépendance,,0,S,sols,,,409,2.052245,49.059199
2023-1262801,2023-01-10,000001,Vente,278000,7,,RUE DES CHATAIGNIERS,0210,95520,95476,Osny,95,,,95476000AO0131,,,,,,,,,,,,,0,1,Maison,70,5,S,sols,,,409,2.052245,49.059199
2023-1262825,2023-01-09,000001,Vente,237000,2,,ALL DES NARCISSES,0738,95520,95476,Osny,95,,,95476000HD0263,,,1011,,,,,,,,,,1,3,Dépendance,,0,,,,,,2.079628,49.063437
2023-1262825,2023-01-09,000001,Vente,237000,1,,ALL DES NARCISSES,0738,95520,95476,Osny,95,,,95476000HD0263,,,233,70.16,,,,,,,,,1,1,Maison,73,4,,,,,,2.079628,49.063437
2023-1262927,2023-01-11,000001,Vente,2800000,22,,RUE DES BEAUX SOLEILS,0055,95520,95476,Osny,95,,,95476000AX0001,,,,,,,,,,,,,0,4,Local industriel. commercial ou assimilé,151,0,T,terres,,,21576,2.069052,49.05465
2023-1262927,2023-01-11,000001,Vente,2800000,22,,RUE DES BEAUX SOLEILS,0055,95520,95476,Osny,95,,,95476000AX0001,,,,,,,,,,,,,0,4,Local industriel. commercial ou assimilé,50,0,T,terres,,,21576,2.069052,49.05465
2023-1262927,2023-01-11,000001,Vente,2800000,22,,RUE DES BEAUX SOLEILS,0055,95520,95476,Osny,95,,,95476000AX0007,,,,,,,,,,,,,0,2,Appartement,60,3,S,sols,,,4438,2.069855,49.054531
2023-1263049,2023-01-20,000001,Vente,175000,7,,RUE DE GENCY,0506,95520,95476,Osny,95,,,95476000AV0051,,,54,,,,,,,,,,1,3,Dépendance,,0,,,,,,2.062784,49.058303
2023-1263049,2023-01-20,000001,Vente,175000,7,,RUE DE GENCY,0506,95520,95476,Osny,95,,,95476000AV0051,,,22,45.79,,,,,,,,,1,2,Appartement,42,2,,,,,,2.062784,49.058303
2023-1263057,2023-01-17,000001,Vente,349500,58,,RUE DE CERGY,0166,95520,95476,Osny,95,,,95476000AO0425,,,,,,,,,,,,,0,1,Maison,86,3,S,sols,,,514,2.049524,49.058608
2023-1263123,2023-01-11,000001,Vente,177000,9001,,TSSE DE LA RAVINIERE,A535,95520,95476,Osny,95,,,95476000AV0032,,,7097,94.53,,,,,,,,,1,2,Appartement,93,5,,,,,,2.06689,49.058088
2023-1263123,2023-01-11,000001,Vente,177000,9001,,TSSE DE LA RAVINIERE,A535,95520,95476,Osny,95,,,95476000AV0032,,,7307,,,,,,,,,,1,3,Dépendance,,0,,,,,,2.06689,49.058088
2023-1263123,2023-01-11,000001,Vente,177000,9001,,TSSE DE LA RAVINIERE,A535,95520,95476,Osny,95,,,95476000AV0032,,,7097,94.53,,,,,,,,,1,3,Dépendance,,0,,,,,,2.06689,49.058088
2023-1263235,2023-01-20,000001,Vente,325000,,,RUE HENRI LECHAUGUETTE,0582,95520,95476,Osny,95,,,95476000AC0188,,,,,,,,,,,,,0,,,,,S,sols,,,200,2.051312,49.067812
2023-1263235,2023-01-20,000001,Vente,325000,10,T,RUE HENRI LECHAUGUETTE,0582,95520,95476,Osny,95,,,95476000AC0191,,,,,,,,,,,,,0,1,Maison,70,3,S,sols,,,250,2.051403,49.067703
2023-1263343,2023-01-27,000001,Vente,199950,7,,RUE ROBINET,0900,95520,95476,Osny,95,,,95476000AP0942,,,,,,,,,,,,,0,1,Maison,35,2,S,sols,,,258,2.052889,49.05968
2023-1263343,2023-01-27,000001,Vente,199950,7,,RUE ROBINET,0900,95520,95476,Osny,95,,,95476000AP0942,,,,,,,,,,,,,0,3,Dépendance,,0,S,sols,,,258,2.052889,49.05968
2023-1263343,2023-01-27,000001,Vente,199950,7,,RUE ROBINET,0900,95520,95476,Osny,95,,,95476000AP0942,,,,,,,,,,,,,0,3,Dépendance,,0,S,sols,,,258,2.052889,49.05968
2023-1263343,2023-01-27,000001,Vente,199950,7,,RUE ROBINET,0900,95520,95476,Osny,95,,,95476000AP0943,,,,,,,,,,,,,0,,,,,S,sols,,,8,2.052841,49.059583
2023-1263352,2023-01-23,000001,Vente,133000,6,,SQ DES ARTISTES,0049,95520,95476,Osny,95,,,95476000AN0408,,,20,27.77,686,7,,,,,,,2,2,Appartement,27,1,,,,,,2.065359,49.061761
2023-1263352,2023-01-23,000001,Vente,133000,6,,SQ DES ARTISTES,0049,95520,95476,Osny,95,,,95476000AN0408,,,20,27.77,686,7,,,,,,,2,3,Dépendance,,0,,,,,,2.065359,49.061761
2023-1263574,2023-01-27,000001,Vente,377000,41,,RUE DES PATIS,0770,95520,95476,Osny,95,,,95476000AL0315,,,,,,,,,,,,,0,1,Maison,101,5,S,sols,,,339,2.075224,49.053443
2023-1263574,2023-01-27,000001,Vente,377000,41,,RUE DES PATIS,0770,95520,95476,Osny,95,,,95476000AL0315,,,,,,,,,,,,,0,3,Dépendance,,0,S,sols,,,339,2.075224,49.053443
2023-1263574,2023-01-27,000001,Vente,377000,39,,RUE DES PATIS,0770,95520,95476,Osny,95,,,95476000AL0317,,,,,,,,,,,,,0,,,,,S,sols,,,341,2.075074,49.05352
2023-1263579,2023-02-01,000001,Vente,1,,,LE POIRIER DIDIER,B065,95520,95476,Osny,95,,,95476000YC0327,,,,,,,,,,,,,0,,,,,S,sols,,,431,2.072164,49.071516
2023-1263579,2023-02-01,000001,Vente,1,,,LE POIRIER DIDIER,B065,95520,95476,Osny,95,,,95476000YC0337,,,,,,,,,,,,,0,,,,,S,sols,,,59,2.073083,49.071171
2023-1263594,2023-02-02,000001,Vente,430000,6,,RUE BLAISE PASCAL,0075,95520,95476,Osny,95,,,95476000HD0204,,,,,,,,,,,,,0,1,Maison,149,6,S,sols,,,547,2.080323,49.062297
2023-1263700,2023-02-03,000001,Vente,480000,4,,RUE DE MONTGEROULT,0690,95520,95476,Osny,95,,,95476000AI0623,,,,,,,,,,,,,0,1,Maison,115,4,S,sols,,,516,2.066496,49.065064
2023-1263749,2023-01-25,000001,Vente,324450,4,,RUE LA CRETE DE LA RAVINIERE,0295,95520,95476,Osny,95,,,95476000AV0032,,,5060,113.35,,,,,,,,,1,1,Maison,116,4,,,,,,2.06689,49.058088
2023-1263837,2023-01-30,000001,Vente,349000,3,,RUE PAUL ROTH,0783,95520,95476,Osny,95,,,95476000AP0217,,,,,,,,,,,,,0,1,Maison,44,3,S,sols,,,605,2.057452,49.060727
2023-1263844,2023-02-03,000001,Vente,156690,20,,RUE DE PUISEUX,0865,95520,95476,Osny,95,,,95476000ZA0265,,,107,47.09,503,,,,,,,,2,2,Appartement,47,2,,,,,,2.047407,49.058852
2023-1263966,2023-01-31,000001,Vente,320000,51,,RUE ROBINET,0900,95520,95476,Osny,95,,,95476000AP0790,,,,,,,,,,,,,0,1,Maison,54,3,S,sols,,,405,2.057293,49.059389
2023-1263966,2023-01-31,000001,Vente,320000,51,,RUE ROBINET,0900,95520,95476,Osny,95,,,95476000AP0792,,,,,,,,,,,,,0,,,,,S,sols,,,10,2.057216,49.059253
2023-1263987,2023-02-03,000001,Vente,114000,9,,CHS JULES CESAR,0640,95520,95476,Osny,95,,,95476000EE0002,,,167,,,,,,,,,,1,4,Local industriel. commercial ou assimilé,12,0,,,,,,2.071511,49.048936
2023-1263987,2023-02-03,000001,Vente,114000,9,,CHS JULES CESAR,0640,95520,95476,Osny,95,,,95476000EE0002,,,168,,,,,,,,,,1,4,Local industriel. commercial ou assimilé,12,0,,,,,,2.071511,49.048936
2023-1263987,2023-02-03,000001,Vente,114000,9,,CHS JULES CESAR,0640,95520,95476,Osny,95,,,95476000EE0002,,,166,,,,,,,,,,1,4,Local industriel. commercial ou assimilé,12,0,,,,,,2.071511,49.048936
2023-1263987,2023-02-03,000001,Vente,114000,9,,CHS JULES CESAR,0640,95520,95476,Osny,95,,,95476000EE0002,,,165,,,,,,,,,,1,4,Local industriel. commercial ou assimilé,12,0,,,,,,2.071511,49.048936
2023-1263987,2023-02-03,000001,Vente,114000,9,,CHS JULES CESAR,0640,95520,95476,Osny,95,,,95476000EE0012,,,36,127.3,,,,,,,,,1,4,Local industriel. commercial ou assimilé,120,0,,,,,,2.072098,49.049868
2023-1264077,2023-02-02,000001,Vente,130000,3,,BORD DE LA RAVINIERE,0136,95520,95476,Osny,95,,,95476000AV0032,,,5087,113,,,,,,,,,1,1,Maison,114,4,,,,,,2.06689,49.058088
2023-1264129,2023-01-23,000001,Vente,204000,9001,,RUE DU VAUVAROIS,0976,95520,95476,Osny,95,,,95476000AP0929,,,,,,,,,,,,,0,4,Local industriel. commercial ou assimilé,150,0,S,sols,,,510,2.051116,49.062091
2023-1264129,2023-01-23,000001,Vente,204000,,,RUE DU VAUVAROIS,0976,95520,95476,Osny,95,,,95476000AP0930,,,,,,,,,,,,,0,,,,,S,sols,,,5,2.051164,49.061957
2023-1264232,2023-02-14,000001,Vente,275000,7,,RUE LA CRETE DE LA RAVINIERE,0295,95520,95476,Osny,95,,,95476000AV0032,,,4015,,,,,,,,,,1,1,Maison,101,4,,,,,,2.06689,49.058088
2023-1264232,2023-02-14,000001,Vente,275000,9005,,RUE DE GENCY,0506,95520,95476,Osny,95,,,95476000AV0032,,,4047,,,,,,,,,,1,3,Dépendance,,0,,,,,,2.06689,49.058088
2023-1264233,2023-02-08,000001,Vente,74385,30,,IMP ALBERT CAMUS,0040,95520,95476,Osny,95,,,95476000AH0068,,,,,,,,,,,,,0,1,Maison,155,5,S,sols,,,617,2.077286,49.070611
2023-1264262,2023-02-09,000001,Vente,125900,7,,RUE PAUL EMILE VICTOR,0782,95520,95476,Osny,95,,,95476000YC0348,,,62,,,,,,,,,,1,4,Local industriel. commercial ou assimilé,27,0,,,,,,2.073101,49.075165
2023-1264272,2023-01-30,000001,Vente,12200000,8,,RUE DU PETIT ALBI,0795,95520,95476,Osny,95,,,95476000EN0004,,,,,,,,,,,,,0,4,Local industriel. commercial ou assimilé,20347,0,S,sols,,,47417,2.041808,49.05544
2023-1264325,2023-02-16,000001,Vente en l'état futur d'achèvement,195000,,,LE MOULINARD,B047,95520,95476,Osny,95,,,95476000AR0934,,,209,,,,,,,,,,1,,,,,,,,,,2.049044,49.064656
2023-1264325,2023-02-16,000001,Vente en l'état futur d'achèvement,195000,,,LE MOULINARD,B047,95520,95476,Osny,95,,,95476000AR0934,,,43,,,,,,,,,,1,,,,,,,,,,2.049044,49.064656
2023-1264325,2023-02-16,000001,Vente en l'état futur d'achèvement,195000,,,LE MOULINARD,B047,95520,95476,Osny,95,,,95476000AR0934,,,212,,,,,,,,,,1,,,,,,,,,,2.049044,49.064656
2023-1264325,2023-02-16,000001,Vente en l'état futur d'achèvement,195000,,,LE MOULINARD,B047,95520,95476,Osny,95,,,95476000AR0934,,,253,,,,,,,,,,1,,,,,,,,,,2.049044,49.064656
2023-1264387,2023-02-02,000001,Vente,430000,21,B,CHE DE MONTGEROULT,0689,95520,95476,Osny,95,,,95476000AI0572,,,,,,,,,,,,,0,1,Maison,107,6,S,sols,,,293,2.075145,49.063643
2023-1264392,2023-02-03,000001,Vente,222500,7,,RUE DE GENCY,0506,95520,95476,Osny,95,,,95476000AV0051,,,62,3,,,,,,,,,1,3,Dépendance,,0,,,,,,2.062784,49.058303
2023-1264392,2023-02-03,000001,Vente,222500,9,,RUE DE GENCY,0506,95520,95476,Osny,95,,,95476000AV0051,,,33,63.57,86,,,,,,,,2,3,Dépendance,,0,,,,,,2.062784,49.058303
2023-1264392,2023-02-03,000001,Vente,222500,9,,RUE DE GENCY,0506,95520,95476,Osny,95,,,95476000AV0051,,,33,63.57,86,,,,,,,,2,2,Appartement,64,3,,,,,,2.062784,49.058303
2023-1264411,2023-02-17,000001,Vente,525000,3,,RUE MARC ANTOINE CHARPENTIER,0658,95520,95476,Osny,95,,,95476000HE0323,,,,,,,,,,,,,0,1,Maison,158,6,S,sols,,,561,2.07959,49.066369
2023-1264490,2023-02-15,000001,Vente,142000,7,,RUE DE PONTOISE,0856,95520,95476,Osny,95,,,95476000AM0031,,,52,31.15,,,,,,,,,1,2,Appartement,32,1,,,,,,2.066994,49.060845
2023-1264539,2023-02-06,000001,Vente,84000,9,,CHS JULES CESAR,0640,95520,95476,Osny,95,,,95476000EE0002,,,224,,,,,,,,,,1,4,Local industriel. commercial ou assimilé,12,0,,,,,,2.071511,49.048936
2023-1264539,2023-02-06,000001,Vente,84000,9,,CHS JULES CESAR,0640,95520,95476,Osny,95,,,95476000EE0002,,,225,,,,,,,,,,1,4,Local industriel. commercial ou assimilé,12,0,,,,,,2.071511,49.048936
2023-1264539,2023-02-06,000001,Vente,84000,9,,CHS JULES CESAR,0640,95520,95476,Osny,95,,,95476000EE0002,,,226,,,,,,,,,,1,4,Local industriel. commercial ou assimilé,12,0,,,,,,2.071511,49.048936
2023-1264539,2023-02-06,000001,Vente,84000,9,,CHS JULES CESAR,0640,95520,95476,Osny,95,,,95476000EE0012,,,26,,,,,,,,,,1,4,Local industriel. commercial ou assimilé,100,0,,,,,,2.072098,49.049868
2023-1264591,2023-02-04,000001,Vente,345000,41,,RUE JEAN JAURES,0620,95520,95476,Osny,95,,,95476000AH0663,,,2,94.92,,,,,,,,,1,1,Maison,94,4,,,,,,2.072539,49.069159
2023-1264634,2023-02-23,000001,Vente,440000,10,,RUE DES EGLANTIERS,0355,95520,95476,Osny,95,,,95476000AH0510,,,,,,,,,,,,,0,1,Maison,101,5,S,sols,,,523,2.075105,49.065198
2023-1264867,2023-02-23,000001,Vente,145211.03,7,,RUE PAUL EMILE VICTOR,0782,95520,95476,Osny,95,,,95476000YC0348,,,86,27,,,,,,,,,1,4,Local industriel. commercial ou assimilé,27,0,,,,,,2.073101,49.075165
2023-1265053,2023-03-07,000001,Vente,239000,7,,RUE DE L ESCALIER,0400,95520,95476,Osny,95,,,95476000AP0768,,,,,,,,,,,,,0,1,Maison,50,3,S,sols,,,325,2.055346,49.061424
2023-1265053,2023-03-07,000001,Vente,239000,7,,RUE DE L ESCALIER,0400,95520,95476,Osny,95,,,95476000AP0769,,,,,,,,,,,,,0,,,,,S,sols,,,17,2.055138,49.061441
2023-1265171,2023-03-09,000001,Vente,410000,38,D,RTE D ENNERY,0371,95520,95476,Osny,95,,,95476000AH0466,,,,,,,,,,,,,0,1,Maison,120,5,S,sols,,,504,2.074924,49.066186
2023-1265351,2023-03-14,000001,Vente,307000,41,,RUE DE GENCY,0506,95520,95476,Osny,95,,,95476000AV0032,,,5017,99.17,,,,,,,,,1,1,Maison,90,4,,,,,,2.06689,49.058088
2023-1265471,2023-03-17,000001,Vente,281000,9002,,RUE DES ROSES,0926,95520,95476,Osny,95,,,95476000HD0264,,,156,,,,,,,,,,1,3,Dépendance,,0,,,,,,2.079214,49.06453
2023-1265471,2023-03-17,000001,Vente,281000,17,,CHE DES GLAIEULS,0541,95520,95476,Osny,95,,,95476000HD0264,,,56,77.8,,,,,,,,,1,1,Maison,69,4,,,,,,2.079214,49.06453
2023-1265530,2023-03-13,000001,Vente,166000,9001,,TSSE DE LA RAVINIERE,A535,95520,95476,Osny,95,,,95476000AV0032,,,7037,66.52,,,,,,,,,1,2,Appartement,64,3,,,,,,2.06689,49.058088
2023-1265530,2023-03-13,000001,Vente,166000,9001,,TSSE DE LA RAVINIERE,A535,95520,95476,Osny,95,,,95476000AV0032,,,7279,,,,,,,,,,1,3,Dépendance,,0,,,,,,2.06689,49.058088
2023-1265530,2023-03-13,000001,Vente,166000,9001,,TSSE DE LA RAVINIERE,A535,95520,95476,Osny,95,,,95476000AV0032,,,7037,66.52,,,,,,,,,1,3,Dépendance,,0,,,,,,2.06689,49.058088
2023-1265539,2023-03-10,000002,Vente,75000,1,,IMP ALBERT CAMUS,0040,95520,95476,Osny,95,,,95476000AH0934,,,,,,,,,,,,,0,1,Maison,150,6,S,sols,,,16,2.078997,49.069757
2023-1265539,2023-03-10,000002,Vente,75000,1,,IMP ALBERT CAMUS,0040,95520,95476,Osny,95,,,95476000AH0934,,,,,,,,,,,,,0,3,Dépendance,,0,S,sols,,,16,2.078997,49.069757
2023-1265539,2023-03-10,000002,Vente,75000,1,,IMP ALBERT CAMUS,0040,95520,95476,Osny,95,,,95476000AH0935,,,,,,,,,,,,,0,,,,,S,sols,,,174,2.079063,49.069809
2023-1265816,2023-03-21,000001,Vente,48990000,1,,RUE CHRISTIAN BARNARD,0233,95520,95476,Osny,95,,,95476000YC0383,,,,,,,,,,,,,0,4,Local industriel. commercial ou assimilé,1473,0,S,sols,,,13301,2.076127,49.074037
2023-1265816,2023-03-21,000001,Vente,48990000,1,,RUE CHRISTIAN BARNARD,0233,95520,95476,Osny,95,,,95476000YC0383,,,,,,,,,,,,,0,4,Local industriel. commercial ou assimilé,10683,0,S,sols,,,13301,2.076127,49.074037
2023-1265816,2023-03-21,000001,Vente,48990000,,,LE CHEMIN DE LIVILLIERS,B014,95520,95476,Osny,95,,,95476000YC0386,,,,,,,,,,,,,0,,,,,S,sols,,,349,2.075622,49.074786
2023-1266116,2023-03-23,000001,Vente,158000,12,,TSSE DE LA RAVINIERE,A535,95520,95476,Osny,95,,,95476000AV0032,,,7089,79.5,,,,,,,,,1,3,Dépendance,,0,,,,,,2.06689,49.058088
2023-1266116,2023-03-23,000001,Vente,158000,9001,,TSSE DE LA RAVINIERE,A535,95520,95476,Osny,95,,,95476000AV0032,,,7215,,,,,,,,,,1,3,Dépendance,,0,,,,,,2.06689,49.058088
2023-1266116,2023-03-23,000001,Vente,158000,12,,TSSE DE LA RAVINIERE,A535,95520,95476,Osny,95,,,95476000AV0032,,,7089,79.5,,,,,,,,,1,2,Appartement,77,4,,,,,,2.06689,49.058088
2023-1266198,2023-03-27,000001,Vente en l'état futur d'achèvement,191900,,,RUE ARISTIDE BRIAND,0050,95520,95476,Osny,95,,,95476000AN0190,,,29,,,,,,,,,,1,,,,,,,,,,2.05955,49.061389
2023-1266198,2023-03-27,000001,Vente en l'état futur d'achèvement,191900,,,RUE ARISTIDE BRIAND,0050,95520,95476,Osny,95,,,95476000AN0190,,,45,,,,,,,,,,1,,,,,,,,,,2.05955,49.061389
2023-1266233,2023-03-22,000001,Vente,417500,,,RUE DE GENICOURT,0520,95520,95476,Osny,95,,,95476000AE0470,,,,,,,,,,,,,0,,,,,S,sols,,,154,2.068354,49.071824
2023-1266233,2023-03-22,000001,Vente,417500,5,,RUE DU RESERVOIR,0890,95520,95476,Osny,95,,,95476000AE1132,,,,,,,,,,,,,0,1,Maison,110,5,S,sols,,,367,2.068226,49.071928
2023-1266291,2023-03-31,000001,Vente,145000,108,,CHS JULES CESAR,0640,95520,95476,Osny,95,,,95476000ZA0265,,,356,40.83,523,,564,,565,,,,4,3,Dépendance,,0,,,,,,2.047407,49.058852
2023-1266291,2023-03-31,000001,Vente,145000,108,,CHS JULES CESAR,0640,95520,95476,Osny,95,,,95476000ZA0265,,,356,40.83,523,,564,,565,,,,4,2,Appartement,40,2,,,,,,2.047407,49.058852
2023-1266340,2023-04-03,000001,Vente,268000,68,,VERSANTS DE LA RAVINIERE,A537,95520,95476,Osny,95,,,95476000AV0032,,,4026,83.07,,,,,,,,,1,1,Maison,75,4,,,,,,2.06689,49.058088
2023-1266340,2023-04-03,000001,Vente,268000,9005,,RUE DE GENCY,0506,95520,95476,Osny,95,,,95476000AV0032,,,4061,,,,,,,,,,1,3,Dépendance,,0,,,,,,2.06689,49.058088
2023-1266343,2023-03-31,000001,Vente,357000,13,B,CHE DE MONTGEROULT,0689,95520,95476,Osny,95,,,95476000AI0627,,,,,,,,,,,,,0,1,Maison,96,5,AB,terrains a bâtir,,,313,2.074136,49.064167
2023-1266430,2023-03-30,000001,Vente,320660,27,,RUE DE PUISEUX,0865,95520,95476,Osny,95,,,95476000AP0083,,,,,,,,,,,,,0,1,Maison,71,4,S,sols,,,580,2.05188,49.06011
2023-1266467,2023-04-03,000001,Vente,179000,12,,TSSE DE LA RAVINIERE,A535,95520,95476,Osny,95,,,95476000AV0032,,,7086,80.43,,,,,,,,,1,2,Appartement,80,4,,,,,,2.06689,49.058088
2023-1266467,2023-04-03,000001,Vente,179000,9001,,TSSE DE LA RAVINIERE,A535,95520,95476,Osny,95,,,95476000AV0032,,,7212,,,,,,,,,,1,3,Dépendance,,0,,,,,,2.06689,49.058088
2023-1266467,2023-04-03,000001,Vente,179000,12,,TSSE DE LA RAVINIERE,A535,95520,95476,Osny,95,,,95476000AV0032,,,7086,80.43,,,,,,,,,1,3,Dépendance,,0,,,,,,2.06689,49.058088
2023-1266700,2023-03-30,000001,Vente,160000,,,RUE DU VAUVAROIS,0976,95520,95476,Osny,95,,,95476000AP0935,,,,,,,,,,,,,0,,,,,AB,terrains a bâtir,,,204,2.051432,49.06235
2023-1266714,2023-03-16,000001,Vente,318000,7,,RUE DES ROSES,0926,95520,95476,Osny,95,,,95476000HD0266,,,135,78.4,,,,,,,,,1,1,Maison,78,4,,,,,,2.077753,49.065427
2023-1267075,2023-04-12,000001,Vente,247270,84,B,RUE DE LIVILLIERS,0650,95520,95476,Osny,95,,,95476000AE1247,,,,,,,,,,,,,0,1,Maison,61,3,S,sols,,,124,2.069595,49.069567
2023-1267075,2023-04-12,000001,Vente,247270,84,,RUE DE LIVILLIERS,0650,95520,95476,Osny,95,,,95476000AE1249,,,,,,,,,,,,,0,,,,,S,sols,,,25,2.06941,49.069612
2023-1267075,2023-04-12,000001,Vente,247270,84,,RUE DE LIVILLIERS,0650,95520,95476,Osny,95,,,95476000AE1251,,,,,,,,,,,,,0,,,,,S,sols,,,49,2.069358,49.069573
2023-1267299,2023-03-27,000001,Vente,365000,12,,RUE DE LIVILLIERS,0650,95520,95476,Osny,95,,,95476000AE0385,,,,,,,,,,,,,0,1,Maison,102,2,S,sols,,,624,2.067207,49.065791
2023-1267299,2023-03-27,000001,Vente,365000,12,,RUE DE LIVILLIERS,0650,95520,95476,Osny,95,,,95476000AE0385,,,,,,,,,,,,,0,3,Dépendance,,0,S,sols,,,624,2.067207,49.065791
2023-1267498,2023-04-18,000001,Vente,1095277.6,33,,RUE DES BEAUX SOLEILS,0055,95520,95476,Osny,95,,,95476000AW0006,,,,,,,,,,,,,0,4,Local industriel. commercial ou assimilé,6926,0,S,sols,,,8559,2.0658,49.054623
2023-1267498,2023-04-18,000001,Vente,1095277.6,33,,RUE DES BEAUX SOLEILS,0055,95520,95476,Osny,95,,,95476000AW0006,,,,,,,,,,,,,0,4,Local industriel. commercial ou assimilé,6926,0,AG,terrains d'agrément,,,578,2.0658,49.054623
2023-1267553,2023-04-18,000001,Vente,2000000,33,,RUE DES BEAUX SOLEILS,0055,95520,95476,Osny,95,,,95476000AW0006,,,,,,,,,,,,,0,4,Local industriel. commercial ou assimilé,6926,0,AG,terrains d'agrément,,,578,2.0658,49.054623
2023-1267553,2023-04-18,000001,Vente,2000000,33,,RUE DES BEAUX SOLEILS,0055,95520,95476,Osny,95,,,95476000AW0006,,,,,,,,,,,,,0,4,Local industriel. commercial ou assimilé,6926,0,S,sols,,,8559,2.0658,49.054623
2023-1267571,2023-04-21,000001,Vente,303000,65,,RUE ROBINET,0900,95520,95476,Osny,95,,,95476000AP0498,,,,,,,,,,,,,0,3,Dépendance,,0,S,sols,,,372,2.058331,49.059183
2023-1267571,2023-04-21,000001,Vente,303000,65,,RUE ROBINET,0900,95520,95476,Osny,95,,,95476000AP0498,,,,,,,,,,,,,0,1,Maison,57,2,S,sols,,,372,2.058331,49.059183
2023-1267598,2023-04-18,000001,Vente,179122.3,7,,RUE PAUL EMILE VICTOR,0782,95520,95476,Osny,95,,,95476000YC0348,,,74,40.55,,,,,,,,,1,4,Local industriel. commercial ou assimilé,49,0,,,,,,2.073101,49.075165
2023-1267598,2023-04-18,000001,Vente,179122.3,7,,RUE PAUL EMILE VICTOR,0782,95520,95476,Osny,95,,,95476000YC0348,,,144,,,,,,,,,,1,4,Local industriel. commercial ou assimilé,12,0,,,,,,2.073101,49.075165
2023-1267641,2023-04-20,000001,Vente,127441,9005,,RUE DE GENCY,0506,95520,95476,Osny,95,,,95476000AV0032,,,4043,,,,,,,,,,1,3,Dépendance,,0,,,,,,2.06689,49.058088
2023-1267641,2023-04-20,000001,Vente,127441,11,,RUE LA CRETE DE LA RAVINIERE,0295,95520,95476,Osny,95,,,95476000AV0032,,,4011,104.95,,,,,,,,,1,1,Maison,101,4,,,,,,2.06689,49.058088
2023-1267802,2023-04-21,000001,Vente,285000,7,,CHE DES PRIMEVERES,0861,95520,95476,Osny,95,,,95476000HD0266,,,106,,,,,,,,,,1,1,Maison,88,5,,,,,,2.077753,49.065427
2023-1267822,2023-04-28,000001,Vente,216000,9,,RUE PASTEUR,0760,95520,95476,Osny,95,,,95476000AM0221,,,191,3,,,,,,,,,1,3,Dépendance,,0,,,,,,2.068364,49.061623
2023-1267822,2023-04-28,000001,Vente,216000,11,,RUE PASTEUR,0760,95520,95476,Osny,95,,,95476000AM0221,,,96,62.96,,,,,,,,,1,2,Appartement,62,3,,,,,,2.068364,49.061623
2023-1267822,2023-04-28,000001,Vente,216000,11,,RUE PASTEUR,0760,95520,95476,Osny,95,,,95476000AM0221,,,141,5,,,,,,,,,1,3,Dépendance,,0,,,,,,2.068364,49.061623
2023-1268069,2023-05-11,000001,Vente,100000,40,,RUE DU CEDRE,0157,95520,95476,Osny,95,,,95476000ZA0341,,,,,,,,,,,,,0,1,Maison,83,4,S,sols,,,136,2.046639,49.059519
2023-1268077,2023-05-12,000002,Vente,140000,,,CHE DE LIVILLIERS,0649,95520,95476,Osny,95,,,95476000AE1257,,,,,,,,,,,,,0,,,,,S,sols,,,8,2.067884,49.067475
2023-1268077,2023-05-12,000002,Vente,140000,,,LE BUISSON SIMONET,B006,95520,95476,Osny,95,,,95476000AE1258,,,,,,,,,,,,,0,,,,,S,sols,,,258,2.067943,49.067475
2023-1268077,2023-05-12,000002,Vente,140000,,,LE BUISSON SIMONET,B006,95520,95476,Osny,95,,,95476000AE1261,,,,,,,,,,,,,0,,,,,S,sols,,,14,2.06793,49.067358
2023-1268080,2023-05-12,000001,Vente,395000,52,B,RUE DE GENICOURT,0520,95520,95476,Osny,95,,,95476000AE0513,,,,,,,,,,,,,0,1,Maison,80,5,S,sols,,,654,2.066422,49.068752
2023-1268086,2023-05-12,000001,Vente,85000,,,SEN DE LA ROBINE,0895,95520,95476,Osny,95,,,95476000AB0053,,,,,,,,,,,,,0,,,,,J,jardins,POTAG,Jardin potager,289,2.04512,49.067226