siren,nic,siret,statutDiffusionEtablissement,dateCreationEtablissement,trancheEffectifsEtablissement,anneeEffectifsEtablissement,activitePrincipaleRegistreMetiersEtablissement,dateDernierTraitementEtablissement,etablissementSiege,nombrePeriodesEtablissement,complementAdresseEtablissement,numeroVoieEtablissement,indiceRepetitionEtablissement,typeVoieEtablissement,libelleVoieEtablissement,codePostalEtablissement,libelleCommuneEtablissement,libelleCommuneEtrangerEtablissement,distributionSpecialeEtablissement,codeCommuneEtablissement,codeCedexEtablissement,libelleCedexEtablissement,codePaysEtrangerEtablissement,libellePaysEtrangerEtablissement,complementAdresse2Etablissement,numeroVoie2Etablissement,indiceRepetition2Etablissement,typeVoie2Etablissement,libelleVoie2Etablissement,codePostal2Etablissement,libelleCommune2Etablissement,libelleCommuneEtranger2Etablissement,distributionSpeciale2Etablissement,codeCommune2Etablissement,codeCedex2Etablissement,libelleCedex2Etablissement,codePaysEtranger2Etablissement,libellePaysEtranger2Etablissement,dateDebut,etatAdministratifEtablissement,enseigne1Etablissement,enseigne2Etablissement,enseigne3Etablissement,denominationUsuelleEtablissement,activitePrincipaleEtablissement,nomenclatureActivitePrincipaleEtablissement,caractereEmployeurEtablissement,longitude,latitude,geo_score,geo_type,geo_adresse,geo_id,geo_ligne,geo_l4,geo_l5
213102890,00018,21310289000018,O,1983-03-01,03,2017,,2019-06-24T13:10:09,true,4,,5,,PL,DE LA MAIRIE,31580,LECUSSAN,,,31289,,,,,,,,,,,,,,,,,,,2008-01-01,A,MAIRIE,,,,84.11Z,NAFRev2,O,0.501074,43.159817,0.83,housenumber,5 Place de la Mairie 31580 Lécussan,31289_0020_00005,G,5 PLACE DE LA MAIRIE,
213102890,00026,21310289000026,O,1983-12-21,NN,,,2012-05-05T00:26:16,false,3,,,,,LECUSSAN ST PLANCARD,31580,LECUSSAN,,,31289,,,,,,,,,,,,,,,,,,,2008-01-01,A,ECOLE PRIMAIRE PUBLIQUE,,,,85.20Z,NAFRev2,N,0.503302,43.164507,0.52,street,Le Plan du Gouit 31580 Lécussan,31289_b037,G,LE PLAN DU GOUIT,
213102890,00034,21310289000034,O,1999-09-01,01,2017,,2019-06-24T13:10:09,false,3,,,,,,31580,LECUSSAN,,,31289,,,,,,,,,,,,,,,,,,,2008-01-01,A,ECOLE MATERNELLE PUBLIQUE,,,,85.10Z,NAFRev2,N,,,0,,,,,,
243100641,00030,24310064100030,O,2004-01-01,NN,,,2016-12-23T19:26:31,false,4,,,,,,31580,LECUSSAN,,,31289,,,,,,,,,,,,,,,,,,,2017-01-01,F,ZA ECONOMIQUE,,,,68.20B,NAFRev2,N,,,0,,,,,,
263104085,00018,26310408500018,O,1984-07-02,NN,,,2010-06-26T03:08:07,true,3,,,,,MAIRIE,31580,LECUSSAN,,,31289,,,,,,,,,,,,,,,,,,,2008-01-01,A,CCAS,,,,88.99B,NAFRev2,N,0.501074,43.159817,0.9,street,Place de la Mairie 31580 Lécussan,31289_0020,G,PLACE DE LA MAIRIE,
313461931,00013,31346193100013,O,1978-01-01,NN,,,2008-11-06T08:56:00,true,4,,,,,VILLAGE,31580,LECUSSAN,,,31289,,,,,,,,,,,,,,,,,,,2008-12-31,F,,,,,01.61Z,NAFRev2,N,0.502151,43.164107,0.92,street,Le Village 31580 Lécussan,31289_vyi4y4,G,LE VILLAGE,
313461931,00039,31346193100039,O,1993-01-01,NN,,,2008-11-06T08:56:00,false,4,,,,,VILLAGE,31580,LECUSSAN,,,31289,,,,,,,,,,,,,,,,,,,2008-12-31,F,,,,,01.11Z,NAFRev2,N,0.502151,43.164107,0.92,street,Le Village 31580 Lécussan,31289_vyi4y4,G,LE VILLAGE,
315797035,00047,31579703500047,O,2010-08-01,02,2017,,2019-06-24T13:18:57,false,1,,,,LD,DU PARC ET DE L'ESTAQUE,31580,LECUSSAN,,,31289,,,,,,,,,,,,,,,,,,,2010-08-01,A,,,,,46.21Z,NAFRev2,O,0.499015,43.166296,0.63,street,Landes du Parc et de Lasta 31580 Lécussan,31289_b019,G,LANDES DU PARC ET DE LASTA,
316411172,00018,31641117200018,O,1979-01-01,NN,,,2006-11-25T09:38:26,true,3,,,,,,31580,LECUSSAN,,,31289,,,,,,,,,,,,,,,,,,,1996-12-25,F,,,,,29.3C,NAF1993,N,,,0,,,,,,
318355971,00017,31835597100017,O,1980-01-01,NN,,,2008-01-04T20:59:46,true,3,,,,,,31580,LECUSSAN,,,31289,,,,,,,,,,,,,,,,,,,2008-01-01,A,,,,,93.12Z,NAFRev2,N,,,0,,,,,,
320653991,00010,32065399100010,O,1981-01-01,NN,,,2019-05-22T04:01:32,true,4,,,,,,31580,LECUSSAN,,,31289,,,,,,,,,,,,,,,,,,,2018-12-31,F,,,,,47.89Z,NAFRev2,N,,,0,,,,,,
322070061,00021,32207006100021,O,,NN,,,,true,1,,,,,,31580,LECUSSAN,,,31289,,,,,,,,,,,,,,,,,,,1988-07-20,F,,,,,67.01,NAP,N,,,0,,,,,,
326147071,00020,32614707100020,O,1978-01-01,NN,,,2008-01-04T19:14:06,true,3,,,,,,31580,LECUSSAN,,,31289,,,,,,,,,,,,,,,,,,,2008-01-01,A,,,,,01.43Z,NAFRev2,N,,,0,,,,,,
328919816,00095,32891981600095,O,1991-11-08,NN,,,,false,4,,,,QUAI,DE LA LOSSE,31580,LECUSSAN,,,31289,,,,,,,,,,,,,,,,,,,1996-12-25,F,LE PETIT RETRO,,,,92.3H,NAF1993,O,0.489095,43.160542,0.66,street,Chemin de la Losse 31580 Lécussan,31289_0010,G,CHEMIN DE LA LOSSE,
331718668,00014,33171866800014,O,1985-01-01,NN,,,2008-12-23T13:57:12,true,3,,,,LD,MARIS,31580,LECUSSAN,,,31289,,,,,,,,,,,,,,,,,,,2008-01-01,A,,,,,01.11Z,NAFRev2,N,0.479157,43.153445,0.75,street,Les Marris 31580 Lécussan,31289_3jgmkb,G,LES MARRIS,
331842724,00014,33184272400014,O,1985-01-01,NN,,,,true,4,,,,,,31580,LECUSSAN,,,31289,,,,,,,,,,,,,,,,,,,1998-04-10,F,,,,,52.1B,NAF1993,O,,,0,,,,,,
331842724,00055,33184272400055,O,1993-11-01,,,,,false,3,,,,QUAI,DE LA LOSSE,31580,LECUSSAN,,,31289,,,,,,,,,,,,,,,,,,,1998-04-10,F,AUBERGE DE LA LOSSE,,,,55.3A,NAF1993,N,0.489095,43.160542,0.66,street,Chemin de la Losse 31580 Lécussan,31289_0010,G,CHEMIN DE LA LOSSE,
332217389,00029,33221738900029,O,,NN,,,,true,1,,,,,,31580,LECUSSAN,,,31289,,,,,,,,,,,,,,,,,,,1986-06-09,F,,,,,67.01,NAP,N,,,0,,,,,,
332643980,00011,33264398000011,O,1985-06-15,NN,,,,true,1,,,,,VILLAGE LOCAUX PICOT,31580,LECUSSAN,,,31289,,,,,,,,,,,,,,,,,,,2002-06-30,F,,,,,01.3Z,NAF1993,N,,,0,,,,,,
332650100,00016,33265010000016,O,,NN,,,,true,1,,,,,VILLAGE LOCAUX PICOT,31580,LECUSSAN,,,31289,,,,,,,,,,,,,,,,,,,1991-12-31,F,,,,,01.80,NAP,N,,,0,,,,,,
338392236,00018,33839223600018,O,,,,,,true,1,,,,,,31580,LECUSSAN,,,31289,,,,,,,,,,,,,,,,,,,,F,,,,,67.01,NAP,N,,,0,,,,,,
340662071,00026,34066207100026,O,2002-07-02,NN,,,2008-01-04T21:44:29,true,3,,,,CHE,DU CAP DET HAIL,31580,LECUSSAN,,,31289,,,,,,,,,,,,,,,,,,,2008-01-01,A,,,,,47.81Z,NAFRev2,N,0.49822,43.161565,0.66,street,Chemin du Cap du Hail 31580 Lécussan,31289_0006,G,CHEMIN DU CAP DU HAIL,
341776151,00027,34177615100027,O,2004-01-01,00,2017,4520AB,2019-10-04T03:44:55,true,3,Z ACTIVITE ARTISANALE,,,,LIEU DIT LESTAQUE,31580,LECUSSAN,,,31289,,,,,,,,,,,,,,,,,,,2008-01-01,A,,,,,45.11Z,NAFRev2,O,0.499285,43.165013,0.8,street,Rue de l'Estaque 31580 Lécussan,31289_dj2c8k,G,RUE DE L ESTAQUE,
347713315,00013,34771331500013,O,1988-07-20,NN,,,,true,4,,,,,,31580,LECUSSAN,,,31289,,,,,,,,,,,,,,,,,,,1991-12-25,F,,,,,67.04,NAP,N,,,0,,,,,,
351618905,00019,35161890500019,O,1989-01-01,NN,,,2008-12-07T05:46:57,true,3,,,,,,31580,LECUSSAN,,,31289,,,,,,,,,,,,,,,,,,,2008-01-01,A,,,,,01.42Z,NAFRev2,N,,,0,,,,,,
353719354,00014,35371935400014,O,1990-01-01,NN,,,2007-01-28T06:26:47,true,4,,,,QUA,MARRIS,31580,LECUSSAN,,,31289,,,,,,,,,,,,,,,,,,,1993-12-25,F,,,,,01.1D,NAF1993,N,0.475881,43.152421,0.58,street,Route des Marris 31580 Lécussan,31289_0012,G,ROUTE DES MARRIS,
353719354,00022,35371935400022,O,1998-10-01,,,,,false,3,,,,QUA,MARRIS,31580,LECUSSAN,,,31289,,,,,,,,,,,,,,,,,,,2000-12-31,F,,,,,52.2J,NAF1993,N,0.475881,43.152421,0.58,street,Route des Marris 31580 Lécussan,31289_0012,G,ROUTE DES MARRIS,
377576608,00014,37757660800014,O,1990-04-02,NN,,,2019-07-05T12:58:17,true,3,,,,,,31580,LECUSSAN,,,31289,,,,,,,,,,,,,,,,,,,2008-01-01,A,,,,,68.20B,NAFRev2,N,,,0,,,,,,
380881482,00034,38088148200034,O,2004-12-17,NN,,,2007-10-11T04:04:03,true,3,AUBERGE DE LA LOSSE,,,,,31580,LECUSSAN,,,31289,,,,,,,,,,,,,,,,,,,2005-01-12,F,,,,,55.3A,NAFRev1,N,0.489095,43.160542,0.57,street,Chemin de la Losse 31580 Lécussan,31289_0010,D,CHEMIN DE LA LOSSE,
381040682,00035,38104068200035,O,2009-07-28,,,,2010-04-04T05:04:18,true,2,,,,CHE,DU CAP DE HAIL,31580,LECUSSAN,,,31289,,,,,,,,,,,,,,,,,,,2009-12-30,F,,,,,86.90D,NAFRev2,N,0.49822,43.161565,0.7,street,Chemin du Cap du Hail 31580 Lécussan,31289_0006,G,CHEMIN DU CAP DU HAIL,
381217637,00036,38121763700036,O,2019-10-18,,,,2020-01-09T10:31:17,true,1,,5,,CHE,DE LA LOSSE,31580,LECUSSAN,,,31289,,,,,,,,,,,,,,,,,,,2019-10-18,A,,,,,47.89Z,NAFRev2,N,0.489095,43.160542,0.83,housenumber,5 Chemin de la Losse 31580 Lécussan,31289_0010_00005,G,5 CHEMIN DE LA LOSSE,
381256569,00058,38125656900058,O,2017-01-02,,,,2019-04-29T15:25:25,true,1,ZONE ARTISANE DE L'ESTAQUE,50,,IMP,DU CORDONNIER,31580,LECUSSAN,,,31289,,,,,,,,,,,,,,,,,,,2017-01-02,A,,,,J.P.AUTO EXPRESS,45.20A,NAFRev2,N,0.499246,43.165892,0.84,housenumber,50 Impasse du Cordonnier 31580 Lécussan,31289_0001_00050,G,50 IMPASSE DU CORDONNIER,
384657417,00018,38465741700018,O,1992-02-27,01,2017,1071DZ,2019-06-24T13:14:02,true,7,,,,,,31580,LECUSSAN,,,31289,,,,,,,,,,,,,,,,,,,2015-12-31,A,,,,,47.81Z,NAFRev2,N,,,0,,,,,,
388272940,00015,38827294000015,O,,,,,,true,1,,,,QUAI,DE LA LOSSE,31580,LECUSSAN,,,31289,,,,,,,,,,,,,,,,,,,1992-11-10,F,,,,,55.3A,NAF1993,N,0.489095,43.160542,0.66,street,Chemin de la Losse 31580 Lécussan,31289_0010,G,CHEMIN DE LA LOSSE,
388780884,00010,38878088400010,O,1992-09-01,NN,,,2009-04-12T05:45:38,true,3,,,,,,31580,LECUSSAN,,,31289,,,,,,,,,,,,,,,,,,,2008-01-01,A,,,,,01.50Z,NAFRev2,N,,,0,,,,,,
389123209,00014,38912320900014,O,1992-11-07,NN,,,2018-11-07T04:00:09,true,3,,,,,,31580,LECUSSAN,,,31289,,,,,,,,,,,,,,,,,,,2008-01-01,A,,,,,68.20B,NAFRev2,N,,,0,,,,,,
389974171,00016,38997417100016,O,1993-01-01,NN,,,2014-07-11T03:40:34,true,5,,,,,,31580,LECUSSAN,,,31289,,,,,,,,,,,,,,,,,,,2013-09-23,F,,,,,68.20B,NAFRev2,N,,,0,,,,,,
390698355,00018,39069835500018,O,1993-01-01,NN,,,2008-01-04T23:43:21,true,3,,,,QUA,LES MARRIS,31580,LECUSSAN,,,31289,,,,,,,,,,,,,,,,,,,2008-01-01,A,,,,,01.11Z,NAFRev2,N,0.479157,43.153445,0.71,street,Les Marris 31580 Lécussan,31289_3jgmkb,G,LES MARRIS,
390698355,00026,39069835500026,O,1997-06-10,NN,,,,false,4,,,,QUA,LES MARRIS,31580,LECUSSAN,,,31289,,,,,,,,,,,,,,,,,,,2001-02-20,F,,,,,01.4D,NAF1993,N,0.479157,43.153445,0.71,street,Les Marris 31580 Lécussan,31289_3jgmkb,G,LES MARRIS,
390698728,00016,39069872800016,O,,NN,,,,true,1,,,,QUA,LES MARRIS,31580,LECUSSAN,,,31289,,,,,,,,,,,,,,,,,,,1995-12-31,F,,,,,01.3Z,NAF1993,N,0.479157,43.153445,0.71,street,Les Marris 31580 Lécussan,31289_3jgmkb,G,LES MARRIS,
390699197,00013,39069919700013,O,1993-01-01,NN,,,2007-05-18T09:51:14,true,3,,,,QUA,LES MARRIS,31580,LECUSSAN,,,31289,,,,,,,,,,,,,,,,,,,2007-02-28,F,,,,,01.3Z,NAFRev1,N,0.479157,43.153445,0.71,street,Les Marris 31580 Lécussan,31289_3jgmkb,G,LES MARRIS,
391281607,00013,39128160700013,O,1993-03-01,NN,,,,true,1,,,,,QRT MARRIS,31580,LECUSSAN,,,31289,,,,,,,,,,,,,,,,,,,1998-09-30,F,,,,,52.4X,NAF1993,N,0.475881,43.152421,0.58,street,Route des Marris 31580 Lécussan,31289_0012,G,ROUTE DES MARRIS,
394558704,00018,39455870400018,O,1994-04-05,NN,,,2014-07-08T01:23:40,true,5,,,,LD,LA NAUDETTE,31580,LECUSSAN,,,31289,,,,,,,,,,,,,,,,,,,2010-07-31,F,,,,,43.99C,NAFRev2,O,0.501637,43.164016,0.65,street,La Naude 31580 Lécussan,31289_uz1hsb,G,LA NAUDE,
397616855,00011,39761685500011,O,1994-01-01,NN,,,2009-12-16T09:52:37,true,3,,,,,,31580,LECUSSAN,,,31289,,,,,,,,,,,,,,,,,,,2008-01-01,A,,,,,01.50Z,NAFRev2,N,,,0,,,,,,
397616855,00029,39761685500029,O,2010-01-02,,,,2014-01-29T09:53:19,false,2,,83,,,LE VILLAGE,31580,LECUSSAN,,,31289,,,,,,,,,,,,,,,,,,,2013-12-31,F,,,,,01.61Z,NAFRev2,N,0.502151,43.164107,0.93,street,Le Village 31580 Lécussan,31289_vyi4y4,G,LE VILLAGE,
399811652,00011,39981165200011,O,1995-01-01,NN,,,2013-02-25T09:22:51,true,3,,,,,LES MARAIS,31580,LECUSSAN,,,31289,,,,,,,,,,,,,,,,,,,2008-01-01,A,,,,,01.42Z,NAFRev2,N,0.479157,43.153445,0.68,street,Les Marris 31580 Lécussan,31289_3jgmkb,G,LES MARRIS,
400109427,00031,40010942700031,O,2003-12-04,NN,,,2007-10-22T10:07:09,false,3,MME LAURE MATHILDE TOUZANN,,,,VILLAGE,31580,LECUSSAN,,,31289,,,,,,,,,,,,,,,,,,,2007-10-01,F,,,,,67.1E,NAFRev1,N,0.502151,43.164107,0.92,street,Le Village 31580 Lécussan,31289_vyi4y4,G,LE VILLAGE,
404016941,00019,40401694100019,O,1979-01-01,NN,,,2008-01-04T20:33:04,true,3,,,,,,31580,LECUSSAN,,,31289,,,,,,,,,,,,,,,,,,,2008-01-01,A,,,,,01.42Z,NAFRev2,N,,,0,,,,,,
404030538,00015,40403053800015,O,1977-01-01,NN,,,2006-10-28T03:18:40,true,3,,,,,,31580,LECUSSAN,,,31289,,,,,,,,,,,,,,,,,,,2005-09-02,F,,,,,01.3Z,NAFRev1,N,,,0,,,,,,
404030546,00018,40403054600018,O,1969-01-01,NN,,,,true,1,,,,,,31580,LECUSSAN,,,31289,,,,,,,,,,,,,,,,,,,1999-04-16,F,,,,,01.3Z,NAF1993,N,,,0,,,,,,
404030553,00014,40403055300014,O,1980-06-01,NN,,,,true,4,,,,,,31580,LECUSSAN,,,31289,,,,,,,,,,,,,,,,,,,1998-05-01,F,,,,,01.3Z,NAF1993,N,,,0,,,,,,
404030561,00017,40403056100017,O,1975-01-01,NN,,,2008-01-04T20:33:15,true,3,,,,,,31580,LECUSSAN,,,31289,,,,,,,,,,,,,,,,,,,2008-01-01,A,,,,,01.41Z,NAFRev2,N,,,0,,,,,,
404030579,00019,40403057900019,O,1988-04-19,NN,,,2006-10-28T03:18:40,true,3,,,,,,31580,LECUSSAN,,,31289,,,,,,,,,,,,,,,,,,,2005-01-02,F,,,,,01.3Z,NAFRev1,N,,,0,,,,,,
404030587,00012,40403058700012,O,1981-01-01,NN,,,,true,1,,,,,,31580,LECUSSAN,,,31289,,,,,,,,,,,,,,,,,,,2001-09-30,F,,,,,01.1A,NAF1993,N,,,0,,,,,,
404030595,00015,40403059500015,O,1982-01-01,NN,,,2008-01-04T20:33:15,true,3,,,,,,31580,LECUSSAN,,,31289,,,,,,,,,,,,,,,,,,,2008-01-01,A,,,,,01.50Z,NAFRev2,N,,,0,,,,,,
404030603,00017,40403060300017,O,1982-01-01,NN,,,2008-01-04T20:33:15,true,3,,,,,,31580,LECUSSAN,,,31289,,,,,,,,,,,,,,,,,,,2008-01-01,A,,,,,01.11Z,NAFRev2,N,,,0,,,,,,
404030611,00010,40403061100010,O,1981-01-01,NN,,,2008-01-04T20:33:15,true,3,,,,,,31580,LECUSSAN,,,31289,,,,,,,,,,,,,,,,,,,2008-01-01,A,,,,,01.11Z,NAFRev2,N,,,0,,,,,,
404030629,00012,40403062900012,O,1983-11-01,NN,,,2006-10-28T03:18:40,true,3,,,,,,31580,LECUSSAN,,,31289,,,,,,,,,,,,,,,,,,,2004-03-31,F,,,,,01.2A,NAFRev1,N,,,0,,,,,,
404030637,00015,40403063700015,O,1985-01-01,NN,,,,true,4,LE SAUTEX,,,,,31580,LECUSSAN,,,31289,,,,,,,,,,,,,,,,,,,2003-12-31,F,,,,,01.3Z,NAFRev1,N,0.527885,43.163066,0.75,street,Les Sautex 31580 Lécussan,31289_d2jz2q,D,LES SAUTEX,
404030645,00018,40403064500018,O,1980-01-01,NN,,,,true,1,,,,,,31580,LECUSSAN,,,31289,,,,,,,,,,,,,,,,,,,2000-04-30,F,,,,,01.3Z,NAF1993,N,,,0,,,,,,
405287004,00015,40528700400015,O,1980-01-01,NN,,,,true,1,,,,,,31580,LECUSSAN,,,31289,,,,,,,,,,,,,,,,,,,1999-06-28,F,,,,,01.3Z,NAF1993,N,,,0,,,,,,
405287012,00018,40528701200018,O,1989-05-20,NN,,,2013-01-10T05:17:36,true,4,,,,,,31580,LECUSSAN,,,31289,,,,,,,,,,,,,,,,,,,2012-12-31,F,,,,,01.50Z,NAFRev2,N,,,0,,,,,,
405287020,00011,40528702000011,O,1979-01-01,NN,,,2008-01-04T20:53:04,true,3,,,,,,31580,LECUSSAN,,,31289,,,,,,,,,,,,,,,,,,,2008-01-01,A,,,,,01.50Z,NAFRev2,N,,,0,,,,,,
408231249,00017,40823124900017,O,1996-07-01,NN,,,,true,1,,,,QUAI,DE LA LOSSE,31580,LECUSSAN,,,31289,,,,,,,,,,,,,,,,,,,1997-04-01,F,,,,,92.3H,NAF1993,O,0.489095,43.160542,0.66,street,Chemin de la Losse 31580 Lécussan,31289_0010,G,CHEMIN DE LA LOSSE,
409980992,00047,40998099200047,O,2012-04-16,,,,2013-01-30T11:07:53,true,1,,,,CHE,DU TAILLUR,31580,LECUSSAN,,,31289,,,,,,,,,,,,,,,,,,,2012-04-16,A,,,,,68.20B,NAFRev2,N,0.497188,43.163313,0.81,street,Chemin du Taillur 31580 Lécussan,31289_0021,G,CHEMIN DU TAILLUR,
410005029,00039,41000502900039,O,2005-06-01,NN,,,2017-05-04T05:56:58,false,3,,,,QUA,MARRIS,31580,LECUSSAN,,,31289,,,,,,,,,,,,,,,,,,,2015-04-01,F,,,,,74.90A,NAFRev2,O,0.475881,43.152421,0.58,street,Route des Marris 31580 Lécussan,31289_0012,G,ROUTE DES MARRIS,
413418906,00017,41341890600017,O,1997-07-01,NN,,,2017-10-20T03:30:15,true,5,,,,,,31580,LECUSSAN,,,31289,,,,,,,,,,,,,,,,,,,2012-01-01,F,,,,,01.11Z,NAFRev2,N,,,0,,,,,,
417901782,00025,41790178200025,O,2002-09-01,NN,,,2008-01-04T23:12:30,true,3,,,,,,31580,LECUSSAN,,,31289,,,,,,,,,,,,,,,,,,,2008-01-01,A,,,,,68.20B,NAFRev2,N,,,0,,,,,,
418098547,00015,41809854700015,O,1998-03-03,,,,,false,3,,,,QUA,LAS PLANES,31580,LECUSSAN,,,31289,,,,,,,,,,,,,,,,,,,1999-03-15,F,,,,,74.1J,NAF1993,N,,,0,,,,,,
421334707,00013,42133470700013,O,1998-12-31,,,,,true,1,,,,QUA,DE LA LOSSE,31580,LECUSSAN,,,31289,,,,,,,,,,,,,,,,,,,2000-06-30,F,,,,,55.3A,NAF1993,N,0.489095,43.160542,0.69,street,Chemin de la Losse 31580 Lécussan,31289_0010,G,CHEMIN DE LA LOSSE,
422914002,00015,42291400200015,O,1998-11-01,NN,,,2008-01-05T00:29:54,true,4,,,,LD,LE SAUTEX,31580,LECUSSAN,,,31289,,,,,,,,,,,,,,,,,,,2008-01-01,A,,,,,01.42Z,NAFRev2,N,0.527885,43.163066,0.75,street,Les Sautex 31580 Lécussan,31289_d2jz2q,G,LES SAUTEX,
422914200,00015,42291420000015,O,1998-11-01,NN,,,,true,4,,,,LD,LE SAUTEX,31580,LECUSSAN,,,31289,,,,,,,,,,,,,,,,,,,2003-12-31,F,,,,,01.1A,NAFRev1,N,0.527885,43.163066,0.75,street,Les Sautex 31580 Lécussan,31289_d2jz2q,G,LES SAUTEX,
423485606,00010,42348560600010,O,1999-07-03,NN,,,2019-03-15T11:32:13,false,4,,,,LD,LES ARTIGUES,31580,LECUSSAN,,,31289,,,,,,,,,,,,,,,,,,,2018-12-31,F,,,,,47.81Z,NAFRev2,N,0.479157,43.153445,0.32,street,Les Marris 31580 Lécussan,31289_3jgmkb,G,LES MARRIS,
423485606,00028,42348560600028,O,2002-07-01,NN,,,2013-02-04T02:36:49,true,3,,,,LD,LES ARTIGUES,31580,LECUSSAN,,,31289,,,,,,,,,,,,,,,,,,,2008-01-01,A,,,,,01.50Z,NAFRev2,N,0.479157,43.153445,0.32,street,Les Marris 31580 Lécussan,31289_3jgmkb,G,LES MARRIS,
428596274,00012,42859627400012,O,1999-06-29,NN,,,2008-01-05T01:28:26,true,3,,,,,,31580,LECUSSAN,,,31289,,,,,,,,,,,,,,,,,,,2008-01-01,A,,,,,01.11Z,NAFRev2,N,,,0,,,,,,
428832133,00014,42883213300014,O,1981-06-01,NN,,,2008-01-05T01:31:39,true,3,,,,,,31580,LECUSSAN,,,31289,,,,,,,,,,,,,,,,,,,2008-01-01,A,,,,,47.78B,NAFRev2,N,,,0,,,,,,
429050503,00011,42905050300011,O,1999-12-17,,,,,true,1,,,,QUAI,LAS PLANES,31580,LECUSSAN,,,31289,,,,,,,,,,,,,,,,,,,2001-08-15,F,,,,,92.3H,NAF1993,N,,,0,,,,,,
430508697,00017,43050869700017,O,1997-01-01,NN,,,2016-01-12T00:22:16,true,3,,,,,LA NAUDETTE,31580,LECUSSAN,,,31289,,,,,,,,,,,,,,,,,,,2008-01-01,A,,,,,01.50Z,NAFRev2,N,0.501637,43.164016,0.65,street,La Naude 31580 Lécussan,31289_uz1hsb,G,LA NAUDE,
432000958,00012,43200095800012,O,2000-05-01,NN,,,2016-12-14T03:55:23,true,5,,,,,,31580,LECUSSAN,,,31289,,,,,,,,,,,,,,,,,,,2016-06-30,F,,,,,68.20B,NAFRev2,N,,,0,,,,,,
433302338,00010,43330233800010,O,1999-07-22,NN,,,2008-01-04T19:00:03,true,3,,,,,,31580,LECUSSAN,,,31289,,,,,,,,,,,,,,,,,,,2008-01-01,A,,,,,01.11Z,NAFRev2,N,,,0,,,,,,
434742169,00015,43474216900015,O,2001-02-26,NN,,,2015-01-13T15:45:24,true,4,,,,QUAI,LES MARRIS,31580,LECUSSAN,,,31289,,,,,,,,,,,,,,,,,,,2012-12-31,F,,,,,01.61Z,NAFRev2,N,0.479157,43.153445,0.68,street,Les Marris 31580 Lécussan,31289_3jgmkb,G,LES MARRIS,
439534033,00014,43953403300014,O,2001-10-27,NN,,,,false,5,,,,,,31580,LECUSSAN,,,31289,,,,,,,,,,,,,,,,,,,2003-12-31,F,LE MARYLAND,,,,55.4C,NAFRev1,O,,,0,,,,,,
440161727,00019,44016172700019,O,2001-10-01,NN,,,2008-01-04T20:50:36,true,3,,,,,,31580,LECUSSAN,,,31289,,,,,,,,,,,,,,,,,,,2008-01-01,A,,,,,01.11Z,NAFRev2,N,,,0,,,,,,
440728707,00017,44072870700017,O,2002-02-03,NN,,,2011-11-18T00:19:01,false,3,,,,,LE VILLAGE,31580,LECUSSAN,,,31289,,,,,,,,,,,,,,,,,,,2002-12-25,F,,,,,92.6C,NAF1993,N,0.502151,43.164107,0.93,street,Le Village 31580 Lécussan,31289_vyi4y4,G,LE VILLAGE,
440789022,00017,44078902200017,O,2002-01-01,NN,,,2013-09-17T08:58:32,true,4,,,,,QUARIER MARRIS,31580,LECUSSAN,,,31289,,,,,,,,,,,,,,,,,,,2013-09-15,F,,,,,01.11Z,NAFRev2,N,0.479157,43.153445,0.46,street,Les Marris 31580 Lécussan,31289_3jgmkb,G,LES MARRIS,
443674502,00010,44367450200010,O,2002-09-01,NN,,,2017-11-06T11:00:08,true,3,,,,,AU VILLAGE,31580,LECUSSAN,,,31289,,,,,,,,,,,,,,,,,,,2008-01-01,A,,,,,01.50Z,NAFRev2,N,0.502151,43.164107,0.67,street,Le Village 31580 Lécussan,31289_vyi4y4,G,LE VILLAGE,
443692942,00016,44369294200016,O,2002-06-01,NN,,,2013-11-13T09:06:12,true,3,,,,,,31580,LECUSSAN,,,31289,,,,,,,,,,,,,,,,,,,2008-01-01,A,,,,,01.47Z,NAFRev2,N,,,0,,,,,,
450823125,00015,45082312500015,O,2002-11-08,NN,,,2015-01-23T13:32:50,false,4,CHEZ ME PERISSE ISABELLE,,,,,31580,LECUSSAN,,,31289,,,,,,,,,,,,,,,,,,,2014-06-12,F,,,,,94.99Z,NAFRev2,N,,,0,,,,,,
450823125,00023,45082312500023,O,2014-06-12,,,,2015-01-23T13:35:11,true,1,,,,,MAIRIE,31580,LECUSSAN,,,31289,,,,,,,,,,,,,,,,,,,2014-06-12,A,,,,,94.99Z,NAFRev2,N,0.501074,43.159817,0.9,street,Place de la Mairie 31580 Lécussan,31289_0020,G,PLACE DE LA MAIRIE,
452444060,00027,45244406000027,O,2004-02-20,NN,,,2007-12-18T11:09:57,true,3,,,,QUA,DE LA LOSSE,31580,LECUSSAN,,,31289,,,,,,,,,,,,,,,,,,,2005-02-28,F,,,,,55.4C,NAFRev1,O,0.489095,43.160542,0.69,street,Chemin de la Losse 31580 Lécussan,31289_0010,G,CHEMIN DE LA LOSSE,
453021404,00018,45302140400018,O,2004-04-01,NN,,,2008-01-05T02:55:05,true,3,,,,,,31580,LECUSSAN,,,31289,,,,,,,,,,,,,,,,,,,2008-01-01,A,,,,,01.42Z,NAFRev2,N,,,0,,,,,,
480429927,00019,48042992700019,O,2005-01-01,,,,2008-01-05T00:08:25,true,2,,,,AV,DU 19 MARS 1962,31580,LECUSSAN,,,31289,,,,,,,,,,,,,,,,,,,2008-01-01,A,,,,,01.50Z,NAFRev2,N,0.492722,43.159869,0.83,street,Avenue du 19 Mars 1962 31580 Lécussan,31289_47ewej,G,AVENUE DU 19 MARS 1962,
480510312,00048,48051031200048,O,2019-07-10,,,,2019-07-30T09:24:23,true,1,,235,,RUE,DU BATISTOU,31580,LECUSSAN,,,31289,,,,,,,,,,,,,,,,,,,2019-07-10,A,,,,MENUISERIE AGENCEMENT SEBASTIEN GENTIL,43.32A,NAFRev2,N,0.502409,43.165937,0.93,housenumber,235 Rue du Batistou 31580 Lécussan,31289_0005_00235,G,235 RUE DU BATISTOU,
481829182,00015,48182918200015,O,1999-01-20,NN,,,2008-01-05T00:35:57,true,3,,,,,PLAN DU GOUT,31580,LECUSSAN,,,31289,,,,,,,,,,,,,,,,,,,2008-01-01,A,,,,,01.11Z,NAFRev2,N,0.503302,43.164507,0.79,street,Le Plan du Gouit 31580 Lécussan,31289_b037,G,LE PLAN DU GOUIT,
483550885,00014,48355088500014,O,2005-07-01,,,,2006-11-25T20:19:59,true,2,,,,QUA,DE LA LOSSE,31580,LECUSSAN,,,31289,,,,,,,,,,,,,,,,,,,2005-09-23,F,,,,,55.4C,NAFRev1,O,0.489095,43.160542,0.69,street,Chemin de la Losse 31580 Lécussan,31289_0010,G,CHEMIN DE LA LOSSE,
487963886,00014,48796388600014,O,2006-01-21,NN,,,2012-03-02T09:33:33,false,2,,,,,,31580,LECUSSAN,,,31289,,,,,,,,,,,,,,,,,,,2006-03-31,F,TCHINTCHARRO,,,,55.4C,NAFRev1,O,,,0,,,,,,
487963894,00018,48796389400018,O,2006-01-21,NN,,,2013-10-29T14:22:14,false,5,,,,QUA,LA LOSSE,31580,LECUSSAN,,,31289,,,,,,,,,,,,,,,,,,,2008-02-01,F,LE TERRE ET MER,,,,56.10A,NAFRev2,N,0.491668,43.162803,0.84,street,Quartier la Losse 31580 Lécussan,31289_yalz9h,G,QUARTIER LA LOSSE,
490314333,00025,49031433300025,O,2013-02-01,,,9602AB,2015-03-17T01:30:27,false,2,,270,,,CHEM DU CAP  HAIL,31580,LECUSSAN,,,31289,,,,,,,,,,,,,,,,,,,2013-09-01,F,,,,ALEXA COIFFURE,96.02A,NAFRev2,N,0.500531,43.161861,0.8,housenumber,270 Chemin du Cap du Hail 31580 Lécussan,31289_0006_00270,G,270 CHEMIN DU CAP DU HAIL,
490314333,00033,49031433300033,O,2013-09-01,01,2016,,2019-05-28T07:45:04,false,2,,140,,AV,DU 19 MARS 1962,31580,LECUSSAN,,,31289,,,,,,,,,,,,,,,,,,,2017-12-31,F,,,,ALEXA COIFFURE,96.02A,NAFRev2,N,0.493195,43.15941,0.85,housenumber,140 Avenue du 19 Mars 1962 31580 Lécussan,31289_47ewej_00140,G,140 AVENUE DU 19 MARS 1962,
490314333,00041,49031433300041,O,2019-06-01,,,,2019-05-28T07:45:04,true,1,,,,CHE,DE LA CASSOULADE,31580,LECUSSAN,,,31289,,,,,,,,,,,,,,,,,,,2019-06-01,A,LA CHEVRERIE D'ALEX,,,,01.45Z,NAFRev2,N,0.477363,43.152332,0.84,street,Chemin de la Cassoulade 31580 Lécussan,31289_0013,G,CHEMIN DE LA CASSOULADE,
498047828,00013,49804782800013,O,2007-03-01,,,,2013-02-19T04:47:51,true,2,,,,,LES MARRIS,31580,LECUSSAN,,,31289,,,,,,,,,,,,,,,,,,,2008-01-01,A,,,,,01.42Z,NAFRev2,N,0.479157,43.153445,0.93,street,Les Marris 31580 Lécussan,31289_3jgmkb,G,LES MARRIS,
499234011,00017,49923401100017,O,2007-06-01,02,2017,4312BA,2019-09-10T03:40:40,true,2,,,,,,31580,LECUSSAN,,,31289,,,,,,,,,,,,,,,,,,,2008-01-01,A,,,,,81.30Z,NAFRev2,N,,,0,,,,,,
499708576,00016,49970857600016,O,2007-05-01,NN,,,2017-05-04T07:23:45,true,2,,,,CHE,DES PESQUIDES,31580,LECUSSAN,,,31289,,,,,,,,,,,,,,,,,,,2008-01-01,A,,,,,01.47Z,NAFRev2,N,0.477972,43.151021,0.82,street,Chemin des Pesquides 31580 Lécussan,31289_0011,G,CHEMIN DES PESQUIDES,
500449236,00032,50044923600032,O,2010-11-15,00,2016,4520AC,2019-04-29T15:25:25,true,1,,,,LD,DU PARC ET DE L'ESTAQUE,31580,LECUSSAN,,,31289,,,,,,,,,,,,,,,,,,,2010-11-15,A,,,,,45.20A,NAFRev2,O,0.499015,43.166296,0.63,street,Landes du Parc et de Lasta 31580 Lécussan,31289_b019,G,LANDES DU PARC ET DE LASTA,