siren,nic,siret,statutDiffusionEtablissement,dateCreationEtablissement,trancheEffectifsEtablissement,anneeEffectifsEtablissement,activitePrincipaleRegistreMetiersEtablissement,dateDernierTraitementEtablissement,etablissementSiege,nombrePeriodesEtablissement,complementAdresseEtablissement,numeroVoieEtablissement,indiceRepetitionEtablissement,typeVoieEtablissement,libelleVoieEtablissement,codePostalEtablissement,libelleCommuneEtablissement,libelleCommuneEtrangerEtablissement,distributionSpecialeEtablissement,codeCommuneEtablissement,codeCedexEtablissement,libelleCedexEtablissement,codePaysEtrangerEtablissement,libellePaysEtrangerEtablissement,complementAdresse2Etablissement,numeroVoie2Etablissement,indiceRepetition2Etablissement,typeVoie2Etablissement,libelleVoie2Etablissement,codePostal2Etablissement,libelleCommune2Etablissement,libelleCommuneEtranger2Etablissement,distributionSpeciale2Etablissement,codeCommune2Etablissement,codeCedex2Etablissement,libelleCedex2Etablissement,codePaysEtranger2Etablissement,libellePaysEtranger2Etablissement,dateDebut,etatAdministratifEtablissement,enseigne1Etablissement,enseigne2Etablissement,enseigne3Etablissement,denominationUsuelleEtablissement,activitePrincipaleEtablissement,nomenclatureActivitePrincipaleEtablissement,caractereEmployeurEtablissement,longitude,latitude,geo_score,geo_type,geo_adresse,geo_id,geo_ligne,geo_l4,geo_l5
055200984,01526,05520098401526,O,2010-04-01,02,2017,,2019-11-14T14:00:31,false,1,ZAC DU BOUTET,27,,AV,MARCONI,31470,SAINT-LYS,,,31499,,,,,,,,,,,,,,,,,,,2010-04-01,A,,,,,46.73A,NAFRev2,O,1.198646,43.511036,0.81,housenumber,27 Avenue Marconi 31470 Saint-Lys,31499_0195_00027,G,27 AVENUE MARCONI,
095780284,00162,09578028400162,O,1993-01-01,,,,2019-11-14T14:00:31,false,3,LD LES AULIERES,,,RTE,DE FONTENILLES,31470,SAINT-LYS,,,31499,,,,,,,,,,,,,,,,,,,1993-12-25,F,,,,,60.2M,NAF1993,N,1.181093,43.52204,0.85,street,Route de Fontenilles 31470 Saint-Lys,31499_0118,G,ROUTE DE FONTENILLES,
130008352,00655,13000835200655,O,2009-12-21,03,2017,,2019-11-14T14:00:31,false,1,,12,,RUE,DU 11 NOVEMBRE 1918,31470,SAINT-LYS,,,31499,,,,,,,,,,,,,,,,,,,2009-12-21,A,TRESORERIE  SAINT-LYS,,,,84.11Z,NAFRev2,N,1.175176,43.513687,0.95,housenumber,12 Rue du 11 Novembre 1918 31470 Saint-Lys,31499_0228_00012,G,12 RUE DU 11 NOVEMBRE 1918,
173102112,00146,17310211200146,O,1983-03-16,,,,2019-11-14T14:00:31,false,4,,12,,RUE,DU 11 NOVEMBRE 1918,31470,SAINT-LYS,,,31499,,,,,,,,,,,,,,,,,,,2009-12-21,F,TRESORERIE DE SAINT-LYS,,,,84.11Z,NAFRev2,N,1.175176,43.513687,0.95,housenumber,12 Rue du 11 Novembre 1918 31470 Saint-Lys,31499_0228_00012,G,12 RUE DU 11 NOVEMBRE 1918,
193117728,00017,19311772800017,O,1983-03-01,21,2017,,2019-11-14T14:00:31,true,5,,77,,AV,DU LANGUEDOC,31470,SAINT-LYS,,,31499,,,,,,,,,,,,,,,,,,,2009-09-01,A,,,,,85.31Z,NAFRev2,O,1.186495,43.51207,0.85,housenumber,77 Avenue du Languedoc 31470 Saint-Lys,31499_0174_00077,G,77 AVENUE DU LANGUEDOC,
200055291,00013,20005529100013,O,2015-12-31,01,2016,,2019-11-14T14:00:31,true,2,,21,,RTE,DE TOULOUSE,31470,SAINT-LYS,,,31499,,,,,,,,,,,,,,,,,,,2017-08-01,F,,,,,84.11Z,NAFRev2,O,1.177241,43.514551,0.85,housenumber,21 Route de Toulouse 31470 Saint-Lys,31499_0328_00021,G,21 ROUTE DE TOULOUSE,
213104995,00013,21310499500013,O,1983-03-01,21,2017,,2019-11-14T14:00:31,true,4,,1,,PL,NATIONALE,31470,SAINT-LYS,,,31499,,,,,,,,,,,,,,,,,,,2008-01-01,A,MAIRIE,,,,84.11Z,NAFRev2,O,1.176766,43.513857,0.83,housenumber,1 Place Nationale 31470 Saint-Lys,31499_0221_00001,G,1 PLACE NATIONALE,
213104995,00021,21310499500021,O,1983-12-21,11,2017,,2019-11-14T14:00:31,false,3,,1,,RUE,DU DR MARC JACOBSOHN,31470,SAINT-LYS,,,31499,,,,,,,,,,,,,,,,,,,2008-01-01,A,ECOLE MATERNELLE PUBLIQUE,,,,85.10Z,NAFRev2,N,,,0,,,,,,
213104995,00039,21310499500039,O,1983-12-21,NN,,,2019-11-14T14:00:31,false,4,,,,,ROUTE DE LAMASQUERE,31470,SAINT-LYS,,,31499,,,,,,,,,,,,,,,,,,,1997-12-31,F,ECOL PRIM NUMERO 2,,,,80.1Z,NAF1993,N,1.194501,43.504723,0.95,street,Route de Lamasquère 31470 Saint-Lys,31499_0169,G,ROUTE DE LAMASQUERE,
213104995,00047,21310499500047,O,1983-12-21,NN,,,2019-11-14T14:00:31,false,4,,,,,ROUTE DE LAMASQUERE,31470,SAINT-LYS,,,31499,,,,,,,,,,,,,,,,,,,1997-12-31,F,ECOL PRIM NUMERO 1,,,,80.1Z,NAF1993,N,1.194501,43.504723,0.95,street,Route de Lamasquère 31470 Saint-Lys,31499_0169,G,ROUTE DE LAMASQUERE,
213104995,00054,21310499500054,O,1995-12-25,NN,,,2019-11-14T14:00:31,false,2,MAIRIE,,,PL,NATIONALE,31470,SAINT-LYS,,,31499,,,,,,,,,,,,,,,,,,,2008-01-01,A,SERVICE ASSAINISSEMENT,,,,37.00Z,NAFRev2,N,1.176766,43.513857,0.8,street,Place Nationale 31470 Saint-Lys,31499_0221,G,PLACE NATIONALE,
213104995,00062,21310499500062,O,1997-09-01,NN,,,2019-11-14T14:00:31,false,4,,2,,AV,DU 19 MARS 1962,31470,SAINT-LYS,,,31499,,,,,,,,,,,,,,,,,,,2015-08-31,F,ECOLE ELEMENTAIRE PUB L AYGUEBELLE,,,,85.20Z,NAFRev2,N,1.180236,43.511423,0.77,housenumber,2 Rue du 19 Mars 1962 31470 Saint-Lys,31499_0210_00002,G,2 RUE DU 19 MARS 1962,
213104995,00070,21310499500070,O,1997-02-12,NN,,,2019-12-31T10:46:57,false,4,,,,PL,NATIONALE,31470,SAINT-LYS,,,31499,,,,,,,,,,,,,,,,,,,2018-12-31,F,PARC D'ACTIVITES,,,,42.99Z,NAFRev2,N,1.176766,43.513857,0.8,street,Place Nationale 31470 Saint-Lys,31499_0221,G,PLACE NATIONALE,
213104995,00088,21310499500088,O,2000-09-01,NN,,,2019-11-14T14:00:31,false,3,,2,,AV,DU 19 MARS 1962,31470,SAINT-LYS,,,31499,,,,,,,,,,,,,,,,,,,2002-09-01,F,ECOLE ELEMENTAIRE MIXTE 2,,,,80.1Z,NAF1993,N,1.180236,43.511423,0.77,housenumber,2 Rue du 19 Mars 1962 31470 Saint-Lys,31499_0210_00002,G,2 RUE DU 19 MARS 1962,
213104995,00096,21310499500096,O,2002-09-01,12,2017,,2019-11-14T14:00:31,false,5,,10,,AV,PIERRE DE COUBERTIN,31470,SAINT-LYS,,,31499,,,,,,,,,,,,,,,,,,,2016-09-01,A,ECOLE ELEMENTAIRE PUBLIQUE FLORENCE ARTHAUD,,,,85.20Z,NAFRev2,N,1.181264,43.511769,0.81,housenumber,10 Rue Pierre de Coubertin 31470 Saint-Lys,31499_lnugyp_00010,G,10 RUE PIERRE DE COUBERTIN,
213104995,00104,21310499500104,O,2008-09-01,12,2017,,2019-11-14T14:00:31,false,1,LIEU DIT LE MOULIN DE LA JALOUSIE,,,AV,DES ONDES COURTES,31470,SAINT-LYS,,,31499,,,,,,,,,,,,,,,,,,,2008-09-01,A,ECOLE PRIMAIRE PUB ERIC TABARLY,,,,85.20Z,NAFRev2,N,1.191396,43.521374,0.84,street,Avenue des Ondes Courtes 31470 Saint-Lys,31499_0227,G,AVENUE DES ONDES COURTES,
243100468,00012,24310046800012,O,1989-10-19,,,,2019-11-14T14:00:31,false,5,MAIRIE,,,PL,NATIONALE,31470,SAINT-LYS,,,31499,,,,,,,,,,,,,,,,,,,2008-01-01,F,,,,,84.11Z,NAFRev2,O,1.176766,43.513857,0.8,street,Place Nationale 31470 Saint-Lys,31499_0221,G,PLACE NATIONALE,
243100468,00038,24310046800038,O,1999-09-29,NN,,,2019-11-14T14:00:31,true,2,,21,,RTE,DE TOULOUSE,31470,SAINT-LYS,,,31499,,,,,,,,,,,,,,,,,,,2015-12-31,F,,,,,84.11Z,NAFRev2,O,1.177241,43.514551,0.85,housenumber,21 Route de Toulouse 31470 Saint-Lys,31499_0328_00021,G,21 ROUTE DE TOULOUSE,
253100697,00015,25310069700015,O,1983-03-01,NN,,,2019-11-14T14:00:31,true,3,,1,,PL,NATIONALE,31470,SAINT-LYS,,,31499,,,,,,,,,,,,,,,,,,,1991-12-25,F,SICOM SCOLAIRE,,,,90.11,NAP,N,1.176766,43.513857,0.83,housenumber,1 Place Nationale 31470 Saint-Lys,31499_0221_00001,G,1 PLACE NATIONALE,
253101661,00010,25310166100010,O,1983-10-25,NN,,,2019-11-14T14:00:31,true,3,,,,,MAIRIE,31470,SAINT-LYS,,,31499,,,,,,,,,,,,,,,,,,,1991-12-25,F,SIVU ORDURES,,,,87.09,NAP,N,1.207682,43.51375,0.79,street,Metairie de Marsoulan 31470 Saint-Lys,31499_b060,G,METAIRIE DE MARSOULAN,
263106031,00010,26310603100010,O,1984-09-04,11,2017,,2019-11-14T14:00:31,true,4,,,,,MAIRIE,31470,SAINT-LYS,,,31499,,,,,,,,,,,,,,,,,,,2008-01-01,A,CCAS,,,,88.99B,NAFRev2,O,1.207682,43.51375,0.79,street,Metairie de Marsoulan 31470 Saint-Lys,31499_b060,G,METAIRIE DE MARSOULAN,
293107892,00011,29310789200011,O,1999-10-28,,,,2019-11-14T14:00:31,true,3,,3,,ALL,DU VIGNEMALE,31470,SAINT-LYS,,,31499,,,,,,,,,,,,,,,,,,,2008-01-01,A,,,,,42.99Z,NAFRev2,N,1.185497,43.514764,0.85,housenumber,3 Allee du Vignemale 31470 Saint-Lys,31499_0358_00003,G,3 ALLEE DU VIGNEMALE,
300001708,00035,30000170800035,O,,NN,,,2019-11-14T14:00:31,true,1,,,,,QUARTIER BRUNO,31470,SAINT-LYS,,,31499,,,,,,,,,,,,,,,,,,,1990-05-15,F,,,,,55.73,NAP,N,1.192848,43.493314,0.58,street,Quartier Prim 31470 Saint-Lys,31499_ikfayp,G,QUARTIER PRIM,
300109949,00010,30010994900010,O,,,,,2019-11-14T14:00:31,true,1,,,,RUE,DES ECOLES,31470,SAINT-LYS,,,31499,,,,,,,,,,,,,,,,,,,1984-12-25,F,,,,,92.14,NAP,N,1.17435,43.511462,0.55,street,Rue des Glycines 31470 Saint-Lys,31499_0138,G,RUE DES GLYCINES,
300109964,00019,30010996400019,O,1900-01-01,NN,,,2019-11-14T14:00:31,true,5,,18,,RTE,DE LAMASQUERE,31470,SAINT-LYS,,,31499,,,,,,,,,,,,,,,,,,,2015-12-31,F,,,,,87.10A,NAFRev2,O,1.194501,43.504723,0.73,street,Route de Lamasquère 31470 Saint-Lys,31499_0169,G,ROUTE DE LAMASQUERE,
300132792,00015,30013279200015,O,,NN,,,2019-11-14T14:00:31,true,1,,,,RTE,DE TOULOUSE,31470,SAINT-LYS,,,31499,,,,,,,,,,,,,,,,,,,1986-01-01,F,,,,,81.21,NAP,N,1.176502,43.514178,0.84,street,Route de Toulouse 31470 Saint-Lys,31499_0328,G,ROUTE DE TOULOUSE,
300249521,00018,30024952100018,O,,NN,,,2019-11-14T14:00:31,true,1,,,,,,31470,SAINT-LYS,,,31499,,,,,,,,,,,,,,,,,,,1992-09-30,F,,,,,92.3F,NAF1993,N,,,0,,,,,,
300256807,00011,30025680700011,O,1900-01-01,NN,,,2019-11-14T14:00:31,false,4,,16,,AV,DE TOULOUSE,31470,SAINT-LYS,,,31499,,,,,,,,,,,,,,,,,,,1998-12-31,F,,,,,70.3A,NAF1993,O,1.177232,43.514466,0.74,housenumber,16 Route de Toulouse 31470 Saint-Lys,31499_0328_00016,G,16 ROUTE DE TOULOUSE,
300256807,00029,30025680700029,O,1998-12-31,NN,,,2019-11-14T14:00:31,true,3,,7,,RUE,DU 8 MAI 1945,31470,SAINT-LYS,,,31499,,,,,,,,,,,,,,,,,,,2008-01-01,A,,,,,68.20B,NAFRev2,N,1.177644,43.513607,0.95,housenumber,7 Rue du 8 Mai 1945 31470 Saint-Lys,31499_0199_00007,G,7 RUE DU 8 MAI 1945,
300292505,00017,30029250500017,O,,NN,,,2019-11-14T14:00:31,true,1,,,,PL,NATIONALE,31470,SAINT-LYS,,,31499,,,,,,,,,,,,,,,,,,,,F,,,,,67.04,NAP,N,1.176766,43.513857,0.8,street,Place Nationale 31470 Saint-Lys,31499_0221,G,PLACE NATIONALE,
300366630,00014,30036663000014,O,,,,,2019-11-14T14:00:31,true,1,,12,,RUE,DE LA REPUBLIQUE,31470,SAINT-LYS,,,31499,,,,,,,,,,,,,,,,,,,1992-03-31,F,,,,,52.2L,NAF1993,N,1.175246,43.512702,0.83,housenumber,12 Avenue de la République 31470 Saint-Lys,31499_0264_00012,G,12 AVENUE DE LA REPUBLIQUE,
300740131,00028,30074013100028,O,,NN,,,2019-11-14T14:00:31,true,1,,,,LD,LA RIVIERE,31470,SAINT-LYS,,,31499,,,,,,,,,,,,,,,,,,,1996-06-26,F,,,,,45.4A,NAF1993,N,1.189106,43.519153,0.95,street,La Riviere 31470 Saint-Lys,31499_aeyl61,G,LA RIVIERE,
301019949,00025,30101994900025,O,,NN,,,2019-11-14T14:00:31,true,1,,17,,PL,NATIONALE,31470,SAINT-LYS,,,31499,,,,,,,,,,,,,,,,,,,1987-08-16,F,,,,,64.48,NAP,N,1.176329,43.513983,0.83,housenumber,17 Place Nationale 31470 Saint-Lys,31499_0221_00017,G,17 PLACE NATIONALE,
301169116,00078,30116911600078,O,1993-02-01,,,,2019-11-14T14:00:31,false,5,,12,,,LIBERTE,31470,SAINT-LYS,,,31499,,,,,,,,,,,,,,,,,,,2008-02-29,F,,,,,68.32A,NAFRev2,N,1.177133,43.513882,0.92,street,Place de la Liberté 31470 Saint-Lys,31499_0181,G,PLACE DE LA LIBERTE,
302154851,00026,30215485100026,O,1900-01-01,,,,2019-11-14T14:00:31,false,4,,,,CHE,DE BARCELONE,31470,SAINT-LYS,,,31499,,,,,,,,,,,,,,,,,,,1988-12-25,F,,,,,55.60,NAP,N,1.171097,43.506051,0.84,street,Chemin de Barcelone 31470 Saint-Lys,31499_0026,G,CHEMIN DE BARCELONE,
302377379,00029,30237737900029,O,2001-04-20,NN,,,2019-11-14T14:00:31,true,4,MOULIN DE LA JALOUSIE,140,,CHE,DE LA GIRONDE,31470,SAINT-LYS,,,31499,,,,,,,,,,,,,,,,,,,2008-06-30,F,,,,,71.12B,NAFRev2,N,1.185942,43.520709,0.86,housenumber,140 Chemin de la Gironde 31470 Saint-Lys,31499_0134_00140,G,140 CHEMIN DE LA GIRONDE,
302461447,00013,30246144700013,O,,NN,,,2019-11-14T14:00:31,true,1,,,,,,31470,SAINT-LYS,,,31499,,,,,,,,,,,,,,,,,,,1987-04-10,F,,,,,62.43,NAP,N,,,0,,,,,,
302461454,00027,30246145400027,O,1995-01-05,NN,,,2019-11-14T14:00:31,true,4,,,,LD,LE VILLAGE,31470,SAINT-LYS,,,31499,,,,,,,,,,,,,,,,,,,2008-01-01,A,,,,,68.20B,NAFRev2,N,1.174551,43.516579,0.95,street,Le Village 31470 Saint-Lys,31499_33x2mv,G,LE VILLAGE,
302813613,00015,30281361300015,O,,,,,2019-11-14T14:00:31,true,1,,,,,,31470,SAINT-LYS,,,31499,,,,,,,,,,,,,,,,,,,1987-12-25,F,,,,,65.06,NAP,N,,,0,,,,,,
303229942,00014,30322994200014,O,1900-01-01,NN,,,2019-11-14T14:00:31,true,3,,,,RTE,DE SAINT THOMAS,31470,SAINT-LYS,,,31499,,,,,,,,,,,,,,,,,,,2008-01-01,A,,,,,68.20B,NAFRev2,N,1.166667,43.515551,0.86,street,Route de Saint-thomas 31470 Saint-Lys,31499_0295,G,ROUTE DE SAINT THOMAS,
303232425,00015,30323242500015,O,,NN,,,2019-11-14T14:00:31,true,1,,,,RTE,DE SEYSSES,31470,SAINT-LYS,,,31499,,,,,,,,,,,,,,,,,,,,F,,,,,67.04,NAP,N,1.175687,43.517171,0.46,street,Rue de Vaysse 31470 Saint-Lys,31499_s9hksl,G,RUE DE VAYSSE,
303659718,00017,30365971800017,O,1975-01-01,NN,,,2019-11-14T14:00:31,true,4,,,,LD,BORDENEUVE CHEMINDE LARAME,31470,SAINT-LYS,,,31499,,,,,,,,,,,,,,,,,,,2003-05-23,F,,,,,52.7D,NAFRev1,N,1.172025,43.504891,0.47,street,Bordeneuve 31470 Saint-Lys,31499_tj8ko5,G,BORDENEUVE,
303774343,00022,30377434300022,O,1981-07-01,NN,,,2019-11-14T14:00:31,true,4,,33,,CHE,DE BARCELONE,31470,SAINT-LYS,,,31499,,,,,,,,,,,,,,,,,,,2003-02-28,F,,,,,74.8G,NAFRev1,O,1.172627,43.502007,0.86,housenumber,33 Chemin de Barcelone 31470 Saint-Lys,31499_0026_00033,G,33 CHEMIN DE BARCELONE,
303784912,00014,30378491200014,O,,NN,,,2019-11-14T14:00:31,true,1,,,,,,31470,SAINT-LYS,,,31499,,,,,,,,,,,,,,,,,,,1986-12-25,F,,,,,01.50,NAP,N,,,0,,,,,,
304166366,00027,30416636600027,O,1900-01-01,21,2017,,2019-11-14T14:00:31,false,7,,,,RTE,DE SAINT THOMAS,31470,SAINT-LYS,,,31499,,,,,,,,,,,,,,,,,,,2013-02-24,A,MAISON D'ACCUEIL SPECIALISE CONCORDE,,,,87.10C,NAFRev2,O,1.166667,43.515551,0.86,street,Route de Saint-thomas 31470 Saint-Lys,31499_0295,G,ROUTE DE SAINT THOMAS,
304166366,00035,30416636600035,O,1987-04-01,00,2016,,2019-11-14T14:00:31,false,5,,,,RTE,DE SAINT THOMAS,31470,SAINT-LYS,,,31499,,,,,,,,,,,,,,,,,,,2016-06-14,F,FOYER DE VIE ESPOIR,,,,87.20A,NAFRev2,O,1.166667,43.515551,0.86,street,Route de Saint-thomas 31470 Saint-Lys,31499_0295,G,ROUTE DE SAINT THOMAS,
304166366,00084,30416636600084,O,2008-01-01,12,2017,,2019-11-14T14:00:31,false,3,,1057,,RTE,DE SAINT THOMAS,31470,SAINT-LYS,,,31499,,,,,,,,,,,,,,,,,,,2013-02-19,A,,,,,87.30B,NAFRev2,O,1.162428,43.515975,0.88,housenumber,1057 Route de Saint-thomas 31470 Saint-Lys,31499_0295_01057,G,1057 ROUTE DE SAINT THOMAS,
304590904,00013,30459090400013,O,,,,,2019-11-14T14:00:31,true,1,,28,,RUE,DE LA REPUBLIQUE,31470,SAINT-LYS,,,31499,,,,,,,,,,,,,,,,,,,1985-12-25,F,,,,,81.21,NAP,N,1.174821,43.51227,0.83,housenumber,28 Avenue de la République 31470 Saint-Lys,31499_0264_00028,G,28 AVENUE DE LA REPUBLIQUE,
304713928,00014,30471392800014,O,1975-01-01,NN,,,2019-11-14T14:00:31,true,3,,,,PL,DE LA LIBERTE,31470,SAINT-LYS,,,31499,,,,,,,,,,,,,,,,,,,2008-01-01,A,,,,,56.30Z,NAFRev2,O,1.177133,43.513882,0.84,street,Place de la Liberté 31470 Saint-Lys,31499_0181,G,PLACE DE LA LIBERTE,
304841521,00038,30484152100038,O,,,,,2019-11-14T14:00:31,true,1,,12,,PL,DE LA LIBERTE,31470,SAINT-LYS,,,31499,,,,,,,,,,,,,,,,,,,1990-09-10,F,,,,,49.03,NAP,N,1.177133,43.513882,0.71,street,Place de la Liberté 31470 Saint-Lys,31499_0181,G,PLACE DE LA LIBERTE,
304930563,00016,30493056300016,O,,,,,2019-11-14T14:00:31,true,1,,26,,RUE,REPUBLIQUE,31470,SAINT-LYS,,,31499,,,,,,,,,,,,,,,,,,,1985-12-25,F,,,,,65.06,NAP,N,1.174961,43.51239,0.73,housenumber,26 Avenue de la République 31470 Saint-Lys,31499_0264_00026,G,26 AVENUE DE LA REPUBLIQUE,
304930944,00018,30493094400018,O,,NN,,,2019-11-14T14:00:31,true,1,,,,,,31470,SAINT-LYS,,,31499,,,,,,,,,,,,,,,,,,,1988-10-31,F,,,,,62.43,NAP,N,,,0,,,,,,
304930951,00013,30493095100013,O,,NN,,,2019-11-14T14:00:31,true,1,,,,,,31470,SAINT-LYS,,,31499,,,,,,,,,,,,,,,,,,,1988-10-31,F,,,,,62.43,NAP,N,,,0,,,,,,
305420291,00018,30542029100018,O,,NN,,,2019-11-14T14:00:31,true,1,,6,,PL,JEAN MOULIN,31470,SAINT-LYS,,,31499,,,,,,,,,,,,,,,,,,,1994-11-01,F,,,,,74.1J,NAF1993,N,1.175006,43.513088,0.84,housenumber,6 Place Jean Moulin 31470 Saint-Lys,31499_0159_00006,G,6 PLACE JEAN MOULIN,
305455867,00013,30545586700013,O,1976-01-01,NN,,,2019-11-14T14:00:31,true,1,,45,,RUE,DE LA REPUBLIQUE,31470,SAINT-LYS,,,31499,,,,,,,,,,,,,,,,,,,1998-12-31,F,,,,,50.2Z,NAF1993,N,1.174465,43.51188,0.83,housenumber,45 Avenue de la République 31470 Saint-Lys,31499_0264_00045,G,45 AVENUE DE LA REPUBLIQUE,
305849473,00031,30584947300031,O,1986-09-01,01,2017,,2019-11-14T14:00:31,true,5,,13,,AV,REPUBLIQUE,31470,SAINT-LYS,,,31499,,,,,,,,,,,,,,,,,,,2018-12-31,A,,,,,86.21Z,NAFRev2,N,1.175816,43.513067,0.83,housenumber,13 Avenue de la République 31470 Saint-Lys,31499_0264_00013,G,13 AVENUE DE LA REPUBLIQUE,
305849614,00022,30584961400022,O,,NN,,,2019-11-14T14:00:31,true,1,,2688,,RTE,DE LAMASQUERE,31470,SAINT-LYS,,,31499,,,,,,,,,,,,,,,,,,,1996-12-25,F,,,,,85.1G,NAF1993,N,1.204463,43.503025,0.87,housenumber,2688 Route de Lamasquère 31470 Saint-Lys,31499_0169_02688,G,2688 ROUTE DE LAMASQUERE,
306093881,00010,30609388100010,O,1900-01-01,NN,,,2019-11-14T14:00:31,true,3,MAIRIE,1,,RUE,DU FORT,31470,SAINT-LYS,,,31499,,,,,,,,,,,,,,,,,,,2008-01-01,A,,,,,93.12Z,NAFRev2,N,1.176638,43.513976,0.95,housenumber,1 Rue du Fort 31470 Saint-Lys,31499_0121_00001,G,1 RUE DU FORT,
306221318,00026,30622131800026,O,,NN,,,2019-11-14T14:00:31,true,1,,,,,LE GOUTIL,31470,SAINT-LYS,,,31499,,,,,,,,,,,,,,,,,,,1991-07-31,F,,,,,55.70,NAP,N,1.186212,43.504939,0.39,street,Le Gavachon 31470 Saint-Lys,31499_gq4t04,G,LE GAVACHON,
306548595,00041,30654859500041,O,2018-09-01,,,,2019-11-14T14:00:31,true,1,,42,,AV,DES PYRENEES,31470,SAINT-LYS,,,31499,,,,,,,,,,,,,,,,,,,2018-09-01,A,,,,,86.21Z,NAFRev2,N,1.170169,43.507115,0.84,housenumber,42 Avenue des Pyrénées 31470 Saint-Lys,31499_0249_00042,G,42 AVENUE DES PYRENEES,
306676339,00014,30667633900014,O,,NN,,,2019-11-14T14:00:31,true,1,,12,,,QUARTIER RIBOSY,31470,SAINT-LYS,,,31499,,,,,,,,,,,,,,,,,,,,F,,,,,87.03,NAP,N,1.192848,43.493314,0.55,street,Quartier Prim 31470 Saint-Lys,31499_ikfayp,G,QUARTIER PRIM,
306686742,00033,30668674200033,O,2007-12-12,,,4322BB,2019-11-14T14:00:31,false,3,,9,,ALL,DU VIGNEMALE,31470,SAINT-LYS,,,31499,,,,,,,,,,,,,,,,,,,2014-06-10,F,,,,,43.22B,NAFRev2,N,1.185271,43.514708,0.85,housenumber,9 Allee du Vignemale 31470 Saint-Lys,31499_0358_00009,G,9 ALLEE DU VIGNEMALE,
307036046,00018,30703604600018,O,,NN,,,2019-11-14T14:00:31,true,1,,,,,,31470,SAINT-LYS,,,31499,,,,,,,,,,,,,,,,,,,1988-10-31,F,,,,,62.43,NAP,N,,,0,,,,,,
307219360,00012,30721936000012,O,,NN,,,2019-11-14T14:00:31,true,1,,3,,RUE,DE L EGLISE,31470,SAINT-LYS,,,31499,,,,,,,,,,,,,,,,,,,1986-07-01,F,,,,,64.11,NAP,N,1.177788,43.514636,0.95,housenumber,3 Rue de l'Eglise 31470 Saint-Lys,31499_0097_00003,G,3 RUE DE L EGLISE,
307391854,00014,30739185400014,O,,NN,,,2019-11-14T14:00:31,true,1,,,,RUE,DE LA REPUBLIQUE,31470,SAINT-LYS,,,31499,,,,,,,,,,,,,,,,,,,1986-09-01,F,,,,,84.10,NAP,N,1.173898,43.511769,0.85,street,Avenue de la République 31470 Saint-Lys,31499_0264,G,AVENUE DE LA REPUBLIQUE,
308055284,00019,30805528400019,O,,NN,,,2019-11-14T14:00:31,true,1,,,,RTE,DE SAINT THOMAS,31470,SAINT-LYS,,,31499,,,,,,,,,,,,,,,,,,,1985-03-01,F,,,,,70.2C,NAF1993,N,1.166667,43.515551,0.86,street,Route de Saint-thomas 31470 Saint-Lys,31499_0295,G,ROUTE DE SAINT THOMAS,
308475508,00013,30847550800013,O,1900-01-01,,,,2019-11-14T14:00:31,true,4,,,,PL,DE LA HALLE,31470,SAINT-LYS,,,31499,,,,,,,,,,,,,,,,,,,1991-12-25,F,,,,,62.11,NAP,N,1.171056,43.505133,0.52,street,Impasse de la Rolle 31470 Saint-Lys,31499_0267,G,IMPASSE DE LA ROLLE,
308475524,00028,30847552400028,O,,NN,,,2019-11-14T14:00:31,true,1,,12,,AV,DE LA REPUBLIQUE,31470,SAINT-LYS,,,31499,,,,,,,,,,,,,,,,,,,1988-06-30,F,,,,,64.47,NAP,N,1.175246,43.512702,0.87,housenumber,12 Avenue de la République 31470 Saint-Lys,31499_0264_00012,G,12 AVENUE DE LA REPUBLIQUE,
308475532,00013,30847553200013,O,,,,,2019-11-14T14:00:31,true,1,,2051,,RTE,DE FONTENILLES,31470,SAINT-LYS,,,31499,,,,,,,,,,,,,,,,,,,1997-10-31,F,,,,,51.5F,NAF1993,N,1.183548,43.530096,0.87,housenumber,2051 Route de Fontenilles 31470 Saint-Lys,31499_0118_02051,G,2051 ROUTE DE FONTENILLES,
308490978,00019,30849097800019,O,1900-01-01,NN,,,2019-11-14T14:00:31,true,3,,,,RTE,DE TOULOUSE,31470,SAINT-LYS,,,31499,,,,,,,,,,,,,,,,,,,2008-01-01,A,,,,,68.20B,NAFRev2,N,1.176502,43.514178,0.84,street,Route de Toulouse 31470 Saint-Lys,31499_0328,G,ROUTE DE TOULOUSE,
308499037,00031,30849903700031,O,,NN,,,2019-11-14T14:00:31,true,1,,,,RTE,DE ST CLAR,31470,SAINT-LYS,,,31499,,,,,,,,,,,,,,,,,,,1995-12-31,F,,,,,45.3F,NAF1993,N,1.181122,43.508963,0.71,street,Route de Saint-clar 31470 Saint-Lys,31499_0288,G,ROUTE DE SAINT CLAR,
309018380,00019,30901838000019,O,1977-01-01,NN,,,2019-11-14T14:00:31,true,3,,7,,PL,NATIONALE,31470,SAINT-LYS,,,31499,,,,,,,,,,,,,,,,,,,2008-01-01,A,,,,,68.20B,NAFRev2,N,1.176418,43.513525,0.83,housenumber,7 Place Nationale 31470 Saint-Lys,31499_0221_00007,G,7 PLACE NATIONALE,
309096717,00017,30909671700017,O,,NN,,,2019-11-14T14:00:31,true,1,,7,,PL,NATIONALE,31470,SAINT-LYS,,,31499,,,,,,,,,,,,,,,,,,,1994-12-16,F,,,,,70.2C,NAF1993,N,1.176418,43.513525,0.83,housenumber,7 Place Nationale 31470 Saint-Lys,31499_0221_00007,G,7 PLACE NATIONALE,
309217164,00016,30921716400016,O,,NN,,,2019-11-14T14:00:31,true,1,,,,RTE,DE SAIGUEDE,31470,SAINT-LYS,,,31499,,,,,,,,,,,,,,,,,,,1987-12-31,F,,,,,87.06,NAP,N,1.169461,43.516192,0.83,street,Route de Saiguède 31470 Saint-Lys,31499_0284,G,ROUTE DE SAIGUEDE,
309590339,00029,30959033900029,O,1995-07-01,NN,,,2019-11-14T14:00:31,true,4,,,,PL,NATIONALE,31470,SAINT-LYS,,,31499,,,,,,,,,,,,,,,,,,,2015-02-27,F,,,,,68.20B,NAFRev2,N,1.176766,43.513857,0.8,street,Place Nationale 31470 Saint-Lys,31499_0221,G,PLACE NATIONALE,
309848380,00023,30984838000023,O,,NN,,,2019-11-14T14:00:31,true,1,,3,,PL,DE LA LIBERTE,31470,SAINT-LYS,,,31499,,,,,,,,,,,,,,,,,,,1995-12-31,F,,,,,93.0D,NAF1993,O,1.177299,43.514008,0.85,housenumber,3 Place de la Liberté 31470 Saint-Lys,31499_0181_00003,G,3 PLACE DE LA LIBERTE,
309940096,00022,30994009600022,O,1900-01-01,NN,,,2019-11-14T14:00:31,true,3,,6,,LOT,RIBOSI,31470,SAINT-LYS,,,31499,,,,,,,,,,,,,,,,,,,2005-05-22,F,,,,,45.4A,NAFRev1,N,1.171835,43.507199,0.58,housenumber,6 Rue de Ribosi 31470 Saint-Lys,31499_0277_00006,G,6 RUE DE RIBOSI,
310346820,00015,31034682000015,O,1900-01-01,,,,2019-11-14T14:00:31,true,4,,7,,PL,NATIONALE,31470,SAINT-LYS,,,31499,,,,,,,,,,,,,,,,,,,1992-12-25,F,,,,,61.01,NAP,N,1.176418,43.513525,0.83,housenumber,7 Place Nationale 31470 Saint-Lys,31499_0221_00007,G,7 PLACE NATIONALE,
310595657,00027,31059565700027,O,,NN,,,2019-11-14T14:00:31,true,1,,,,LD,MALEBRANQUE CD 19,31470,SAINT-LYS,,,31499,,,,,,,,,,,,,,,,,,,,F,,,,,55.73,NAP,N,1.216766,43.501723,0.68,street,Malebranque 31470 Saint-Lys,31499_6puwkb,G,MALEBRANQUE,
310760624,00026,31076062400026,O,1990-04-06,NN,,,2019-11-14T14:00:31,true,3,,15,,PL,NATIONALE,31470,SAINT-LYS,,,31499,,,,,,,,,,,,,,,,,,,2004-06-30,F,,,,,74.1J,NAFRev1,N,1.176233,43.513889,0.83,housenumber,15 Place Nationale 31470 Saint-Lys,31499_0221_00015,G,15 PLACE NATIONALE,
310780440,00049,31078044000049,O,1999-01-11,NN,,,2019-11-14T14:00:31,false,4,,1,,CHE,DU CHENE CRABILLE,31470,SAINT-LYS,,,31499,,,,,,,,,,,,,,,,,,,2004-11-30,F,,,,,45.4C,NAFRev1,N,1.219007,43.509209,0.55,street,Chemin de Crabille 31470 Saint-Lys,31499_0057,G,CHEMIN DE CRABILLE,
310780440,00056,31078044000056,O,2007-05-14,,,,2019-11-14T14:00:31,true,3,CRABILLE,1,,CHE,DU CHENE,31470,SAINT-LYS,,,31499,,,,,,,,,,,,,,,,,,,2009-10-28,F,,,,,43.31Z,NAFRev2,N,1.219997,43.50535,0.8,housenumber,1 Chemin du Chene 31470 Saint-Lys,31499_0063_00001,G,1 CHEMIN DU CHENE,
311101323,00021,31110132300021,O,1991-01-03,NN,,,2019-11-14T14:00:31,true,1,,7,,AV,DU LANGUEDOC,31470,SAINT-LYS,,,31499,,,,,,,,,,,,,,,,,,,1999-09-01,F,,,,,93.0E,NAF1993,O,1.17767,43.513487,0.84,housenumber,7 Avenue du Languedoc 31470 Saint-Lys,31499_0174_00007,G,7 AVENUE DU LANGUEDOC,
311179964,00011,31117996400011,O,,,,,2019-11-14T14:00:31,true,1,,31,,CITE,RODRIGUEZ,31470,SAINT-LYS,,,31499,,,,,,,,,,,,,,,,,,,1984-12-25,F,,,,,55.60,NAP,N,,,0,,,,,,