siren,nic,siret,statutDiffusionEtablissement,dateCreationEtablissement,trancheEffectifsEtablissement,anneeEffectifsEtablissement,activitePrincipaleRegistreMetiersEtablissement,dateDernierTraitementEtablissement,etablissementSiege,nombrePeriodesEtablissement,complementAdresseEtablissement,numeroVoieEtablissement,indiceRepetitionEtablissement,typeVoieEtablissement,libelleVoieEtablissement,codePostalEtablissement,libelleCommuneEtablissement,libelleCommuneEtrangerEtablissement,distributionSpecialeEtablissement,codeCommuneEtablissement,codeCedexEtablissement,libelleCedexEtablissement,codePaysEtrangerEtablissement,libellePaysEtrangerEtablissement,complementAdresse2Etablissement,numeroVoie2Etablissement,indiceRepetition2Etablissement,typeVoie2Etablissement,libelleVoie2Etablissement,codePostal2Etablissement,libelleCommune2Etablissement,libelleCommuneEtranger2Etablissement,distributionSpeciale2Etablissement,codeCommune2Etablissement,codeCedex2Etablissement,libelleCedex2Etablissement,codePaysEtranger2Etablissement,libellePaysEtranger2Etablissement,dateDebut,etatAdministratifEtablissement,enseigne1Etablissement,enseigne2Etablissement,enseigne3Etablissement,denominationUsuelleEtablissement,activitePrincipaleEtablissement,nomenclatureActivitePrincipaleEtablissement,caractereEmployeurEtablissement,longitude,latitude,geo_score,geo_type,geo_adresse,geo_id,geo_ligne,geo_l4,geo_l5
213300494,00019,21330049400019,O,1983-03-01,12,2017,,2019-11-14T14:00:32,true,4,,,,,,33750,BEYCHAC-ET-CAILLAU,,,33049,,,,,,,,,,,,,,,,,,,2008-01-01,A,MAIRIE,,,,84.11Z,NAFRev2,O,,,0,,,,,,
213300494,00027,21330049400027,O,1983-12-21,12,2017,,2019-11-14T14:00:32,false,3,,,,,CAILLAU,33750,BEYCHAC-ET-CAILLAU,,,33049,,,,,,,,,,,,,,,,,,,2008-01-01,A,ECOLE PRIMAIRE PUBLIQUE,,,,85.20Z,NAFRev2,N,-0.372619,44.869195,0.92,street,Bourg de Caillau 33750 Beychac-et-Caillau,33049_b011,G,BOURG DE CAILLAU,
213300494,00035,21330049400035,O,1997-12-01,NN,,,2019-11-14T14:00:32,false,3,MAIRIE,,,,,33750,BEYCHAC-ET-CAILLAU,,,33049,,,,,,,,,,,,,,,,,,,2008-01-01,A,LOTISSEMENT DU HAMEAU,,,,42.99Z,NAFRev2,N,-0.374273,44.875627,0.91,street,Route de la Mairie 33750 Beychac-et-Caillau,33049_0050,D,ROUTE DE LA MAIRIE,
213300494,00043,21330049400043,O,2002-06-07,01,2017,,2019-11-14T14:00:32,false,3,MAIRIE,,,,,33750,BEYCHAC-ET-CAILLAU,,,33049,,,,,,,,,,,,,,,,,,,2008-01-01,A,BA TRANSPORTS SCOLAIRES,,,,49.39A,NAFRev2,N,-0.374273,44.875627,0.91,street,Route de la Mairie 33750 Beychac-et-Caillau,33049_0050,D,ROUTE DE LA MAIRIE,
263300485,00012,26330048500012,O,1983-03-01,NN,,,2019-11-14T14:00:32,true,3,MAIRIE,,,,,33750,BEYCHAC-ET-CAILLAU,,,33049,,,,,,,,,,,,,,,,,,,2008-01-01,A,CCAS,,,,88.99B,NAFRev2,N,-0.374273,44.875627,0.91,street,Route de la Mairie 33750 Beychac-et-Caillau,33049_0050,D,ROUTE DE LA MAIRIE,
263306961,00016,26330696100016,O,2000-05-19,,,,2019-11-14T14:00:32,true,4,,,,,MAIRIE,33750,BEYCHAC-ET-CAILLAU,,,33049,,,,,,,,,,,,,,,,,,,2008-01-01,F,CDE DE BEYCHAC ET CAILLAU,,,,88.99B,NAFRev2,N,-0.374273,44.875627,0.91,street,Route de la Mairie 33750 Beychac-et-Caillau,33049_0050,G,ROUTE DE LA MAIRIE,
273300079,00012,27330007900012,O,1986-01-01,NN,,,2019-11-14T14:00:32,true,4,,,,,MAIRIE DE BEYCHAC ET CAILL,33750,BEYCHAC-ET-CAILLAU,,,33049,,,,,,,,,,,,,,,,,,,1994-01-01,F,,,,,60.2B,NAF1993,O,-0.374273,44.875627,0.88,street,Route de la Mairie 33750 Beychac-et-Caillau,33049_0050,G,ROUTE DE LA MAIRIE,
300824208,00072,30082420800072,O,2011-05-27,,,,2019-11-14T14:00:32,true,2,,3,,CHE,JEAN MASSOT,33750,BEYCHAC-ET-CAILLAU,,,33049,,,,,,,,,,,,,,,,,,,2012-06-03,A,,,,,70.10Z,NAFRev2,O,-0.372977,44.874048,0.84,housenumber,3 Chemin Jean Massot 33750 Beychac-et-Caillau,33049_0052_00003,G,3 CHEMIN JEAN MASSOT,
300883378,00063,30088337800063,O,2009-05-28,12,2017,1721AZ,2019-11-14T14:00:32,true,1,ZONE DE BERTIN,5,,RTE,DU PETIT CONSEILLER,33750,BEYCHAC-ET-CAILLAU,,,33049,,,,,,,,,,,,,,,,,,,2009-05-28,A,CARTONNAGE DE BEYCHAC ET CAILLAU,,,,17.21A,NAFRev2,O,-0.374445,44.878724,0.87,housenumber,5 Route du Petit Conseiller 33750 Beychac-et-Caillau,33049_0037_00005,G,5 ROUTE DU PETIT CONSEILLER,
301101218,00016,30110121800016,O,,,,,2019-11-14T14:00:32,true,1,,,,,RN 29,33750,BEYCHAC-ET-CAILLAU,,,33049,,,,,,,,,,,,,,,,,,,1986-01-28,F,,,,,77.10,NAP,N,,,0,,,,,,
303550362,00014,30355036200014,O,,,,,2019-11-14T14:00:32,true,1,,23,,,LOTISS BOIS ROUDET,33750,BEYCHAC-ET-CAILLAU,,,33049,,,,,,,,,,,,,,,,,,,1984-12-25,F,,,,,,,N,-0.379617,44.870238,0.85,housenumber,23 Lotissement Bois Roudet 1 33750 Beychac-et-Caillau,33049_3113hc_00023,G,23 LOTISSEMENT BOIS ROUDET 1,
303834188,00011,30383418800011,O,,,,,2019-11-14T14:00:32,true,1,,,,,,33750,BEYCHAC-ET-CAILLAU,,,33049,,,,,,,,,,,,,,,,,,,1984-12-25,F,,,,,,,N,,,0,,,,,,
306039470,00035,30603947000035,O,1998-08-27,22,2017,,2019-11-14T14:00:32,true,6,LD LANDRIEU,,,,,33750,BEYCHAC-ET-CAILLAU,,,33049,,,,,,,,,,,,,,,,,,,2015-06-25,A,,,,IGC,41.10A,NAFRev2,O,-0.393739,44.874795,0.73,street,Landrieu 33750 Beychac-et-Caillau,33049_5srg86,D,LANDRIEU,
306039470,00779,30603947000779,O,2017-04-01,,,,2019-11-14T14:00:32,false,1,ALLEE DE LA FORESTIERE,5,,,,33750,BEYCHAC-ET-CAILLAU,,,33049,,,,,,,,,,,,,,,,,,,2017-04-01,A,VILLA CONCEPT,,,VILLA CONCEPT,41.10A,NAFRev2,O,-0.390563,44.869231,0.49,housenumber,5 Route Forestière 33750 Beychac-et-Caillau,33049_0044_00005,D,5 ROUTE FORESTIERE,
306500232,00021,30650023200021,O,,,,,2019-11-14T14:00:32,true,1,,,,,L'INTENDANT,33750,BEYCHAC-ET-CAILLAU,,,33049,,,,,,,,,,,,,,,,,,,1984-12-25,F,,,,,55.40,NAP,N,-0.378774,44.879192,0.94,street,L'Intendant 33750 Beychac-et-Caillau,33049_1ymw39,G,L INTENDANT,
306896374,00254,30689637400254,O,2012-06-15,12,2017,,2019-11-14T14:00:32,false,1,ZONE ARTISANALE DE PASQUINA,2,,,,33750,BEYCHAC-ET-CAILLAU,,,33049,,,,,,,,,,,,,,,,,,,2012-06-15,A,,,,,43.99C,NAFRev2,O,-0.350933,44.881042,0.55,street,Zone Artisanale du Grd Cazeaux 33750 Beychac-et-Caillau,33049_a035,D,ZONE ARTISANALE DU GRD CAZEAUX,
307358341,00013,30735834100013,O,,NN,,,2019-11-14T14:00:32,true,1,,,,,LE FRILEUR,33750,BEYCHAC-ET-CAILLAU,,,33049,,,,,,,,,,,,,,,,,,,1983-03-31,F,,,,,55.73,NAP,N,-0.373261,44.869752,0.43,locality,Résidence le Clos du Moissonneur 33750 Beychac-et-Caillau,33049_a019,G,RESIDENCE LE CLOS DU MOISSONNEUR,
307563494,00029,30756349400029,O,,,,,2019-11-14T14:00:32,true,1,,,,LD,LARTIGUE,33750,BEYCHAC-ET-CAILLAU,,,33049,,,,,,,,,,,,,,,,,,,1992-03-31,F,,,,,26.7Z,NAF1993,N,-0.398757,44.876251,0.94,street,Lartigue 33750 Beychac-et-Caillau,33049_1otnpy,G,LARTIGUE,
308630557,00038,30863055700038,O,1998-07-01,NN,,,2019-11-14T14:00:32,true,4,L'INTENDANT SUD,,,RTE,DE LA JONCASSE,33750,BEYCHAC-ET-CAILLAU,,,33049,,,,,,,,,,,,,,,,,,,2008-06-30,F,,,,,95.22Z,NAFRev2,N,-0.387311,44.877825,0.65,street,Route de Joncasse 33750 Beychac-et-Caillau,33049_0092,G,ROUTE DE JONCASSE,
309232809,00025,30923280900025,O,1994-01-01,01,2017,,2019-11-14T14:00:32,true,5,,5,,,ZA GRAND CAZAU,33750,BEYCHAC-ET-CAILLAU,,,33049,,,,,,,,,,,,,,,,,,,2008-01-01,A,,,,,46.61Z,NAFRev2,O,,,0,,,,,,
309715506,00064,30971550600064,O,1996-11-01,NN,,,2019-11-14T14:00:32,true,1,,,,,AU BOURG,33750,BEYCHAC-ET-CAILLAU,,,33049,,,,,,,,,,,,,,,,,,,2001-12-24,F,,,,,52.1B,NAF1993,N,-0.37249,44.870551,0.81,street,Lotissement du Bourg 33750 Beychac-et-Caillau,33049_a011,G,LOTISSEMENT DU BOURG,
309792141,00058,30979214100058,O,1999-08-01,,,,2019-11-14T14:00:32,true,1,,71,,,BOIS DE ROUDET,33750,BEYCHAC-ET-CAILLAU,,,33049,,,,,,,,,,,,,,,,,,,2000-10-28,F,,,,,45.3E,NAF1993,N,-0.377585,44.86749,0.72,housenumber,71 Lotissement Bois Roudet 1 33750 Beychac-et-Caillau,33049_3113hc_00071,G,71 LOTISSEMENT BOIS ROUDET 1,
310866090,00015,31086609000015,O,,,,,2019-11-14T14:00:32,true,1,,,,,AU BOURG,33750,BEYCHAC-ET-CAILLAU,,,33049,,,,,,,,,,,,,,,,,,,1984-12-25,F,,,,,01.17,NAP,N,-0.37249,44.870551,0.81,street,Lotissement du Bourg 33750 Beychac-et-Caillau,33049_a011,G,LOTISSEMENT DU BOURG,
311233514,00067,31123351400067,O,2001-10-01,,,,2019-11-14T14:00:32,true,1,,,,,BERTIN,33750,BEYCHAC-ET-CAILLAU,,,33049,,,,,,,,,,,,,,,,,,,2001-12-31,F,,,,,51.3J,NAF1993,N,-0.372998,44.872703,0.94,street,Bertin 33750 Beychac-et-Caillau,33049_u81kmu,G,BERTIN,
311623300,00010,31162330000010,O,,,,,2019-11-14T14:00:32,true,1,,,,DOM,DE LA GRAVE,33750,BEYCHAC-ET-CAILLAU,,,33049,,,,,,,,,,,,,,,,,,,1989-12-01,F,,,,,01.1G,NAF1993,N,-0.402844,44.88082,0.33,street,Lotissement le Domaine de Bayssac II 33750 Beychac-et-Caillau,33049_a008,G,LOT LE DOMAINE DE BAYSSAC II,
311713986,00025,31171398600025,O,1900-01-01,NN,,,2019-11-14T14:00:32,false,4,,,,,CAMPENNA,33750,BEYCHAC-ET-CAILLAU,,,33049,,,,,,,,,,,,,,,,,,,2001-02-23,F,,,,,74.2A,NAF1993,N,-0.393196,44.879508,0.94,street,Campenna 33750 Beychac-et-Caillau,33049_80p83t,G,CAMPENNA,
312166515,00014,31216651500014,O,,,,,2019-11-14T14:00:32,true,1,,,,,CHATEAU LESPAPRE,33750,BEYCHAC-ET-CAILLAU,,,33049,,,,,,,,,,,,,,,,,,,1985-12-25,F,,,,,01.17,NAP,N,-0.356338,44.872492,0.44,street,Lesparre 33750 Beychac-et-Caillau,33049_w1wynw,G,LESPARRE,
312438054,00016,31243805400016,O,,NN,,,2019-11-14T14:00:32,true,1,,,,,,33750,BEYCHAC-ET-CAILLAU,,,33049,,,,,,,,,,,,,,,,,,,1989-06-30,F,,,,,55.70,NAP,N,,,0,,,,,,
312707706,00031,31270770600031,O,2013-07-11,,,,2019-11-14T14:00:32,false,2,LOTISSEMENT LE FILEUR,,,,PEP DU BOS PLAN,33750,BEYCHAC-ET-CAILLAU,,,33049,,,,,,,,,,,,,,,,,,,2017-02-06,F,,,,,68.20B,NAFRev2,N,-0.364111,44.88253,0.71,street,Chemin du Bos Plan 33750 Beychac-et-Caillau,33049_smbsvk,G,CHEMIN DU BOS PLAN,
312715774,00013,31271577400013,O,,,,,2019-11-14T14:00:32,true,1,,25,,,LOT BOIS ROUDET,33750,BEYCHAC-ET-CAILLAU,,,33049,,,,,,,,,,,,,,,,,,,,F,,,,,55.70,NAP,N,-0.379292,44.869788,0.88,housenumber,25 Lotissement Bois Roudet 1 33750 Beychac-et-Caillau,33049_3113hc_00025,G,25 LOTISSEMENT BOIS ROUDET 1,
312802606,00011,31280260600011,O,,,,,2019-11-14T14:00:32,true,1,,,,,CHA LA FRANCE QUINSAC,33750,BEYCHAC-ET-CAILLAU,,,33049,,,,,,,,,,,,,,,,,,,1988-06-30,F,,,,,01.1G,NAF1993,N,,,0,,,,,,
313109134,00020,31310913400020,O,1980-11-04,NN,,,2019-11-14T14:00:32,true,3,,73,,,LE BOIS ROUDET,33750,BEYCHAC-ET-CAILLAU,,,33049,,,,,,,,,,,,,,,,,,,2004-12-31,F,,,,,70.2C,NAFRev1,N,-0.37862,44.870228,0.94,street,Le Bois Roudet 33750 Beychac-et-Caillau,33049_b044,G,LE BOIS ROUDET,
313455404,00019,31345540400019,O,1978-01-01,02,2017,2593ZB,2019-11-14T14:00:32,true,4,,,,,LE BARBUT,33750,BEYCHAC-ET-CAILLAU,,,33049,,,,,,,,,,,,,,,,,,,2008-01-01,A,,,,,25.93Z,NAFRev2,O,-0.39527,44.876407,0.94,street,Le Barbut 33750 Beychac-et-Caillau,33049_9nfzts,G,LE BARBUT,
314377110,00023,31437711000023,O,,NN,,,2019-11-14T14:00:32,true,1,,80,,LD,BOIS ROUDET,33750,BEYCHAC-ET-CAILLAU,,,33049,,,,,,,,,,,,,,,,,,,1995-03-31,F,,,,,45.4D,NAF1993,O,-0.375358,44.868534,0.91,housenumber,80 Lotissement Bois Roudet 1 33750 Beychac-et-Caillau,33049_3113hc_00080,G,80 LOTISSEMENT BOIS ROUDET 1,
314503319,01165,31450331901165,O,1997-10-01,,,,2019-11-14T14:00:32,false,5,,,,,ZA DU LAPIN,33750,BEYCHAC-ET-CAILLAU,,BP 17,33049,,,,,,,,,,,,,,,,,,,2008-01-01,F,,,,,46.69B,NAFRev2,N,-0.34793,44.880295,0.71,street,Zone du Lapin 33750 Beychac-et-Caillau,33049_m4yafy,G,ZONE DU LAPIN,
314601873,00016,31460187300016,O,,,,,2019-11-14T14:00:32,true,1,,41,,,LOT DU BOIS RONDET,33750,BEYCHAC-ET-CAILLAU,,,33049,,,,,,,,,,,,,,,,,,,1985-12-25,F,,,,,00.10,NAP,N,-0.376631,44.869522,0.77,housenumber,41 Lotissement du Bois Roudet 33750 Beychac-et-Caillau,33049_a009_00041,G,41 LOTISSEMENT DU BOIS ROUDET,
315066811,00037,31506681100037,O,2003-03-01,12,2017,,2019-11-14T14:00:32,true,5,126  A,126,A,RTE,CANTELOUP,33750,BEYCHAC-ET-CAILLAU,,,33049,,,,,,,,,,,,,,,,,,,2013-12-31,A,,,,,46.75Z,NAFRev2,O,-0.350425,44.882258,0.59,street,Route de Canteloup 33750 Beychac-et-Caillau,33049_yg7qrc,G,ROUTE DE CANTELOUP,
315920892,00074,31592089200074,O,2019-06-15,,,,2019-11-14T14:00:32,false,2,BOS PLAN,14,,,PARC ECONOMIQUE PAYSAGER DU,33750,BEYCHAC-ET-CAILLAU,,,33049,,,,,,,,,,,,,,,,,,,2019-08-12,A,,,,,46.36Z,NAFRev2,O,-0.362231,44.881814,0.56,housenumber,14 Lotissement Parc Eco Paysage Bos Plan 33750 Beychac-et-Caillau,33049_a103_00014,D,14 LOT PARC ECO PAYSAGE BOS PLAN,
316139930,00119,31613993000119,O,2015-01-02,11,2017,,2019-11-14T14:00:32,true,1,,2,,RTE,DE LA FORESTIERE,33750,BEYCHAC-ET-CAILLAU,,,33049,,,,,,,,,,,,,,,,,,,2015-01-02,A,,,,,68.10Z,NAFRev2,O,-0.394712,44.87347,0.6,housenumber,2 Route Forestière 33750 Beychac-et-Caillau,33049_0044_00002,G,2 ROUTE FORESTIERE,
316509009,00031,31650900900031,O,2006-08-01,,,,2019-11-14T14:00:32,true,3,,15,,,LARTIGUE,33750,BEYCHAC-ET-CAILLAU,,,33049,,,,,,,,,,,,,,,,,,,2008-02-04,A,CROC-LOTS,,,,47.78C,NAFRev2,N,-0.395374,44.876901,0.85,housenumber,15 Route de Lartigue 33750 Beychac-et-Caillau,33049_kzdlnl_00015,G,15 ROUTE DE LARTIGUE,
317840676,00041,31784067600041,O,,NN,,,2019-11-14T14:00:32,true,1,,,,LD,JEAN DUGAY,33750,BEYCHAC-ET-CAILLAU,,,33049,,,,,,,,,,,,,,,,,,,1991-12-31,F,,,,,80.4A,NAF1993,O,-0.350352,44.889588,0.78,street,Jean du Gay 33750 Beychac-et-Caillau,33049_b025,G,JEAN DU GAY,
317897551,00113,31789755100113,O,1997-08-01,NN,,,2019-11-14T14:00:32,false,5,,,,RUE,DU PETIT CONSEILLER,33750,BEYCHAC-ET-CAILLAU,,,33049,,,,,,,,,,,,,,,,,,,2003-12-25,F,,,,,51.8M,NAFRev1,N,-0.375808,44.877591,0.83,street,Route du Petit Conseiller 33750 Beychac-et-Caillau,33049_0037,G,ROUTE DU PETIT CONSEILLER,
318008851,00038,31800885100038,O,1999-12-01,NN,,4332CZ,2019-11-14T14:00:32,false,5,,9,,LOT,LE GRAND CAZEAUX,33750,BEYCHAC-ET-CAILLAU,,,33049,,,,,,,,,,,,,,,,,,,2009-11-30,F,,,,,46.65Z,NAFRev2,O,-0.349221,44.88169,0.55,housenumber,9 Zone du Grand Cazeau 33750 Beychac-et-Caillau,33049_k0zvoz_00009,G,9 ZONE DU GRAND CAZEAU,
318149721,00066,31814972100066,O,1998-05-25,NN,,,2019-11-14T14:00:32,false,3,,,,LD,BERTIN,33750,BEYCHAC-ET-CAILLAU,,,33049,,,,,,,,,,,,,,,,,,,2004-12-31,F,,,,,51.3J,NAFRev1,O,-0.372998,44.872703,0.94,street,Bertin 33750 Beychac-et-Caillau,33049_u81kmu,G,BERTIN,
318149721,00074,31814972100074,O,2003-03-21,NN,,,2019-11-14T14:00:32,true,5,LIEU DIT BERTIN,,,RTE,DU PETIT CONSEILLER,33750,BEYCHAC-ET-CAILLAU,,,33049,,,,,,,,,,,,,,,,,,,2005-01-01,F,,,,,70.2C,NAFRev1,N,-0.375808,44.877591,0.87,street,Route du Petit Conseiller 33750 Beychac-et-Caillau,33049_0037,G,ROUTE DU PETIT CONSEILLER,
318608320,00020,31860832000020,O,,NN,,,2019-11-14T14:00:32,true,1,,,,LD,BOUTIN,33750,BEYCHAC-ET-CAILLAU,,,33049,,,,,,,,,,,,,,,,,,,,F,,,,,53.05,NAP,N,-0.372432,44.863135,0.94,street,Boutin 33750 Beychac-et-Caillau,33049_jm8d2s,G,BOUTIN,
318800935,00013,31880093500013,O,1980-01-01,03,2017,,2019-11-14T14:00:32,true,5,,,,,CHATEAU LA FRANCE,33750,BEYCHAC-ET-CAILLAU,,,33049,,,,,,,,,,,,,,,,,,,2008-12-31,A,,,,,01.21Z,NAFRev2,O,-0.404351,44.866868,0.35,street,Cheminement de la Lande de Perriche 33750 Beychac-et-Caillau,33049_0047,G,CHEM DE LA LANDE DE PERRICHE,
319588273,00015,31958827300015,O,,NN,,,2019-11-14T14:00:32,true,1,,,,LD,LASSUS,33750,BEYCHAC-ET-CAILLAU,,,33049,,,,,,,,,,,,,,,,,,,,F,,,,,69.12,NAP,N,-0.395555,44.882987,0.94,street,Lassus 33750 Beychac-et-Caillau,33049_ixnwn2,G,LASSUS,
319807897,00016,31980789700016,O,1980-09-15,NN,,,2019-11-14T14:00:32,true,3,,3,,,BOIS ROUDET,33750,BEYCHAC-ET-CAILLAU,,,33049,,,,,,,,,,,,,,,,,,,2004-12-31,F,,,,,45.3E,NAFRev1,N,-0.37862,44.870228,0.93,street,Le Bois Roudet 33750 Beychac-et-Caillau,33049_b044,G,LE BOIS ROUDET,
319986592,00016,31998659200016,O,1980-10-09,NN,,9602AA,2019-11-14T14:00:32,true,5,,22,,LOT,NO 22 MARTY,33750,BEYCHAC-ET-CAILLAU,,,33049,,,,,,,,,,,,,,,,,,,2015-01-01,A,,,,,96.02A,NAFRev2,N,-0.378066,44.871489,0.6,housenumber,22 Lotissement Marty 33750 Beychac-et-Caillau,33049_a095_00022,G,22 LOTISSEMENT MARTY,
320385354,00016,32038535400016,O,,NN,,,2019-11-14T14:00:32,true,1,,,,LD,LA PAILLOUSE,33750,BEYCHAC-ET-CAILLAU,,,33049,,,,,,,,,,,,,,,,,,,,F,,,,,55.73,NAP,N,-0.397328,44.874894,0.44,street,La Joncasse 33750 Beychac-et-Caillau,33049_8kmtlf,G,LA JONCASSE,
320717291,00043,32071729100043,O,2000-01-01,NN,,,2019-11-14T14:00:32,true,4,BOUTIN,,,,LE CLOS DES SENTEURS,33750,BEYCHAC-ET-CAILLAU,,,33049,,,,,,,,,,,,,,,,,,,2005-02-16,F,,,,,45.4M,NAFRev1,O,-0.37773,44.870965,0.51,street,Lotissement le Clos de la Lande 33750 Beychac-et-Caillau,33049_a020,G,LOTISSEMENT LE CLOS DE LA LANDE,
321144198,00017,32114419800017,O,1981-01-26,NN,,,2019-11-14T14:00:32,true,3,,,,LD,CANTELOUP,33750,BEYCHAC-ET-CAILLAU,,,33049,,,,,,,,,,,,,,,,,,,2008-01-01,A,,,,,68.20B,NAFRev2,N,-0.369433,44.880757,0.94,street,Canteloup 33750 Beychac-et-Caillau,33049_p59fsf,G,CANTELOUP,
321354516,00072,32135451600072,O,1995-01-01,01,2017,,2019-11-14T14:00:32,false,4,,,,LD,LESPARRE,33750,BEYCHAC-ET-CAILLAU,,,33049,,,,,,,,,,,,,,,,,,,2008-01-01,A,,,,,47.59B,NAFRev2,O,-0.356338,44.872492,0.94,street,Lesparre 33750 Beychac-et-Caillau,33049_w1wynw,G,LESPARRE,
321628190,00019,32162819000019,O,1981-01-01,01,2017,,2019-11-14T14:00:32,true,4,L'HERMETTE,,,,L'HERMETTE,33750,BEYCHAC-ET-CAILLAU,,,33049,,,,,,,,,,,,,,,,,,,2008-01-01,A,,,,,01.21Z,NAFRev2,O,-0.366447,44.874955,0.92,street,Route de l'Hermette 33750 Beychac-et-Caillau,33049_0097,G,ROUTE DE L HERMETTE,
321707150,00033,32170715000033,O,2013-02-03,,,,2019-11-14T14:00:32,true,1,,23,,RTE,DE SALLEBOEUF,33750,BEYCHAC-ET-CAILLAU,,,33049,,,,,,,,,,,,,,,,,,,2013-02-03,A,,,,,62.09Z,NAFRev2,N,-0.397002,44.863857,0.86,housenumber,23 Route de Salleboeuf 33750 Beychac-et-Caillau,33049_0084_00023,G,23 ROUTE DE SALLEBOEUF,
321796450,00021,32179645000021,O,1999-02-16,,,,2019-11-14T14:00:32,false,4,,,,LD,LANDRIEU,33750,BEYCHAC-ET-CAILLAU,,,33049,,,,,,,,,,,,,,,,,,,2000-12-25,F,,,,,74.8K,NAF1993,N,-0.393739,44.874795,0.94,street,Landrieu 33750 Beychac-et-Caillau,33049_5srg86,G,LANDRIEU,
321831224,00027,32183122400027,O,1987-07-27,NN,,,2019-11-14T14:00:32,true,3,,,,LD,JEAN DUGAY,33750,BEYCHAC-ET-CAILLAU,,,33049,,,,,,,,,,,,,,,,,,,2008-01-01,A,,,,,68.20B,NAFRev2,N,-0.350352,44.889588,0.78,street,Jean du Gay 33750 Beychac-et-Caillau,33049_b025,G,JEAN DU GAY,
321947269,00015,32194726900015,O,1981-06-09,NN,,,2019-11-14T14:00:32,true,3,,,,LD,LASSUS,33750,BEYCHAC-ET-CAILLAU,,,33049,,,,,,,,,,,,,,,,,,,2005-12-31,F,,,,,01.1G,NAFRev1,N,-0.395555,44.882987,0.94,street,Lassus 33750 Beychac-et-Caillau,33049_ixnwn2,G,LASSUS,
322118688,00017,32211868800017,O,,,,,2019-11-14T14:00:32,true,1,,,,,LE BARBUT,33750,BEYCHAC-ET-CAILLAU,,,33049,,,,,,,,,,,,,,,,,,,,F,,,,,60.2L,NAFRev1,N,-0.39527,44.876407,0.94,street,Le Barbut 33750 Beychac-et-Caillau,33049_9nfzts,G,LE BARBUT,
322328493,00026,32232849300026,O,,,,,2019-11-14T14:00:32,true,1,,,,LD,LASSUS,33750,BEYCHAC-ET-CAILLAU,,,33049,,,,,,,,,,,,,,,,,,,1985-12-25,F,,,,,77.03,NAP,N,-0.395555,44.882987,0.94,street,Lassus 33750 Beychac-et-Caillau,33049_ixnwn2,G,LASSUS,
322969247,00350,32296924700350,O,2012-09-01,22,2017,,2019-11-14T14:00:32,true,3,ZA DU BOS PLAN - 22 ROUTE DU FILEUR,22,,,BOS PLAN,33750,BEYCHAC-ET-CAILLAU,,,33049,,,,,,,,,,,,,,,,,,,2016-03-31,A,,,,,46.34Z,NAFRev2,N,-0.364111,44.88253,0.92,street,Chemin du Bos Plan 33750 Beychac-et-Caillau,33049_smbsvk,G,CHEMIN DU BOS PLAN,
323016766,00426,32301676600426,O,2008-01-20,,,,2019-11-14T14:00:32,false,1,,,,LOT,PARC ECO PAYSAGE BOS PLAN,33750,BEYCHAC-ET-CAILLAU,,,33049,,,,,,,,,,,,,,,,,,,2008-01-20,A,,,,,46.71Z,NAFRev2,N,-0.361952,44.881117,0.9,street,Lotissement Parc Eco Paysage Bos Plan 33750 Beychac-et-Caillau,33049_a103,G,LOT PARC ECO PAYSAGE BOS PLAN,
323901884,00011,32390188400011,O,1982-01-01,NN,,,2019-11-14T14:00:32,true,5,,4,,RTE,FORESTIERE,33750,BEYCHAC-ET-CAILLAU,,,33049,,,,,,,,,,,,,,,,,,,2013-03-04,F,,,,,38.32Z,NAFRev2,O,-0.393164,44.870233,0.84,housenumber,4 Route Forestière 33750 Beychac-et-Caillau,33049_0044_00004,G,4 ROUTE FORESTIERE,
324268309,00022,32426830900022,O,,NN,,,2019-11-14T14:00:32,true,1,,,,,,33750,BEYCHAC-ET-CAILLAU,,,33049,,,,,,,,,,,,,,,,,,,1987-01-03,F,,,,,64.14,NAP,N,,,0,,,,,,
324832963,00031,32483296300031,O,1994-12-01,02,2017,2910ZB,2019-11-14T14:00:32,true,4,RN 89,,,RTE,ZONE ARTISANALE,33750,BEYCHAC-ET-CAILLAU,,,33049,,,,,,,,,,,,,,,,,,,2008-01-01,A,,,,,45.32Z,NAFRev2,O,-0.350933,44.881042,0.73,street,Zone Artisanale du Grd Cazeaux 33750 Beychac-et-Caillau,33049_a035,G,ZONE ARTISANALE DU GRD CAZEAUX,
325000495,00045,32500049500045,O,2004-10-01,12,2017,,2019-11-14T14:00:32,true,3,PARC ECO PAYSAGER BOS NÂ°4,4,,RTE,CANTELOUP,33750,BEYCHAC-ET-CAILLAU,,,33049,,,,,,,,,,,,,,,,,,,2008-01-01,A,,,,,82.92Z,NAFRev2,O,-0.369632,44.880448,0.82,housenumber,4 Route de Canteloup 33750 Beychac-et-Caillau,33049_yg7qrc_00004,G,4 ROUTE DE CANTELOUP,
325261816,00012,32526181600012,O,1982-08-23,NN,,,2019-11-14T14:00:32,true,1,,,,LD,CHEMIN ROUGE,33750,BEYCHAC-ET-CAILLAU,,,33049,,,,,,,,,,,,,,,,,,,1994-03-02,F,,,,,01.1G,NAF1993,N,-0.375162,44.869893,0.94,street,Chemin Rouge 33750 Beychac-et-Caillau,33049_0080,G,CHEMIN ROUGE,
325888626,00018,32588862600018,O,1982-11-27,NN,,,2019-11-14T14:00:32,true,5,,,,LD,L INTENDANT,33750,BEYCHAC-ET-CAILLAU,,,33049,,,,,,,,,,,,,,,,,,,2008-01-01,F,,,,,47.89Z,NAFRev2,N,-0.378774,44.879192,0.94,street,L'Intendant 33750 Beychac-et-Caillau,33049_1ymw39,G,L INTENDANT,
326057718,00024,32605771800024,O,1994-02-01,NN,,,2019-11-14T14:00:32,false,3,,,,,ZA GRAND CAZEAU,33750,BEYCHAC-ET-CAILLAU,,,33049,,,,,,,,,,,,,,,,,,,2008-01-01,A,,,,,49.41B,NAFRev2,N,-0.353124,44.881204,0.76,street,Zone du Grand Cazeau 33750 Beychac-et-Caillau,33049_k0zvoz,G,ZONE DU GRAND CAZEAU,
326787835,00015,32678783500015,O,,NN,,,2019-11-14T14:00:32,true,1,,,,,CAILLEAU,33750,BEYCHAC-ET-CAILLAU,,,33049,,,,,,,,,,,,,,,,,,,,F,,,,,67.01,NAP,N,-0.371304,44.874484,0.8,street,Lotissement Hameau Rouille de Bertin 33750 Beychac-et-Caillau,33049_a040,G,LOT HAMEAU ROUILLE DE BERTIN,
327268801,05244,32726880105244,O,2015-02-05,NN,,,2019-11-14T14:00:32,false,2,,,,,RN 98,33750,BEYCHAC-ET-CAILLAU,,,33049,,,,,,,,,,,,,,,,,,,2015-11-30,F,RE. DU CANTELOUP,,,,47.30Z,NAFRev2,N,,,0,,,,,,
327512406,00015,32751240600015,O,1983-02-01,01,2017,4520AB,2019-11-14T14:00:32,true,6,,,,LD,LE CANTELOUP,33750,BEYCHAC-ET-CAILLAU,,,33049,,,,,,,,,,,,,,,,,,,2018-12-28,F,,,,,45.20A,NAFRev2,N,-0.350425,44.882258,0.79,street,Route de Canteloup 33750 Beychac-et-Caillau,33049_yg7qrc,G,ROUTE DE CANTELOUP,
328139423,00045,32813942300045,O,1986-11-30,NN,,,2019-11-14T14:00:32,true,7,LD BERTIN,,,RTE,NATIONALE 89,33750,BEYCHAC-ET-CAILLAU,,,33049,,,,,,,,,,,,,,,,,,,2008-01-01,F,,,,,46.34Z,NAFRev2,O,-0.372998,44.872703,0.35,street,Bertin 33750 Beychac-et-Caillau,33049_u81kmu,D,BERTIN,
328139423,00052,32813942300052,O,2001-02-01,NN,,,2019-11-14T14:00:32,false,4,LIEUDIT BERTIN - RN 89,,,,,33750,BEYCHAC-ET-CAILLAU,,,33049,,,,,,,,,,,,,,,,,,,2008-01-01,F,CELLIER VIGNOBLES BORDELAIS COMPAGNONS,,,,82.92Z,NAFRev2,N,-0.372998,44.872703,0.4,street,Bertin 33750 Beychac-et-Caillau,33049_u81kmu,D,BERTIN,
328143417,00025,32814341700025,O,,NN,,,2019-11-14T14:00:32,true,1,,,,LD,BOURG,33750,BEYCHAC-ET-CAILLAU,,,33049,,,,,,,,,,,,,,,,,,,1993-03-30,F,,,,,52.1B,NAF1993,N,-0.373018,44.86932,0.93,street,Le Bourg 33750 Beychac-et-Caillau,33049_ysa19n,G,LE BOURG,
328379870,00012,32837987000012,O,1983-08-30,NN,,,2019-11-14T14:00:32,true,1,,,,LD,CANTELOUP,33750,BEYCHAC-ET-CAILLAU,,,33049,,,,,,,,,,,,,,,,,,,1999-12-31,F,,,,,70.2C,NAF1993,N,-0.369433,44.880757,0.94,street,Canteloup 33750 Beychac-et-Caillau,33049_p59fsf,G,CANTELOUP,
329396477,00062,32939647700062,O,2008-04-08,01,2017,,2019-11-14T14:00:32,false,3,4 ROUTE PERRICHE,,,,PERRICHE,33750,BEYCHAC-ET-CAILLAU,,,33049,,,,,,,,,,,,,,,,,,,2019-06-01,F,,,,,47.91A,NAFRev2,O,-0.400736,44.873105,0.94,street,Perriche 33750 Beychac-et-Caillau,33049_66lw0x,G,PERRICHE,
329646491,00020,32964649100020,O,,NN,,,2019-11-14T14:00:32,true,1,,,,,RELAIS CANTELOUP,33750,BEYCHAC-ET-CAILLAU,,,33049,,,,,,,,,,,,,,,,,,,1992-02-07,F,,,,,52.4W,NAF1993,N,-0.369433,44.880757,0.6,street,Canteloup 33750 Beychac-et-Caillau,33049_p59fsf,G,CANTELOUP,
329954218,00023,32995421800023,O,1984-01-10,NN,,,2019-11-14T14:00:32,true,4,,,,,,33750,BEYCHAC-ET-CAILLAU,,,33049,,,,,,,,,,,,,,,,,,,2012-12-31,F,,,,,68.20B,NAFRev2,N,,,0,,,,,,