siren,nic,siret,statutDiffusionEtablissement,dateCreationEtablissement,trancheEffectifsEtablissement,anneeEffectifsEtablissement,activitePrincipaleRegistreMetiersEtablissement,dateDernierTraitementEtablissement,etablissementSiege,nombrePeriodesEtablissement,complementAdresseEtablissement,numeroVoieEtablissement,indiceRepetitionEtablissement,typeVoieEtablissement,libelleVoieEtablissement,codePostalEtablissement,libelleCommuneEtablissement,libelleCommuneEtrangerEtablissement,distributionSpecialeEtablissement,codeCommuneEtablissement,codeCedexEtablissement,libelleCedexEtablissement,codePaysEtrangerEtablissement,libellePaysEtrangerEtablissement,complementAdresse2Etablissement,numeroVoie2Etablissement,indiceRepetition2Etablissement,typeVoie2Etablissement,libelleVoie2Etablissement,codePostal2Etablissement,libelleCommune2Etablissement,libelleCommuneEtranger2Etablissement,distributionSpeciale2Etablissement,codeCommune2Etablissement,codeCedex2Etablissement,libelleCedex2Etablissement,codePaysEtranger2Etablissement,libellePaysEtranger2Etablissement,dateDebut,etatAdministratifEtablissement,enseigne1Etablissement,enseigne2Etablissement,enseigne3Etablissement,denominationUsuelleEtablissement,activitePrincipaleEtablissement,nomenclatureActivitePrincipaleEtablissement,caractereEmployeurEtablissement,longitude,latitude,geo_score,geo_type,geo_adresse,geo_id,geo_ligne,geo_l4,geo_l5
172406613,00569,17240661300569,O,2002-01-01,,,,2010-09-16T09:59:15,false,4,,,,CHE,DU LUC,33640,PORTETS,,,33334,,,,,,,,,,,,,,,,,,,2009-12-31,F,DDE24-SUB EYMET VELINE-CTRE EXPLOITATION,,,,84.13Z,NAFRev2,N,-0.429196,44.684182,0.44,street,Chemin du Malbec 33640 Portets,33334_0047,G,CHEMIN DU MALBEC,
213303340,00011,21330334000011,O,1983-03-01,12,2017,,2019-06-24T13:10:17,true,4,MAIRIE,11,,,GRAND'RUE,33640,PORTETS,,,33334,,,,,,,,,,,,,,,,,,,2008-01-01,A,MAIRIE,,,,84.11Z,NAFRev2,O,-0.424102,44.696742,0.94,housenumber,11 Grand Rue 33640 Portets,33334_0033_00011,G,11 GRAND RUE,
213303340,00029,21330334000029,O,1983-12-21,11,2017,,2019-06-24T13:10:17,false,3,,,,,,33640,PORTETS,,,33334,,,,,,,,,,,,,,,,,,,2008-01-01,A,ECOLE MATERNELLE PUBLIQUE,,,,85.10Z,NAFRev2,N,,,0,,,,,,
213303340,00037,21330334000037,O,1983-12-21,02,2017,,2019-06-24T13:10:17,false,3,,,,,,33640,PORTETS,,,33334,,,,,,,,,,,,,,,,,,,2008-01-01,A,ECOL PRIM PORTETS 2,,,,85.20Z,NAFRev2,N,,,0,,,,,,
213303340,00045,21330334000045,O,1983-12-21,11,2017,,2019-06-24T13:10:17,false,3,,,,,AVENUE GENERAL DE GAULLE,33640,PORTETS,,,33334,,,,,,,,,,,,,,,,,,,2008-01-01,A,ECOL PRIM PORTETS 1,,,,85.20Z,NAFRev2,N,-0.423994,44.694885,0.71,street,Place du Général de Gaulle 33640 Portets,33334_0032,G,PLACE DU GENERAL DE GAULLE,
213303340,00052,21330334000052,O,2003-01-01,NN,,,2013-01-23T13:38:24,false,4,MAIRIE,11,,,GRAND RUE,33640,PORTETS,,,33334,,,,,,,,,,,,,,,,,,,2011-12-25,F,CIMETIERE-CAVEAUX,,,,96.03Z,NAFRev2,N,-0.424102,44.696742,0.94,housenumber,11 Grand Rue 33640 Portets,33334_0033_00011,G,11 GRAND RUE,
213303340,00060,21330334000060,O,2005-04-07,,,,2013-02-07T11:10:13,false,3,,27,,RUE,DU 8 MAI 1945,33640,PORTETS,,,33334,,,,,,,,,,,,,,,,,,,2013-02-06,A,ESPACE CULTUREL LA FORGE,,,,90.04Z,NAFRev2,N,-0.424119,44.693029,0.94,housenumber,27 Rue du 8 Mai 1945 33640 Portets,33334_0035_00027,G,27 RUE DU 8 MAI 1945,
253301972,00035,25330197200035,O,2017-06-26,01,2017,,2019-06-24T13:13:29,true,1,,11,,GR,MAIRIE,33640,PORTETS,,,33334,,,,,,,,,,,,,,,,,,,2017-06-26,A,,,,,36.00Z,NAFRev2,O,-0.422638,44.695454,0.38,housenumber,11 Rue de la Bonneterie 33640 Portets,33334_0015_00011,G,11 RUE DE LA BONNETERIE,
253302665,00026,25330266500026,O,2001-11-22,NN,,,2010-04-18T03:16:35,false,5,,,,,HOTEL DE VILLE,33640,PORTETS,,,33334,,,,,,,,,,,,,,,,,,,2008-10-07,F,,,,,84.12Z,NAFRev2,O,-0.423994,44.694885,0.4,street,Place du Général de Gaulle 33640 Portets,33334_0032,G,PLACE DU GENERAL DE GAULLE,
263303299,00014,26330329900014,O,1983-03-01,NN,,,2008-04-26T08:30:25,true,4,,,,,,33640,PORTETS,,,33334,,,,,,,,,,,,,,,,,,,2008-01-01,A,CCAS,,,,88.99B,NAFRev2,N,,,0,,,,,,
263305518,00015,26330551800015,O,1983-03-01,NN,,,2008-01-04T18:58:14,true,3,,,,,,33640,PORTETS,,,33334,,,,,,,,,,,,,,,,,,,2008-01-01,A,CDE,,,,88.99B,NAFRev2,N,,,0,,,,,,
263305856,00217,26330585600217,O,2018-01-01,,,,2018-03-01T16:50:37,false,1,,,,AV,DE LA LIBERATION,33640,PORTETS,,,33334,,,,,,,,,,,,,,,,,,,2018-01-01,A,CMP PORTETS,,,,86.10Z,NAFRev2,N,-0.422475,44.697137,0.53,street,Rue de la Liberté 33640 Portets,33334_0037,G,RUE DE LA LIBERTE,
300706025,00016,30070602500016,O,,,,,2007-01-18T09:10:36,true,1,,,,,,33640,PORTETS,,,33334,,,,,,,,,,,,,,,,,,,1990-12-11,F,,,,,01.1G,NAF1993,N,,,0,,,,,,
300905817,00015,30090581700015,O,1974-01-01,NN,,,2014-07-08T00:10:59,true,4,,,,,GRAND ABORD,33640,PORTETS,,,33334,,,,,,,,,,,,,,,,,,,2013-08-31,F,,,,,10.13B,NAFRev2,N,-0.41729,44.68775,0.94,street,Grand Abord 33640 Portets,33334_b066,G,GRAND ABORD,
301085254,00011,30108525400011,O,1900-01-01,,,,,false,3,,,,,LES BOUDOBANS,33640,PORTETS,,,33334,,,,,,,,,,,,,,,,,,,1996-01-01,F,,,,,85.1G,NAF1993,N,-0.434849,44.693445,0.81,street,Les Boudoubans 33640 Portets,33334_d3t3jy,G,LES BOUDOUBANS,
301085254,00029,30108525400029,O,1996-01-01,NN,,,2018-12-07T10:12:23,true,4,,22,,,GRAND'RUE,33640,PORTETS,,,33334,,,,,,,,,,,,,,,,,,,2016-12-31,F,,,,,86.90E,NAFRev2,N,-0.423868,44.69709,0.94,housenumber,22 Grand Rue 33640 Portets,33334_0033_00022,G,22 GRAND RUE,
301085254,00037,30108525400037,O,2000-08-02,NN,,,2016-12-07T11:25:32,false,5,,26,,RUE,DE LA LIBERTE,33640,PORTETS,,,33334,,,,,,,,,,,,,,,,,,,2016-12-31,F,SCM DU PORT DU ROY,,,,86.90E,NAFRev2,N,-0.425056,44.698865,0.94,housenumber,26 Rue de la Liberté 33640 Portets,33334_0037_00026,G,26 RUE DE LA LIBERTE,
301257283,00053,30125728300053,O,1985-07-01,,,,,true,1,,,,RUE,POMAREDE,33640,PORTETS,,,33334,,,,,,,,,,,,,,,,,,,1993-12-25,F,,,,,28.1A,NAF1993,N,-0.433974,44.676131,0.65,street,Chemin de Pommarede 33640 Portets,33334_0193,G,CHEMIN DE POMMAREDE,
302154687,00016,30215468700016,O,1900-01-01,,,,2008-09-03T14:02:33,true,3,,,,,CHATEAU DU GRAND ABORD,33640,PORTETS,,,33334,,,,,,,,,,,,,,,,,,,2008-01-01,A,,,,,01.21Z,NAFRev2,N,-0.41729,44.68775,0.56,street,Grand Abord 33640 Portets,33334_b066,G,GRAND ABORD,
302154687,00024,30215468700024,O,2010-01-01,,,,2016-01-12T00:10:41,false,1,CHATEAU GRAND ABORD,56,,RTE,DES GRAVES,33640,PORTETS,,,33334,,,,,,,,,,,,,,,,,,,2010-01-01,A,,,,,02.20Z,NAFRev2,N,-0.417943,44.68838,0.88,housenumber,56 Route des Graves 33640 Portets,33334_j9r6vv_00056,G,56 ROUTE DES GRAVES,
302595640,00012,30259564000012,O,1975-01-01,NN,,,2015-08-24T09:28:39,true,4,VOIE NOUVELLE,,,,LES BOUDUBANS,33640,PORTETS,,,33334,,,,,,,,,,,,,,,,,,,2013-12-31,F,,,,,68.20B,NAFRev2,N,-0.434849,44.693445,0.81,street,Les Boudoubans 33640 Portets,33334_d3t3jy,G,LES BOUDOUBANS,
302595657,00016,30259565700016,O,,,,,2007-01-18T09:10:46,true,1,,,,,,33640,PORTETS,,,33334,,,,,,,,,,,,,,,,,,,,F,,,,,01.17,NAP,N,,,0,,,,,,
303312318,00015,30331231800015,O,,,,,,true,1,,,,,,33640,PORTETS,,,33334,,,,,,,,,,,,,,,,,,,1985-12-25,F,,,,,62.11,NAP,N,,,0,,,,,,
303895981,00015,30389598100015,O,,,,,,true,1,,,,RUE,DE LABONNETTERIE,33640,PORTETS,,,33334,,,,,,,,,,,,,,,,,,,1995-03-29,F,,,,,45.4C,NAF1993,N,-0.423091,44.695122,0.77,street,Rue de la Bonneterie 33640 Portets,33334_0015,G,RUE DE LA BONNETERIE,
304283914,00014,30428391400014,O,,NN,,,,true,1,,,,,DARROUBIN,33640,PORTETS,,,33334,,,,,,,,,,,,,,,,,,,1996-03-31,F,,,,,52.4R,NAF1993,N,-0.416572,44.696406,0.92,street,Palue de Darroubin 33640 Portets,33334_b109,G,PALUE DE DARROUBIN,
304868631,00017,30486863100017,O,,NN,,,,true,1,,,,,CV 08,33640,PORTETS,,,33334,,,,,,,,,,,,,,,,,,,2001-06-28,F,,,,,70.2C,NAF1993,N,,,0,,,,,,
304932718,00014,30493271800014,O,1900-01-01,NN,,,2008-01-04T19:33:05,true,3,CHATEAU LA VIEILLE FRANCE,1,,CHE,DU MALBEC,33640,PORTETS,,,33334,,,,,,,,,,,,,,,,,,,2008-01-01,A,,,,,68.20B,NAFRev2,N,-0.429196,44.684182,0.83,housenumber,1 Chemin du Malbec 33640 Portets,33334_0047_00001,G,1 CHEMIN DU MALBEC,
305386047,00016,30538604700016,O,1963-01-01,NN,,,2017-02-02T03:54:05,true,5,,35,,,GRAND RUE,33640,PORTETS,,,33334,,,,,,,,,,,,,,,,,,,2008-01-01,F,,,,,68.20B,NAFRev2,N,-0.423839,44.697431,0.94,housenumber,35 Grand Rue 33640 Portets,33334_0033_00035,G,35 GRAND RUE,
306048570,00015,30604857000015,O,1963-01-01,NN,,,2016-01-14T03:10:31,true,6,,52,,RTE,DES GRAVES,33640,PORTETS,,,33334,,,,,,,,,,,,,,,,,,,2015-09-30,F,,,,,74.20Z,NAFRev2,N,-0.418145,44.688496,0.88,housenumber,52 Route des Graves 33640 Portets,33334_j9r6vv_00052,G,52 ROUTE DES GRAVES,
306146077,00012,30614607700012,O,,,,,,true,1,,,,,LE COURMOUD,33640,PORTETS,,,33334,,,,,,,,,,,,,,,,,,,1984-12-25,F,,,,,,,N,-0.427046,44.683056,0.55,street,Le Courneau 33640 Portets,33334_30klp6,G,LE COURNEAU,
306193673,00028,30619367300028,O,2009-12-01,,,,2016-07-13T03:22:18,true,2,,42,,RTE,DES GRAVES,33640,PORTETS,,,33334,,,,,,,,,,,,,,,,,,,2016-05-31,F,,,,,47.59A,NAFRev2,N,-0.418848,44.688796,0.88,housenumber,42 Route des Graves 33640 Portets,33334_j9r6vv_00042,G,42 ROUTE DES GRAVES,
306792375,00017,30679237500017,O,,NN,,,,true,1,,,,,CHATEAU D EMAY,33640,PORTETS,,,33334,,,,,,,,,,,,,,,,,,,1996-03-16,F,,,,,01.1G,NAF1993,N,-0.426415,44.698996,0.58,street,Château de Portets 33640 Portets,33334_etniqe,G,CHATEAU DE PORTETS,
308022912,00015,30802291200015,O,1976-01-01,NN,,,2012-12-20T09:44:14,true,4,,,,LD,LE GRAND ABORD,33640,PORTETS,,,33334,,,,,,,,,,,,,,,,,,,2012-03-29,F,,,,,68.20B,NAFRev2,N,-0.41729,44.68775,0.78,street,Grand Abord 33640 Portets,33334_b066,G,GRAND ABORD,
308610757,00020,30861075700020,O,1996-09-01,NN,,,,true,1,,11,,CHE,JEAN DE MAYE,33640,PORTETS,,,33334,,,,,,,,,,,,,,,,,,,2001-12-31,F,,,,,67.2Z,NAF1993,N,-0.411873,44.686409,0.76,housenumber,11 Chemin Jean de May 33640 Portets,33334_0041_00011,G,11 CHEMIN JEAN DE MAY,
308866409,00011,30886640900011,O,1977-01-01,NN,,,2008-11-27T09:15:47,false,3,,19,,RUE,DU 8 MAI 1945,33640,PORTETS,,,33334,,,,,,,,,,,,,,,,,,,2007-06-30,F,,,,,93.0B,NAFRev1,N,-0.424382,44.693591,0.94,housenumber,19 Rue du 8 Mai 1945 33640 Portets,33334_0035_00019,G,19 RUE DU 8 MAI 1945,
309038271,00016,30903827100016,O,,NN,,,,true,1,,,,RUE,DE LA LIBERTE,33640,PORTETS,,,33334,,,,,,,,,,,,,,,,,,,1994-04-30,F,,,,,45.2V,NAF1993,N,-0.422475,44.697137,0.94,street,Rue de la Liberté 33640 Portets,33334_0037,G,RUE DE LA LIBERTE,
309385706,00044,30938570600044,O,1993-05-02,NN,,,2007-12-24T09:25:10,false,6,SARL E G K,,,LD,GARTS,33640,PORTETS,,,33334,,,,,,,,,,,,,,,,,,,2004-06-02,F,,,,,74.1J,NAFRev1,N,-0.401665,44.695245,0.92,street,Les Garts 33640 Portets,33334_jqljuf,G,LES GARTS,
309385706,00051,30938570600051,O,2007-11-28,,,,2014-07-08T00:14:27,false,3,,,,,LA TUILERIE,33640,PORTETS,,,33334,,,,,,,,,,,,,,,,,,,2008-12-29,F,ENTREPRISE KONTOWICZ FRANCIS,,,,43.31Z,NAFRev2,N,-0.414193,44.687621,0.56,street,La Tuilliere 33640 Portets,33334_v1qatl,G,LA TUILLIERE,
309426229,00014,30942622900014,O,1900-01-01,NN,,,2011-01-18T15:39:23,false,4,,,,,,33640,PORTETS,,,33334,,,,,,,,,,,,,,,,,,,2010-12-25,F,,,,,68.20B,NAFRev2,N,,,0,,,,,,
309544138,00030,30954413800030,O,,NN,,,,true,1,,,,LOT,DARROUHAN,33640,PORTETS,,,33334,,,,,,,,,,,,,,,,,,,,F,,,,,77.14,NAP,N,-0.416572,44.696406,0.42,street,Palue de Darroubin 33640 Portets,33334_b109,G,PALUE DE DARROUBIN,
309775724,00011,30977572400011,O,1977-01-01,NN,,,2008-11-07T00:24:39,true,4,LD PAPOULA,23,,RTE,DES GRAVES,33640,PORTETS,,,33334,,,,,,,,,,,,,,,,,,,2006-01-31,F,,,,,45.3E,NAFRev1,O,-0.422569,44.689876,0.88,housenumber,23 Route des Graves 33640 Portets,33334_j9r6vv_00023,G,23 ROUTE DES GRAVES,
309848331,00018,30984833100018,O,,,,,,true,1,,,,RTE,NATIONALE 113 CLUCHON EST,33640,PORTETS,,,33334,,,,,,,,,,,,,,,,,,,1987-07-31,F,,,,,55.73,NAP,N,,,0,,,,,,
310432869,00017,31043286900017,O,1900-01-01,NN,,,2017-05-04T02:14:44,true,5,,2,,RUE,DES TONNELIERS,33640,PORTETS,,,33334,,,,,,,,,,,,,,,,,,,2015-05-31,F,,,,,86.21Z,NAFRev2,O,-0.425194,44.695459,0.94,housenumber,2 Rue des Tonneliers 33640 Portets,33334_0060_00002,G,2 RUE DES TONNELIERS,
310715396,00019,31071539600019,O,1900-01-01,,,,,false,3,,,,AV,DE LA LIBERATION,33640,PORTETS,,,33334,,,,,,,,,,,,,,,,,,,1994-05-09,F,,,,,85.1E,NAF1993,N,-0.422475,44.697137,0.53,street,Rue de la Liberté 33640 Portets,33334_0037,G,RUE DE LA LIBERTE,
310715396,00027,31071539600027,O,1994-05-09,NN,,,2017-05-04T02:16:04,true,5,,4,,,GRAND'RUE,33640,PORTETS,,,33334,,,,,,,,,,,,,,,,,,,2015-12-31,F,,,,,86.23Z,NAFRev2,O,-0.424512,44.695367,0.94,housenumber,4 Grand Rue 33640 Portets,33334_0033_00004,G,4 GRAND RUE,
311406532,00045,31140653200045,O,2015-07-01,,,,2015-07-06T09:47:45,true,1,,3,B,,CHE DE LAMOTHE,33640,PORTETS,,,33334,,,,,,,,,,,,,,,,,,,2015-07-01,A,,,,JCB AUTO,45.11Z,NAFRev2,N,-0.416944,44.692024,0.73,housenumber,3 bis Chemin de Lamothe 33640 Portets,33334_0150_00003_bis,G,3 BIS CHEMIN DE LAMOTHE,
311573588,00036,31157358800036,O,1997-03-01,NN,,,2007-07-30T08:54:53,false,3,,6,,PL,GUSTAVE LAMARQUE,33640,PORTETS,,,33334,,,,,,,,,,,,,,,,,,,2007-05-09,F,,,,,85.1C,NAFRev1,N,-0.4461895,44.6962846,0.81,poi.parking,Place Gustave Lamarque (Parking) Castres-Gironde,https://osm.org/node/775804620,G,,
311686836,00025,31168683600025,O,,NN,,,,true,1,,,,RUE,LD MOULIN A VENT-BEL AIR,33640,PORTETS,,,33334,,,,,,,,,,,,,,,,,,,,F,,,,,47.01,NAP,N,-0.421505,44.671976,0.53,street,Chemin du Moulin à Vent 33640 Portets,33334_0158,G,CHEMIN DU MOULIN A VENT,
311743025,00018,31174302500018,O,1900-01-01,NN,,,2010-09-27T13:48:52,true,4,,,,RUE,DE LA LIBERTE,33640,PORTETS,,,33334,,,,,,,,,,,,,,,,,,,2010-12-25,F,,,,,68.20B,NAFRev2,N,-0.422475,44.697137,0.94,street,Rue de la Liberté 33640 Portets,33334_0037,G,RUE DE LA LIBERTE,
311802839,00010,31180283900010,O,,NN,,,,true,1,,,,,,33640,PORTETS,,,33334,,,,,,,,,,,,,,,,,,,,F,,,,,03.30,NAP,N,,,0,,,,,,
311802847,00013,31180284700013,O,,NN,,,,true,1,,,,,,33640,PORTETS,,,33334,,,,,,,,,,,,,,,,,,,1990-12-31,F,,,,,05.0C,NAF1993,N,,,0,,,,,,
312301559,00042,31230155900042,O,1995-01-16,,,,,false,4,,32,,,GRAND RUE,33640,PORTETS,,,33334,,,,,,,,,,,,,,,,,,,1998-04-02,F,,,,,74.5B,NAF1993,N,-0.423745,44.697497,0.94,housenumber,32 Grand Rue 33640 Portets,33334_0033_00032,G,32 GRAND RUE,
312986300,00076,31298630000076,O,2006-09-01,NN,,,2014-07-08T00:17:07,false,4,,30,B,RTE,DES GRAVES,33640,PORTETS,,,33334,,,,,,,,,,,,,,,,,,,2009-01-05,F,G H V - FERMETURES,,,,43.32A,NAFRev2,O,-0.422009,44.68962,0.74,housenumber,30 bis Route des Graves 33640 Portets,33334_j9r6vv_00030_bis,G,30 BIS ROUTE DES GRAVES,
313252546,00012,31325254600012,O,,NN,,,,true,1,,,,LD,LA TUILIERE RN 113,33640,PORTETS,,,33334,,,,,,,,,,,,,,,,,,,1994-06-30,F,,,,,50.5Z,NAF1993,O,,,0,,,,,,
313519746,00025,31351974600025,O,1998-04-14,NN,,,2014-07-08T00:17:33,true,4,,20,,RUE,DU HUIT MAI,33640,PORTETS,,,33334,,,,,,,,,,,,,,,,,,,2008-12-10,F,,,,,96.02A,NAFRev2,N,-0.423955,44.692889,0.64,housenumber,20 Rue du 8 Mai 1945 33640 Portets,33334_0035_00020,G,20 RUE DU 8 MAI 1945,
314414574,00017,31441457400017,O,1978-01-01,NN,,,,false,4,,,,QUAI,LAMOTHE,33640,PORTETS,,,33334,,,,,,,,,,,,,,,,,,,2003-03-31,F,,,,,70.2C,NAFRev1,N,-0.416576,44.692273,0.58,street,Chemin de Lamothe 33640 Portets,33334_0150,G,CHEMIN DE LAMOTHE,
314585159,00010,31458515900010,O,,,,,,true,1,,,,,,33640,PORTETS,,,33334,,,,,,,,,,,,,,,,,,,1994-06-02,F,,,,,01.1G,NAF1993,N,,,0,,,,,,
314739608,00011,31473960800011,O,,,,,,true,1,,,,,LAMOTHE,33640,PORTETS,,,33334,,,,,,,,,,,,,,,,,,,1984-12-25,F,,,,,55.73,NAP,N,-0.417184,44.691482,0.93,street,Lamothe Est 33640 Portets,33334_b090,G,LAMOTHE EST,
315049908,00025,31504990800025,O,1995-10-02,NN,,,2006-11-25T09:35:45,false,3,,2,,RTE,,33640,PORTETS,,,33334,,,,,,,,,,,,,,,,,,,2006-06-20,F,,,,,74.8K,NAFRev1,N,-0.415012,44.690963,0.75,housenumber,2 Route de Rapin 33640 Portets,33334_0202_00002,G,2 ROUTE DE RAPIN,
315673038,00032,31567303800032,O,1993-06-01,NN,,,2009-09-09T09:09:03,false,4,QUARTIER CHAYE,29,,RTE,DE MATHAS,33640,PORTETS,,,33334,,,,,,,,,,,,,,,,,,,2008-01-01,F,,,,,86.90D,NAFRev2,N,-0.407893,44.685248,0.88,housenumber,29 Route de Mathas 33640 Portets,33334_0048_00029,G,29 ROUTE DE MATHAS,
316437961,00014,31643796100014,O,1979-01-01,NN,,,2018-11-19T09:49:28,false,4,,,,,NATIONALE 113,33640,PORTETS,,,33334,,,,,,,,,,,,,,,,,,,2003-06-30,F,,,,,70.2C,NAFRev1,N,1.663534,43.4346487,0.89,poi,Route Nationale 113 (Pont) Villenouvelle,https://osm.org/way/389888104,G,,
316833839,00012,31683383900012,O,1979-01-01,NN,,,,true,1,,,,RUE,DE LA LIBERATION,33640,PORTETS,,,33334,,,,,,,,,,,,,,,,,,,1999-02-24,F,,,,,00.0Z,NAF1993,N,-0.422475,44.697137,0.7,street,Rue de la Liberté 33640 Portets,33334_0037,G,RUE DE LA LIBERTE,
316892983,00016,31689298300016,O,,NN,,,,true,1,,,,,NATIONALE 113,33640,PORTETS,,,33334,,,,,,,,,,,,,,,,,,,,F,,,,,64.25,NAP,N,1.663534,43.4346487,0.89,poi,Route Nationale 113 (Pont) Villenouvelle,https://osm.org/way/389888104,G,,
317100295,00011,31710029500011,O,1979-01-01,NN,,,2008-01-04T20:50:43,true,3,,,,,,33640,PORTETS,,,33334,,,,,,,,,,,,,,,,,,,2008-01-01,A,,,,,94.91Z,NAFRev2,N,,,0,,,,,,
317337178,00014,31733717800014,O,,,,,,true,1,,,,,GUEYDON,33640,PORTETS,,,33334,,,,,,,,,,,,,,,,,,,1984-12-25,F,,,,,60.09,NAP,N,-0.418426,44.686248,0.94,street,Gueydon 33640 Portets,33334_l6y693,G,GUEYDON,
317794139,00020,31779413900020,O,1992-10-01,NN,,,2006-11-25T09:41:29,false,5,QUARTIER DU HILLADEY,1,,CHE,,33640,PORTETS,,,33334,,,,,,,,,,,,,,,,,,,2004-06-30,F,,,,,70.2C,NAFRev1,N,-0.416576,44.692273,0.91,housenumber,1 Chemin de Lamothe 33640 Portets,33334_0150_00001,G,1 CHEMIN DE LAMOTHE,
317794139,00038,31779413900038,O,2001-05-01,NN,,,2006-11-25T09:41:29,true,3,SARL HERVE BATIMENT,1,,CHE,DE CANDAUBAS,33640,PORTETS,,,33334,,,,,,,,,,,,,,,,,,,2004-06-30,F,,,,,74.1J,NAFRev1,N,-0.425945,44.696418,0.85,housenumber,1 Chemin de Candaubas 33640 Portets,33334_0018_00001,G,1 CHEMIN DE CANDAUBAS,
317890572,00025,31789057200025,O,1991-01-01,NN,,,2012-07-28T11:23:40,true,4,,,,LD,COURNEAU,33640,PORTETS,,,33334,,,,,,,,,,,,,,,,,,,2008-12-25,F,,,,,01.21Z,NAFRev2,N,-0.427046,44.683056,0.93,street,Le Courneau 33640 Portets,33334_30klp6,G,LE COURNEAU,
318015617,00018,31801561700018,O,1980-01-01,NN,,,2009-02-23T02:51:14,true,4,,,,,LE BOURG,33640,PORTETS,,,33334,,,,,,,,,,,,,,,,,,,2008-12-31,F,,,,,86.21Z,NAFRev2,N,-0.424218,44.697123,0.94,street,Le Bourg 33640 Portets,33334_4if3ri,G,LE BOURG,
318316742,00010,31831674200010,O,1980-01-01,NN,,,2013-09-15T04:16:38,true,4,,113,,RTE,NATIONALE,33640,PORTETS,,,33334,,,,,,,,,,,,,,,,,,,2013-09-30,F,,,,,47.26Z,NAFRev2,N,1.2279812,49.230352,0.77,poi,Route Nationale (Pont) Saint-Pierre-du-Vauvray,https://osm.org/way/95838375,G,,
318366382,00014,31836638200014,O,1980-01-01,02,2017,,2019-06-24T13:19:53,true,5,,,,LD,CLUCHON SUD,33640,PORTETS,,,33334,,,,,,,,,,,,,,,,,,,2010-12-31,A,,,,,01.21Z,NAFRev2,O,-0.41499,44.685951,0.94,street,Cluchon Sud 33640 Portets,33334_b041,G,CLUCHON SUD,
318625753,00013,31862575300013,O,,NN,,,,true,1,,,,RTE,NAT. 113 - LD VERGNE,33640,PORTETS,,,33334,,,,,,,,,,,,,,,,,,,1986-02-28,F,,,,,65.02,NAP,N,,,0,,,,,,
318814076,00010,31881407600010,O,1980-07-01,00,2016,4321AB,2018-09-29T12:17:25,true,5,,5,,RTE,DU CABERNET,33640,PORTETS,,,33334,,,,,,,,,,,,,,,,,,,2016-04-30,F,,,,,43.21A,NAFRev2,O,-0.414045,44.685235,0.88,housenumber,5 Route du Cabernet 33640 Portets,33334_0007_00005,G,5 ROUTE DU CABERNET,
318993664,00016,31899366400016,O,1980-05-28,NN,,,2018-12-28T03:38:05,true,3,,,,,LES GRANDS ABORDS- CHA FAY,33640,PORTETS,,,33334,,,,,,,,,,,,,,,,,,,2008-01-01,A,,,,,68.20A,NAFRev2,N,,,0,,,,,,
319285573,00022,31928557300022,O,,,,,,true,1,,,,,VILLA JEAN PAUL DAROUBIN,33640,PORTETS,,,33334,,,,,,,,,,,,,,,,,,,1984-12-25,F,,,,,60.07,NAP,N,-0.414844,44.693935,0.38,street,Daroubin-sud 33640 Portets,33334_b049,G,DAROUBIN SUD,
319311478,00014,31931147800014,O,1980-01-01,NN,,,2019-09-05T03:38:04,true,3,,,,,,33640,PORTETS,,,33334,,,,,,,,,,,,,,,,,,,2008-01-01,A,,,,,68.20B,NAFRev2,N,,,0,,,,,,
321230344,00046,32123034400046,O,2010-08-27,,,,2015-09-16T03:57:09,true,2,,78,,RTE,DES GRAVES,33640,PORTETS,,,33334,,,,,,,,,,,,,,,,,,,2015-09-30,F,,,,,96.02A,NAFRev2,N,-0.416812,44.687642,0.88,housenumber,78 Route des Graves 33640 Portets,33334_j9r6vv_00078,G,78 ROUTE DES GRAVES,
321621005,00032,32162100500032,O,1993-10-01,,,,,false,4,,16,,RTE,DU COURNEAU,33640,PORTETS,,,33334,,,,,,,,,,,,,,,,,,,1997-10-01,F,,,,,80.4D,NAF1993,N,-0.425939,44.685962,0.88,housenumber,16 Route du Courneau 33640 Portets,33334_0115_00016,G,16 ROUTE DU COURNEAU,
322328386,00055,32232838600055,O,1998-04-01,NN,,,,false,4,CZ ME DUMERGUE COLETTE,,,,BEAU SITE,33640,PORTETS,,,33334,,,,,,,,,,,,,,,,,,,2000-12-31,F,,,,,74.2A,NAF1993,N,-0.055078,43.0932294,0.9,poi.hotel,Hôtel Beau Site Lourdes,https://osm.org/way/301412117,G,,
322328386,00063,32232838600063,O,2000-03-01,NN,,,2006-11-25T09:51:37,false,3,,4,,RUE,CLUCHON,33640,PORTETS,,,33334,,,,,,,,,,,,,,,,,,,2006-04-01,F,,,,,74.2A,NAFRev1,N,-0.414644,44.686634,0.67,housenumber,4 Chemin de Cluchon 33640 Portets,33334_0110_00004,G,4 CHEMIN DE CLUCHON,
322525742,00019,32252574200019,O,1981-07-01,,,,,true,1,,,,LOT,GRAND ABORD,33640,PORTETS,,,33334,,,,,,,,,,,,,,,,,,,2002-11-30,F,,,,,55.3A,NAF1993,N,-0.41729,44.68775,0.74,street,Grand Abord 33640 Portets,33334_b066,G,GRAND ABORD,
322818998,00013,32281899800013,O,,,,,,true,1,,,,RUE,DE LA LIBERATION,33640,PORTETS,,,33334,,,,,,,,,,,,,,,,,,,1984-12-25,F,,,,,66.01,NAP,N,-0.422475,44.697137,0.7,street,Rue de la Liberté 33640 Portets,33334_0037,G,RUE DE LA LIBERTE,
323191106,00349,32319110600349,O,2013-01-01,02,2017,,2019-06-24T13:22:02,false,1,,29,,RTE,DES GRAVES,33640,PORTETS,,,33334,,,,,,,,,,,,,,,,,,,2013-01-01,A,,,,,86.90B,NAFRev2,O,-0.418976,44.68896,0.88,housenumber,29 Route des Graves 33640 Portets,33334_j9r6vv_00029,G,29 ROUTE DES GRAVES,
323302133,00018,32330213300018,O,1981-02-01,NN,,,,true,1,,,,RTE,NATIONALE 113,33640,PORTETS,,,33334,,,,,,,,,,,,,,,,,,,1990-02-16,F,,,,,01.1G,NAF1993,N,1.663534,43.4346487,0.8,poi,Route Nationale 113 (Pont) Villenouvelle,https://osm.org/way/389888104,G,,
323315663,00019,32331566300019,O,1981-10-01,,,,,true,1,,,,,CHATEAU DU MIRAIL,33640,PORTETS,,,33334,,,,,,,,,,,,,,,,,,,2000-06-30,F,,,,,01.1G,NAF1993,N,-0.418607,44.688534,0.55,street,Rue du Mirail 33640 Portets,33334_0049,G,RUE DU MIRAIL,
323813063,00019,32381306300019,O,1982-02-09,01,2017,,2019-06-24T13:22:23,true,4,,,,LD,CLOS LAMOTHE,33640,PORTETS,,,33334,,,,,,,,,,,,,,,,,,,2011-12-31,A,,,,,01.21Z,NAFRev2,O,-0.416576,44.692273,0.58,street,Chemin de Lamothe 33640 Portets,33334_0150,G,CHEMIN DE LAMOTHE,
324054527,00019,32405452700019,O,1982-04-01,NN,,,2007-01-18T09:16:26,true,4,,,,DOM,LA GRAVE,33640,PORTETS,,,33334,,,,,,,,,,,,,,,,,,,1994-12-25,F,,,,,01.1G,NAF1993,N,-0.435151,44.694193,0.38,street,Route des Graves Rn113 33640 Portets,33334_0036,G,ROUTE DES GRAVES RN113,
324133024,00012,32413302400012,O,,,,,,true,1,,,,RUE,DE LA LIBERATION,33640,PORTETS,,,33334,,,,,,,,,,,,,,,,,,,1984-12-25,F,,,,,62.11,NAP,N,-0.422475,44.697137,0.7,street,Rue de la Liberté 33640 Portets,33334_0037,G,RUE DE LA LIBERTE,
324405042,00015,32440504200015,O,,NN,,,,true,1,,,,LD,CHAYE,33640,PORTETS,,,33334,,,,,,,,,,,,,,,,,,,1986-06-20,F,,,,,01.80,NAP,N,-0.409956,44.686003,0.94,street,Chaye 33640 Portets,33334_85c3p1,G,CHAYE,
324766823,00011,32476682300011,O,1982-01-01,NN,,,2009-07-27T11:42:05,true,3,,,,LD,CHATEAU BONIS,33640,PORTETS,,,33334,,,,,,,,,,,,,,,,,,,2008-01-01,A,,,,,68.20B,NAFRev2,N,-0.426415,44.698996,0.55,street,Château de Portets 33640 Portets,33334_etniqe,G,CHATEAU DE PORTETS,
324989938,00018,32498993800018,O,1982-04-28,01,2017,,2019-06-24T13:23:03,true,5,,,,,CHATEAU DOMS,33640,PORTETS,,,33334,,,,,,,,,,,,,,,,,,,2010-12-31,A,,,,,01.21Z,NAFRev2,O,-0.426415,44.698996,0.66,street,Château de Portets 33640 Portets,33334_etniqe,G,CHATEAU DE PORTETS,
325082808,00024,32508280800024,O,1986-11-02,NN,,,2008-11-07T00:42:12,false,4,BORD RN 113,,,LD,LE CLUCHON,33640,PORTETS,,,33334,,,,,,,,,,,,,,,,,,,1999-04-01,F,LA FOUGASSE,,,,15.8C,NAF1993,N,-0.414965,44.686644,0.76,street,Chemin de Cluchon 33640 Portets,33334_0110,G,CHEMIN DE CLUCHON,