siren,nic,siret,statutDiffusionEtablissement,dateCreationEtablissement,trancheEffectifsEtablissement,anneeEffectifsEtablissement,activitePrincipaleRegistreMetiersEtablissement,dateDernierTraitementEtablissement,etablissementSiege,nombrePeriodesEtablissement,complementAdresseEtablissement,numeroVoieEtablissement,indiceRepetitionEtablissement,typeVoieEtablissement,libelleVoieEtablissement,codePostalEtablissement,libelleCommuneEtablissement,libelleCommuneEtrangerEtablissement,distributionSpecialeEtablissement,codeCommuneEtablissement,codeCedexEtablissement,libelleCedexEtablissement,codePaysEtrangerEtablissement,libellePaysEtrangerEtablissement,complementAdresse2Etablissement,numeroVoie2Etablissement,indiceRepetition2Etablissement,typeVoie2Etablissement,libelleVoie2Etablissement,codePostal2Etablissement,libelleCommune2Etablissement,libelleCommuneEtranger2Etablissement,distributionSpeciale2Etablissement,codeCommune2Etablissement,codeCedex2Etablissement,libelleCedex2Etablissement,codePaysEtranger2Etablissement,libellePaysEtranger2Etablissement,dateDebut,etatAdministratifEtablissement,enseigne1Etablissement,enseigne2Etablissement,enseigne3Etablissement,denominationUsuelleEtablissement,activitePrincipaleEtablissement,nomenclatureActivitePrincipaleEtablissement,caractereEmployeurEtablissement,longitude,latitude,geo_score,geo_type,geo_adresse,geo_id,geo_ligne,geo_l4,geo_l5
213602386,00012,21360238600012,O,1983-03-01,02,2017,,2019-06-24T13:10:24,true,3,,,,,,36160,VIGOULANT,,,36238,,,,,,,,,,,,,,,,,,,2008-01-01,A,MAIRIE,,,,84.11Z,NAFRev2,N,,,0,,,,,,
263601858,00016,26360185800016,O,1992-01-01,NN,,,2016-07-23T12:09:51,true,4,MAIRIE,,,,,36160,VIGOULANT,,,36238,,,,,,,,,,,,,,,,,,,2016-01-01,F,CCAS,,,,88.99B,NAFRev2,N,,,0,,,,,,
306679382,00011,30667938200011,O,,,,,,true,1,,,,,HERAT,36160,VIGOULANT,,,36238,,,,,,,,,,,,,,,,,,,1984-12-25,F,,,,,01.80,NAP,N,2.087789,46.426204,0.9,locality,Brandes d'Hérat 36160 Vigoulant,36238_b003,G,BRANDES D HERAT,
326321122,00011,32632112200011,O,1983-01-01,NN,,,,true,1,,,,LD,L AIR,36160,VIGOULANT,,,36238,,,,,,,,,,,,,,,,,,,1990-09-26,F,,,,,01.3Z,NAF1993,N,-1.0514061,46.0184468,0.88,poi.hotel,L'Air Marin (Hôtel) Yves,https://osm.org/node/3999884486,G,,
328502869,00014,32850286900014,O,1983-11-11,NN,,,2014-06-30T03:30:11,true,5,,,,LD,L AIR,36160,VIGOULANT,,,36238,,,,,,,,,,,,,,,,,,,2014-05-31,F,,,,,01.41Z,NAFRev2,N,-1.0514061,46.0184468,0.88,poi.hotel,L'Air Marin (Hôtel) Yves,https://osm.org/node/3999884486,G,,
338232929,00012,33823292900012,O,1986-01-06,NN,,,2008-11-07T00:57:15,true,4,,,,LD,HERAT,36160,VIGOULANT,,,36238,,,,,,,,,,,,,,,,,,,2006-12-31,F,,,,,45.2V,NAFRev1,O,2.087789,46.426204,0.9,locality,Brandes d'Hérat 36160 Vigoulant,36238_b003,G,BRANDES D HERAT,
342051380,00018,34205138000018,O,1987-01-01,NN,,,2007-01-18T09:24:18,true,3,,,,,LE MERY,36160,VIGOULANT,,,36238,,,,,,,,,,,,,,,,,,,1995-12-25,F,,,,,01.3Z,NAF1993,N,2.091022,46.466573,0.44,locality,Le Moulin Vieux 36160 Vigoulant,36238_b025,G,LE MOULIN VIEUX,
344539374,00019,34453937400019,O,1988-03-15,NN,,,2017-05-04T05:44:26,true,4,,,,,HERAT,36160,VIGOULANT,,,36238,,,,,,,,,,,,,,,,,,,2008-01-01,A,,,,,01.46Z,NAFRev2,N,2.087789,46.426204,0.9,locality,Brandes d'Hérat 36160 Vigoulant,36238_b003,G,BRANDES D HERAT,
349442509,00015,34944250900015,O,1988-01-05,NN,,,2008-01-04T23:04:19,true,3,,,,,LE SEIGNANT,36160,VIGOULANT,,,36238,,,,,,,,,,,,,,,,,,,2008-01-01,A,,,,,01.42Z,NAFRev2,N,2.091022,46.466573,0.39,locality,Le Moulin Vieux 36160 Vigoulant,36238_b025,G,LE MOULIN VIEUX,
378229348,00016,37822934800016,O,1990-03-25,NN,,,2008-01-04T21:14:13,true,4,,,,,DOMAINE DE VIGOULANT,36160,VIGOULANT,,,36238,,,,,,,,,,,,,,,,,,,2008-01-01,A,,,,,01.50Z,NAFRev2,N,2.080058,46.441335,0.58,locality,Moulin de Barre 36160 Vigoulant,36238_b022,G,MOULIN DE BARRE,
382124204,00019,38212420400019,O,1991-06-01,NN,,,2008-01-04T22:05:44,true,3,,,,LD,LES POUGES,36160,VIGOULANT,,,36238,,,,,,,,,,,,,,,,,,,2008-01-01,A,,,,,55.30Z,NAFRev2,N,2.083637,46.414826,0.37,locality,Les Brandes des Mouligoux 36160 Vigoulant,36238_b006,G,LES BRANDES DES MOULIGOUX,
383428141,00014,38342814100014,O,1900-01-01,NN,,,2012-03-06T15:50:25,false,3,,,,,HERAT,36160,VIGOULANT,,,36238,,,,,,,,,,,,,,,,,,,1995-12-31,F,,,,,70.2C,NAF1993,N,2.087789,46.426204,0.9,locality,Brandes d'Hérat 36160 Vigoulant,36238_b003,G,BRANDES D HERAT,
389752395,00019,38975239500019,O,1993-01-08,NN,,,2007-05-25T16:06:42,true,3,LE DOMAINE,,,LD,BOURG DE VIGOULANT,36160,VIGOULANT,,,36238,,,,,,,,,,,,,,,,,,,2007-02-19,F,,,,,01.3Z,NAFRev1,N,2.070224,46.437347,0.73,street,Le Bourg 36160 Vigoulant,36238_943bve,G,LE BOURG,
391045762,00013,39104576200013,O,1993-05-03,NN,,,,true,1,,,,,HERAT,36160,VIGOULANT,,,36238,,,,,,,,,,,,,,,,,,,1996-12-31,F,,,,,74.1G,NAF1993,N,2.087789,46.426204,0.9,locality,Brandes d'Hérat 36160 Vigoulant,36238_b003,G,BRANDES D HERAT,
393236054,00010,39323605400010,O,1993-10-01,NN,,,2009-07-05T04:33:20,true,4,,,,,LE SEIGNANT,36160,VIGOULANT,,,36238,,,,,,,,,,,,,,,,,,,2008-01-01,F,,,,,01.11Z,NAFRev2,N,2.091022,46.466573,0.39,locality,Le Moulin Vieux 36160 Vigoulant,36238_b025,G,LE MOULIN VIEUX,
393236161,00013,39323616100013,O,1993-10-01,NN,,,2009-07-01T05:43:34,true,4,,,,,LE SEIGNANT,36160,VIGOULANT,,,36238,,,,,,,,,,,,,,,,,,,2008-01-01,F,,,,,01.11Z,NAFRev2,N,2.091022,46.466573,0.39,locality,Le Moulin Vieux 36160 Vigoulant,36238_b025,G,LE MOULIN VIEUX,
394348304,00012,39434830400012,O,,NN,,,2006-11-25T12:22:50,true,1,,,,,HERAT,36160,VIGOULANT,,,36238,,,,,,,,,,,,,,,,,,,1996-12-31,F,,,,,74.1G,NAF1993,N,2.087789,46.426204,0.9,locality,Brandes d'Hérat 36160 Vigoulant,36238_b003,G,BRANDES D HERAT,
394421903,00011,39442190300011,O,1994-04-01,NN,,,,true,1,,,,,LES MOULIGOUX,36160,VIGOULANT,,,36238,,,,,,,,,,,,,,,,,,,2001-06-30,F,,,,,93.0D,NAF1993,N,2.083637,46.414826,0.91,locality,Les Brandes des Mouligoux 36160 Vigoulant,36238_b006,G,LES BRANDES DES MOULIGOUX,
397898636,00014,39789863600014,O,,NN,,,,true,1,,,,,CHASSIERES,36160,VIGOULANT,,,36238,,,,,,,,,,,,,,,,,,,1993-11-11,F,,,,,01.3Z,NAF1993,N,4.2934557,44.5520442,0.73,poi.cemetery,(Cimetière) Chassiers,https://osm.org/way/121862533,G,,
397931361,00026,39793136100026,O,1997-02-01,,,,2011-04-28T01:00:51,false,3,,,,,LE BOURG,36160,VIGOULANT,,,36238,,,,,,,,,,,,,,,,,,,2000-11-29,F,,,,,15.8B,NAF1993,N,2.070224,46.437347,0.93,street,Le Bourg 36160 Vigoulant,36238_943bve,G,LE BOURG,
405282450,00015,40528245000015,O,1981-01-01,NN,,,,true,4,LE MAYONNET,,,,,36160,VIGOULANT,,,36238,,,,,,,,,,,,,,,,,,,1999-12-31,F,,,,,01.1A,NAF1993,N,2.091022,46.466573,0.31,locality,Le Moulin Vieux 36160 Vigoulant,36238_b025,D,LE MOULIN VIEUX,
408989895,00011,40898989500011,O,1981-01-01,NN,,,2007-01-16T14:50:36,true,3,,,,,LES MOULIGNOUX,36160,VIGOULANT,,,36238,,,,,,,,,,,,,,,,,,,2005-01-16,F,,,,,01.1A,NAFRev1,N,2.083637,46.414826,0.73,locality,Les Brandes des Mouligoux 36160 Vigoulant,36238_b006,G,LES BRANDES DES MOULIGOUX,
412008716,00026,41200871600026,O,2009-09-01,,,3299ZE,2015-03-18T01:10:16,true,2,,,,,LE SEIGNANT,36160,VIGOULANT,,,36238,,,,,,,,,,,,,,,,,,,2014-12-30,F,,,,,32.99Z,NAFRev2,N,2.091022,46.466573,0.39,locality,Le Moulin Vieux 36160 Vigoulant,36238_b025,G,LE MOULIN VIEUX,
418625364,00017,41862536400017,O,1998-01-01,NN,,,2009-07-06T14:51:38,false,4,,,,,LA CROIX DES TERNES,36160,VIGOULANT,,,36238,,,,,,,,,,,,,,,,,,,2009-01-01,A,,,,,01.45Z,NAFRev2,N,2.0843,46.425683,0.31,locality,Les Brandes de la Goutte 36160 Vigoulant,36238_b004,G,LES BRANDES DE LA GOUTTE,
421259870,00010,42125987000010,O,1998-12-05,NN,,4312AZ,2019-04-13T03:43:57,true,3,,,,LD,CHASSIERES,36160,VIGOULANT,,,36238,,,,,,,,,,,,,,,,,,,2008-01-01,A,,,,,01.61Z,NAFRev2,N,4.2934557,44.5520442,0.73,poi.cemetery,(Cimetière) Chassiers,https://osm.org/way/121862533,G,,
425347507,00013,42534750700013,O,1998-01-01,NN,,,2008-01-05T01:15:15,true,3,,,,,,36160,VIGOULANT,,,36238,,,,,,,,,,,,,,,,,,,2008-01-01,A,,,,,01.11Z,NAFRev2,N,,,0,,,,,,
425347887,00019,42534788700019,O,1969-01-01,NN,,,2007-01-18T09:41:15,true,3,,,,,HERAT,36160,VIGOULANT,,,36238,,,,,,,,,,,,,,,,,,,2001-12-31,F,,,,,01.3Z,NAF1993,N,2.087789,46.426204,0.9,locality,Brandes d'Hérat 36160 Vigoulant,36238_b003,G,BRANDES D HERAT,
425347895,00012,42534789500012,O,1972-01-01,NN,,,,true,1,,,,,LA CROIX DES TERNES,36160,VIGOULANT,,,36238,,,,,,,,,,,,,,,,,,,2002-01-02,F,,,,,01.3Z,NAF1993,N,2.0843,46.425683,0.31,locality,Les Brandes de la Goutte 36160 Vigoulant,36238_b004,G,LES BRANDES DE LA GOUTTE,
430879445,00012,43087944500012,O,1993-11-29,NN,,,,true,3,,,,,LE BOURG,36160,VIGOULANT,,,36238,,,,,,,,,,,,,,,,,,,2000-12-31,F,,,,,70.2A,NAF1993,N,2.070224,46.437347,0.93,street,Le Bourg 36160 Vigoulant,36238_943bve,G,LE BOURG,
441895836,00019,44189583600019,O,1962-01-01,NN,,,2008-07-01T09:10:38,true,4,,,,,LA GRANDE GOUTTE,36160,VIGOULANT,,,36238,,,,,,,,,,,,,,,,,,,2008-04-17,F,,,,,01.50Z,NAFRev2,N,2.080093,46.421842,0.93,locality,La Grande Goutte 36160 Vigoulant,36238_b016,G,LA GRANDE GOUTTE,
442001582,00018,44200158200018,O,1995-12-31,NN,,,2018-08-16T08:10:00,true,3,,,,,LES COMBES,36160,VIGOULANT,,,36238,,,,,,,,,,,,,,,,,,,2008-01-01,A,,,,,01.43Z,NAFRev2,N,2.083637,46.414826,0.36,locality,Les Brandes des Mouligoux 36160 Vigoulant,36238_b006,G,LES BRANDES DES MOULIGOUX,
442001665,00011,44200166500011,O,1983-05-25,NN,,,2009-06-28T05:46:34,true,3,,,,,CHASSIERES,36160,VIGOULANT,,,36238,,,,,,,,,,,,,,,,,,,2006-09-30,F,,,,,01.3Z,NAFRev1,N,4.2934557,44.5520442,0.73,poi.cemetery,(Cimetière) Chassiers,https://osm.org/way/121862533,G,,
442032694,00014,44203269400014,O,1996-01-01,NN,,,2008-01-04T21:32:59,true,3,,,,,LE MERY,36160,VIGOULANT,,,36238,,,,,,,,,,,,,,,,,,,2008-01-01,A,,,,,01.50Z,NAFRev2,N,2.091022,46.466573,0.44,locality,Le Moulin Vieux 36160 Vigoulant,36238_b025,G,LE MOULIN VIEUX,
444234744,00019,44423474400019,O,2002-11-05,NN,,,2010-10-07T10:52:39,false,4,,,,,MONTERRAND,36160,VIGOULANT,,,36238,,,,,,,,,,,,,,,,,,,2010-08-31,F,,,,,68.20B,NAFRev2,N,2.083637,46.414826,0.33,locality,Les Brandes des Mouligoux 36160 Vigoulant,36238_b006,G,LES BRANDES DES MOULIGOUX,
453749590,00015,45374959000015,O,2004-06-01,NN,,,2008-01-05T03:10:49,true,3,,,,,LE MOULIN DE BARRE,36160,VIGOULANT,,,36238,,,,,,,,,,,,,,,,,,,2008-01-01,A,,,,,55.20Z,NAFRev2,N,2.080058,46.441335,0.8,locality,Moulin de Barre 36160 Vigoulant,36238_b022,G,MOULIN DE BARRE,
478119258,00026,47811925800026,O,2005-11-20,,,,2008-12-30T04:36:59,true,3,,,,,PUYBERTIER,36160,VIGOULANT,,,36238,,,,,,,,,,,,,,,,,,,2008-12-20,F,,,,,46.49Z,NAFRev2,O,,,0,,,,,,
479268369,00028,47926836900028,O,2011-03-15,,,,2013-11-15T11:47:21,false,2,CHEZ M ET MME HERZ,,,,PUYBERTIER,36160,VIGOULANT,,,36238,,,,,,,,,,,,,,,,,,,2013-11-09,F,,,,,96.09Z,NAFRev2,N,,,0,,,,,,
491940870,00018,49194087000018,O,2006-10-01,,,,2009-06-28T05:46:34,true,3,,,,LD,CHASSIERES,36160,VIGOULANT,,,36238,,,,,,,,,,,,,,,,,,,2009-01-01,A,,,,,01.45Z,NAFRev2,N,4.2934557,44.5520442,0.73,poi.cemetery,(Cimetière) Chassiers,https://osm.org/way/121862533,G,,
492633656,00011,49263365600011,O,2006-05-10,02,2017,,2019-06-24T13:27:41,true,3,,,,,LES MOULIGOUX,36160,VIGOULANT,,,36238,,,,,,,,,,,,,,,,,,,2008-01-01,A,,,,,90.01Z,NAFRev2,O,2.083637,46.414826,0.91,locality,Les Brandes des Mouligoux 36160 Vigoulant,36238_b006,G,LES BRANDES DES MOULIGOUX,
493911044,00011,49391104400011,O,2007-01-01,,,,2009-03-30T15:34:16,true,3,,,,LD,LA CHASSIERES,36160,VIGOULANT,,,36238,,,,,,,,,,,,,,,,,,,2008-12-31,F,,,,,01.50Z,NAFRev2,N,2.059262,46.435203,0.39,locality,Champ de la Couet 36160 Vigoulant,36238_b009,G,CHAMP DE LA COUET,
494630809,00015,49463080900015,O,2007-01-01,,,,2014-11-19T03:46:22,true,3,,,,,LES HERATS,36160,VIGOULANT,,,36238,,,,,,,,,,,,,,,,,,,2014-09-30,F,,,,,43.12A,NAFRev2,N,2.087789,46.426204,0.5,locality,Brandes d'Hérat 36160 Vigoulant,36238_b003,G,BRANDES D HERAT,
508625969,00011,50862596900011,O,1954-12-23,,,,2008-10-20T14:12:58,true,1,MAIRIE,,,,LE BOURG,36160,VIGOULANT,,,36238,,,,,,,,,,,,,,,,,,,1954-12-23,A,,,,,93.11Z,NAFRev2,N,2.070224,46.437347,0.93,street,Le Bourg 36160 Vigoulant,36238_943bve,G,LE BOURG,
509823795,00018,50982379500018,O,2009-01-01,,,,2009-09-25T05:09:14,true,1,,,,LD,CHASSIERES,36160,VIGOULANT,,,36238,,,,,,,,,,,,,,,,,,,2009-01-01,A,,,,,01.50Z,NAFRev2,N,4.2934557,44.5520442,0.73,poi.cemetery,(Cimetière) Chassiers,https://osm.org/way/121862533,G,,
510234479,00010,51023447900010,O,2009-02-16,,,,2009-07-31T04:41:20,true,2,,,,LD,LE MONTERRANT,36160,VIGOULANT,,,36238,,,,,,,,,,,,,,,,,,,2009-07-23,F,LE MONTERRANT,,,,01.50Z,NAFRev2,N,2.091022,46.466573,0.47,locality,Le Moulin Vieux 36160 Vigoulant,36238_b025,G,LE MOULIN VIEUX,
514013127,00014,51401312700014,O,2009-07-24,,,,2009-07-31T04:41:20,true,1,,,,LD,LE MONTERRANT,36160,VIGOULANT,,,36238,,,,,,,,,,,,,,,,,,,2009-07-24,A,,,,,01.50Z,NAFRev2,N,2.091022,46.466573,0.47,locality,Le Moulin Vieux 36160 Vigoulant,36238_b025,G,LE MOULIN VIEUX,
775232168,00010,77523216800010,O,,NN,,,,true,1,,,,LD,LE MERY,36160,VIGOULANT,,,36238,,,,,,,,,,,,,,,,,,,1992-06-30,F,,,,,45.4C,NAF1993,N,2.091022,46.466573,0.44,locality,Le Moulin Vieux 36160 Vigoulant,36238_b025,G,LE MOULIN VIEUX,
775232176,00013,77523217600013,O,,,,,,true,1,,,,LD,LE MERY,36160,VIGOULANT,,,36238,,,,,,,,,,,,,,,,,,,1988-08-31,F,,,,,55.72,NAP,N,2.091022,46.466573,0.44,locality,Le Moulin Vieux 36160 Vigoulant,36238_b025,G,LE MOULIN VIEUX,
798837431,00013,79883743100013,O,2014-01-01,,,,2013-12-03T03:46:13,true,1,,,,LD,CHASSIERES,36160,VIGOULANT,,,36238,,,,,,,,,,,,,,,,,,,2014-01-01,A,LE RUCHER DU BOISCHAUT-SUD,,,,01.49Z,NAFRev2,N,4.2934557,44.5520442,0.73,poi.cemetery,(Cimetière) Chassiers,https://osm.org/way/121862533,G,,
802174656,00016,80217465600016,O,2014-04-01,,,,2014-05-13T04:10:43,true,1,,,,LD,L'AIR,36160,VIGOULANT,,,36238,,,,,,,,,,,,,,,,,,,2014-04-01,A,,,,,01.42Z,NAFRev2,N,-1.0514061,46.0184468,0.88,poi.hotel,L'Air Marin (Hôtel) Yves,https://osm.org/node/3999884486,G,,
809121585,00016,80912158500016,O,2015-01-22,,,,2015-01-23T08:48:38,true,1,,,,,LE MONTERRANT,36160,VIGOULANT,,,36238,,,,,,,,,,,,,,,,,,,2015-01-22,A,,,,,86.90F,NAFRev2,N,2.091022,46.466573,0.47,locality,Le Moulin Vieux 36160 Vigoulant,36238_b025,G,LE MOULIN VIEUX,
810509067,00015,81050906700015,O,2015-03-20,,,4399CZ,2015-03-30T04:09:39,true,1,,,,,HERAT,36160,VIGOULANT,,,36238,,,,,,,,,,,,,,,,,,,2015-03-20,A,,,,,43.99C,NAFRev2,N,2.087789,46.426204,0.9,locality,Brandes d'Hérat 36160 Vigoulant,36238_b003,G,BRANDES D HERAT,
815912258,00010,81591225800010,O,,,,,,true,1,,,,LD,HERAT,36160,VIGOULANT,,,36238,,,,,,,,,,,,,,,,,,,1984-12-25,F,,,,,67.04,NAP,N,2.087789,46.426204,0.9,locality,Brandes d'Hérat 36160 Vigoulant,36238_b003,G,BRANDES D HERAT,
816110035,00010,81611003500010,O,,NN,,,,true,1,,,,LD,HERAT,36160,VIGOULANT,,,36238,,,,,,,,,,,,,,,,,,,,F,,,,,55.10,NAP,N,2.087789,46.426204,0.9,locality,Brandes d'Hérat 36160 Vigoulant,36238_b003,G,BRANDES D HERAT,
816513766,00013,81651376600013,O,,NN,,,,true,1,,,,,,36160,VIGOULANT,,,36238,,,,,,,,,,,,,,,,,,,1996-12-31,F,,,,,55.4A,NAF1993,N,,,0,,,,,,
816711410,00018,81671141000018,O,2005-07-01,NN,,,2008-01-05T03:31:05,true,3,,,,LD,CHASSIERES,36160,VIGOULANT,,,36238,,,,,,,,,,,,,,,,,,,2008-01-01,A,,,,,68.20B,NAFRev2,N,4.2934557,44.5520442,0.73,poi.cemetery,(Cimetière) Chassiers,https://osm.org/way/121862533,G,,
844757708,00012,84475770800012,O,2018-11-20,,,,2018-12-20T10:58:46,true,1,,,,,LE MOULIN GRAS,36160,VIGOULANT,,,36238,,,,,,,,,,,,,,,,,,,2018-11-20,A,,,,,85.51Z,NAFRev2,N,2.098607,46.464021,0.93,locality,Le Moulin Gras 36160 Vigoulant,36238_b024,G,LE MOULIN GRAS,
844936997,00015,84493699700015,O,2018-11-20,,,,2019-01-03T08:22:29,true,1,,,,,LE MOULIN GRAS,36160,VIGOULANT,,,36238,,,,,,,,,,,,,,,,,,,2018-11-20,A,,,,,55.20Z,NAFRev2,N,2.098607,46.464021,0.93,locality,Le Moulin Gras 36160 Vigoulant,36238_b024,G,LE MOULIN GRAS,
