siren,nic,siret,statutDiffusionEtablissement,dateCreationEtablissement,trancheEffectifsEtablissement,anneeEffectifsEtablissement,activitePrincipaleRegistreMetiersEtablissement,dateDernierTraitementEtablissement,etablissementSiege,nombrePeriodesEtablissement,complementAdresseEtablissement,numeroVoieEtablissement,indiceRepetitionEtablissement,typeVoieEtablissement,libelleVoieEtablissement,codePostalEtablissement,libelleCommuneEtablissement,libelleCommuneEtrangerEtablissement,distributionSpecialeEtablissement,codeCommuneEtablissement,codeCedexEtablissement,libelleCedexEtablissement,codePaysEtrangerEtablissement,libellePaysEtrangerEtablissement,complementAdresse2Etablissement,numeroVoie2Etablissement,indiceRepetition2Etablissement,typeVoie2Etablissement,libelleVoie2Etablissement,codePostal2Etablissement,libelleCommune2Etablissement,libelleCommuneEtranger2Etablissement,distributionSpeciale2Etablissement,codeCommune2Etablissement,codeCedex2Etablissement,libelleCedex2Etablissement,codePaysEtranger2Etablissement,libellePaysEtranger2Etablissement,dateDebut,etatAdministratifEtablissement,enseigne1Etablissement,enseigne2Etablissement,enseigne3Etablissement,denominationUsuelleEtablissement,activitePrincipaleEtablissement,nomenclatureActivitePrincipaleEtablissement,caractereEmployeurEtablissement,longitude,latitude,geo_score,geo_type,geo_adresse,geo_id,geo_ligne,geo_l4,geo_l5
213901804,00012,21390180400012,O,1983-03-01,11,2017,,2019-06-24T13:10:31,true,4,,,,RTE,D'ORGELET,39270,CRESSIA,,,39180,,,,,,,,,,,,,,,,,,,2008-01-01,A,MAIRIE,,,,84.11Z,NAFRev2,O,5.486568,46.526055,0.8,locality,Route d'Orgelet 39270 Cressia,39180_0100,G,ROUTE D ORGELET,
213901804,00020,21390180400020,O,1983-12-21,NN,,,2006-10-26T23:40:53,false,3,,,,,,39270,CRESSIA,,,39180,,,,,,,,,,,,,,,,,,,2005-09-01,F,ECOLE PRIMAIRE PUBLIQUE,,,,80.1Z,NAFRev1,N,,,0,,,,,,
213901804,00038,21390180400038,O,1995-01-01,NN,,,2018-06-15T09:31:52,false,4,MAIRIE,,,,,39270,CRESSIA,,,39180,,,,,,,,,,,,,,,,,,,2018-01-01,F,SERVICE EAU ET ASSAINISSEMENT,,,,36.00Z,NAFRev2,N,,,0,,,,,,
263901803,00019,26390180300019,O,1983-03-01,NN,,,2006-04-18T17:36:07,true,3,,,,,MAIRIE,39270,CRESSIA,,,39180,,,,,,,,,,,,,,,,,,,2002-01-01,F,CCAS,,,,85.3K,NAF1993,N,3.0709671,50.6304695,0.92,poi.townhall,Hôtel de Ville Lille,https://osm.org/way/40917078,G,,
293907648,00019,29390764800019,O,1998-07-06,NN,,,2011-06-17T14:03:07,true,3,MAIRIE,,,RTE,D'ORGELET,39270,CRESSIA,,,39180,,,,,,,,,,,,,,,,,,,2008-01-01,A,,,,,42.99Z,NAFRev2,N,5.486568,46.526055,0.8,locality,Route d'Orgelet 39270 Cressia,39180_0100,G,ROUTE D ORGELET,
307005371,00017,30700537100017,O,,,,,,true,1,,,,,,39270,CRESSIA,,,39180,,,,,,,,,,,,,,,,,,,1984-12-25,F,,,,,56.02,NAP,N,,,0,,,,,,
310326582,00015,31032658200015,O,1975-01-01,02,2017,,2019-06-24T13:17:08,false,5,,,,,,39270,CRESSIA,,,39180,,,,,,,,,,,,,,,,,,,2018-01-12,F,,,,,49.41A,NAFRev2,O,,,0,,,,,,
313695744,00018,31369574400018,O,1978-01-01,NN,,,2007-01-18T09:13:08,true,3,,,,,,39270,CRESSIA,,,39180,,,,,,,,,,,,,,,,,,,1998-12-25,F,,,,,01.1A,NAF1993,N,,,0,,,,,,
317161479,00017,31716147900017,O,,NN,,,,true,1,,,,,,39270,CRESSIA,,,39180,,,,,,,,,,,,,,,,,,,,F,,,,,55.73,NAP,N,,,0,,,,,,
319069720,00039,31906972000039,O,2014-03-11,,,,2017-10-04T11:24:21,true,2,,,,CHE,DE LA FRUITIERE,39270,CRESSIA,,,39180,,,,,,,,,,,,,,,,,,,2017-03-20,F,,,,,33.12Z,NAFRev2,N,5.482208,46.526808,0.84,locality,Chemin de la Fruitière 39270 Cressia,39180_0060,G,CHEMIN DE LA FRUITIERE,
321739161,00032,32173916100032,O,2011-08-16,,,,2017-03-29T17:47:54,true,2,,,,RUE,DU CHATEAU,39270,CRESSIA,,,39180,,,,,,,,,,,,,,,,,,,2017-03-31,F,,,,,02.20Z,NAFRev2,N,5.482892,46.521406,0.93,locality,Rue du Château 39270 Cressia,39180_0030,G,RUE DU CHATEAU,
323383117,00013,32338311700013,O,1981-01-01,NN,,,2010-08-11T15:56:00,true,4,,,,,AU BOURG,39270,CRESSIA,,,39180,,,,,,,,,,,,,,,,,,,2009-12-25,F,,,,,68.20B,NAFRev2,N,5.506211,46.537729,0.3,locality,Rue du Bois Rouillot 39270 Cressia,39180_0005,G,RUE DU BOIS ROUILLOT,
325387058,00010,32538705800010,O,,NN,,,,true,1,,,,,,39270,CRESSIA,,,39180,,,,,,,,,,,,,,,,,,,1992-08-31,F,,,,,55.1A,NAF1993,N,,,0,,,,,,
333148690,00014,33314869000014,O,1985-07-01,NN,,,2015-12-02T04:31:43,true,3,,,,LD,LE CHATEAU,39270,CRESSIA,,,39180,,,,,,,,,,,,,,,,,,,2008-01-01,A,,,,,68.20B,NAFRev2,N,5.482892,46.521406,0.67,locality,Rue du Château 39270 Cressia,39180_0030,G,RUE DU CHATEAU,
333794667,00050,33379466700050,O,2019-01-01,,,3109BB,2019-02-20T11:33:14,true,1,LA PERIERE,,,RTE,DE SERANS,39270,CRESSIA,,,39180,,,,,,,,,,,,,,,,,,,2019-01-01,A,,,,SCULPTURE GENERALE,31.09B,NAFRev2,N,5.489701,46.531496,0.61,locality,Route des Serrans 39270 Cressia,39180_0150,G,ROUTE DES SERRANS,
333953784,00019,33395378400019,O,1985-10-01,02,2017,,2019-06-24T13:27:37,true,4,,,,,AU CHATEAU,39270,CRESSIA,,,39180,,,,,,,,,,,,,,,,,,,2008-01-01,A,,,,,85.31Z,NAFRev2,O,5.482892,46.521406,0.82,locality,Rue du Château 39270 Cressia,39180_0030,G,RUE DU CHATEAU,
333953784,00035,33395378400035,O,1986-09-01,NN,,,2008-01-04T20:45:15,false,3,CHATEAU DE CRESSIA,,,,,39270,CRESSIA,,,39180,,,,,,,,,,,,,,,,,,,2008-01-01,A,ECOLE PRIVEE CYCLE LONG,,,,85.31Z,NAFRev2,N,5.482892,46.521406,0.73,locality,Rue du Château 39270 Cressia,39180_0030,D,RUE DU CHATEAU,
333953784,00043,33395378400043,O,1986-09-01,NN,,,2008-01-04T20:45:15,false,3,CHATEAU DE CRESSIA,,,,,39270,CRESSIA,,,39180,,,,,,,,,,,,,,,,,,,2008-01-01,A,ECOLE PRIMAIRE PRIVEE,,,,85.20Z,NAFRev2,N,5.482892,46.521406,0.73,locality,Rue du Château 39270 Cressia,39180_0030,D,RUE DU CHATEAU,
334660248,00017,33466024800017,O,1985-01-01,NN,,,2007-11-07T10:26:41,false,3,,,,,,39270,CRESSIA,,,39180,,,,,,,,,,,,,,,,,,,2006-12-31,F,,,,,60.2B,NAFRev1,N,,,0,,,,,,
334660248,00025,33466024800025,O,1999-01-01,NN,,,2010-06-11T08:45:03,true,4,,,,,,39270,CRESSIA,,,39180,,,,,,,,,,,,,,,,,,,2008-03-31,F,,,,,01.41Z,NAFRev2,N,,,0,,,,,,
334666336,00014,33466633600014,O,1986-01-01,NN,,,2012-01-04T11:21:48,true,3,,,,,,39270,CRESSIA,,,39180,,,,,,,,,,,,,,,,,,,2008-01-01,A,,,,,01.41Z,NAFRev2,N,,,0,,,,,,
339981821,00012,33998182100012,O,1987-01-19,NN,,,2018-11-17T04:14:59,true,5,,,,,LA PERRIERE,39270,CRESSIA,,,39180,,,,,,,,,,,,,,,,,,,2008-01-01,F,,,,,01.42Z,NAFRev2,N,5.482208,46.526808,0.46,locality,Chemin de la Fruitière 39270 Cressia,39180_0060,G,CHEMIN DE LA FRUITIERE,
351879861,00034,35187986100034,O,1994-06-10,NN,,,2010-08-07T15:26:14,false,4,,,,RTE,SE ST JULIEN,39270,CRESSIA,,,39180,,,,,,,,,,,,,,,,,,,2010-06-03,F,,,,,71.12B,NAFRev2,N,5.478783,46.527304,0.59,locality,Route de Saint Julien 39270 Cressia,39180_0125,G,ROUTE DE SAINT JULIEN,
353386857,00026,35338685700026,O,2016-03-31,01,2017,1629ZA,2019-09-01T20:02:59,true,1,,,,CHE,DU CHAMP GUERIN,39270,CRESSIA,,,39180,,,,,,,,,,,,,,,,,,,2016-03-31,A,,,,,16.29Z,NAFRev2,N,5.489632,46.528354,0.7,locality,Chemin du Champ Guirin 39270 Cressia,39180_0025,G,CHEMIN DU CHAMP GUIRIN,
378290829,00019,37829082900019,O,,NN,,,,true,1,,,,,,39270,CRESSIA,,,39180,,,,,,,,,,,,,,,,,,,1993-05-30,F,,,,,51.2E,NAF1993,N,,,0,,,,,,
380250076,00029,38025007600029,O,1992-01-30,NN,,,2008-01-04T21:40:18,false,3,,,,,,39270,CRESSIA,,,39180,,,,,,,,,,,,,,,,,,,2008-01-01,A,,,,,49.41A,NAFRev2,N,,,0,,,,,,
388582934,00013,38858293400013,O,1992-09-01,NN,,,,false,4,,,,,,39270,CRESSIA,,,39180,,,,,,,,,,,,,,,,,,,2001-11-30,F,,,,,55.1A,NAF1993,N,,,0,,,,,,
388582934,00021,38858293400021,O,1992-09-01,NN,,,2008-01-04T23:11:31,true,3,,,,,,39270,CRESSIA,,,39180,,,,,,,,,,,,,,,,,,,2008-01-01,A,,,,,01.43Z,NAFRev2,N,,,0,,,,,,
392836649,00013,39283664900013,O,1993-09-01,NN,,,2016-02-26T05:25:36,true,4,,,,,,39270,CRESSIA,,,39180,,,,,,,,,,,,,,,,,,,2015-12-31,F,,,,,90.03B,NAFRev2,N,,,0,,,,,,
393315718,00014,39331571800014,O,1994-01-03,NN,,,2010-09-09T05:17:25,true,3,,,,,LA PERRIERE,39270,CRESSIA,,,39180,,,,,,,,,,,,,,,,,,,2008-01-01,A,,,,,68.20B,NAFRev2,N,5.482208,46.526808,0.46,locality,Chemin de la Fruitière 39270 Cressia,39180_0060,G,CHEMIN DE LA FRUITIERE,
393581095,00014,39358109500014,O,1993-01-01,NN,,,2011-04-23T08:19:28,true,3,,,,,LA PERRIERE,39270,CRESSIA,,,39180,,,,,,,,,,,,,,,,,,,2008-01-01,A,,,,,46.23Z,NAFRev2,N,5.482208,46.526808,0.46,locality,Chemin de la Fruitière 39270 Cressia,39180_0060,G,CHEMIN DE LA FRUITIERE,
393581095,00022,39358109500022,O,2018-02-19,,,,2018-05-07T14:35:04,false,1,LA PERRIERE,,,,,39270,CRESSIA,,,39180,,,,,,,,,,,,,,,,,,,2018-02-19,F,,,,,01.49Z,NAFRev2,N,5.482208,46.526808,0.46,locality,Chemin de la Fruitière 39270 Cressia,39180_0060,D,CHEMIN DE LA FRUITIERE,
393826029,00026,39382602900026,O,2015-11-04,,,8129BP,2016-07-03T03:30:10,true,2,,,,RUE,DU CHAMP DE FOIRE,39270,CRESSIA,,,39180,,,,,,,,,,,,,,,,,,,2016-06-14,F,,,,,81.29B,NAFRev2,N,5.480786,46.526038,0.93,locality,Rue du Champ de Foire 39270 Cressia,39180_0020,G,RUE DU CHAMP DE FOIRE,
394124630,00010,39412463000010,O,1990-01-01,NN,,,2008-01-04T18:00:14,true,3,,,,,,39270,CRESSIA,,,39180,,,,,,,,,,,,,,,,,,,2008-01-01,A,,,,,01.41Z,NAFRev2,N,,,0,,,,,,
394261515,00016,39426151500016,O,1994-01-01,01,2017,,2019-06-24T13:20:02,true,4,,,,,LES RIPPES,39270,CRESSIA,,,39180,,,,,,,,,,,,,,,,,,,2014-12-31,A,,,,,01.41Z,NAFRev2,O,5.511958,46.539377,0.63,locality,Rippes des Vincents 39270 Cressia,39180_a010,G,RIPPES DES VINCENTS,
398231571,00017,39823157100017,O,1994-07-01,02,2017,1629ZA,2019-06-24T13:21:37,true,4,LA PERRIERE,,,CHE,DU CHAMP GUERIN,39270,CRESSIA,,,39180,,,,,,,,,,,,,,,,,,,2008-01-01,A,,,,,16.29Z,NAFRev2,O,5.489632,46.528354,0.7,locality,Chemin du Champ Guirin 39270 Cressia,39180_0025,G,CHEMIN DU CHAMP GUIRIN,
400920864,00016,40092086400016,O,1995-05-04,NN,,,2018-05-17T03:59:31,true,3,MAIRIE,,,,,39270,CRESSIA,,,39180,,,,,,,,,,,,,,,,,,,2008-01-01,A,,,,,77.31Z,NAFRev2,N,,,0,,,,,,
407892884,00013,40789288400013,O,1996-06-01,NN,,,2018-04-17T03:57:32,true,3,,,,,,39270,CRESSIA,,,39180,,,,,,,,,,,,,,,,,,,2008-01-01,A,,,,,01.42Z,NAFRev2,N,,,0,,,,,,
407985290,00011,40798529000011,O,1996-07-04,NN,,,2008-11-08T01:19:23,true,4,LA CROCHERE,,,CHE,DE LA FORET,39270,CRESSIA,,,39180,,,,,,,,,,,,,,,,,,,1999-12-10,F,,,,,36.2C,NAF1993,O,5.483179,46.520119,0.82,locality,Chemin de la Forêt 39270 Cressia,39180_0055,G,CHEMIN DE LA FORET,
409929007,00014,40992900700014,O,1982-12-31,NN,,,,true,1,,,,,,39270,CRESSIA,,,39180,,,,,,,,,,,,,,,,,,,1998-12-31,F,,,,,01.1A,NAF1993,N,,,0,,,,,,
409929015,00017,40992901500017,O,1988-12-31,NN,,,2016-01-12T00:18:13,true,3,,,,,LES RIPPES,39270,CRESSIA,,,39180,,,,,,,,,,,,,,,,,,,2008-01-01,A,,,,,01.41Z,NAFRev2,N,5.511958,46.539377,0.63,locality,Rippes des Vincents 39270 Cressia,39180_a010,G,RIPPES DES VINCENTS,
409929023,00011,40992902300011,O,1984-12-31,NN,,,2008-01-04T21:34:09,true,3,,,,,LES RIPPES,39270,CRESSIA,,,39180,,,,,,,,,,,,,,,,,,,2008-01-01,A,,,,,01.43Z,NAFRev2,N,5.511958,46.539377,0.63,locality,Rippes des Vincents 39270 Cressia,39180_a010,G,RIPPES DES VINCENTS,
409929031,00014,40992903100014,O,1996-09-01,NN,,,,true,1,,,,,,39270,CRESSIA,,,39180,,,,,,,,,,,,,,,,,,,2000-04-30,F,,,,,01.1A,NAF1993,N,,,0,,,,,,
411335391,00016,41133539100016,O,1982-12-31,NN,,,,true,4,,,,,,39270,CRESSIA,,,39180,,,,,,,,,,,,,,,,,,,2001-12-31,F,,,,,01.1A,NAF1993,N,,,0,,,,,,
412437279,00067,41243727900067,O,2012-01-01,,,,2016-06-01T08:37:46,false,1,,1,,RTE,DU CHATEAU,39270,CRESSIA,,,39180,,,,,,,,,,,,,,,,,,,2012-01-01,A,,,,,68.20A,NAFRev2,N,5.482892,46.521406,0.68,locality,Rue du Château 39270 Cressia,39180_0030,G,RUE DU CHATEAU,
428025266,00019,42802526600019,O,1968-01-01,NN,,,2008-01-05T01:21:30,true,3,,,,,,39270,CRESSIA,,,39180,,,,,,,,,,,,,,,,,,,2008-01-01,A,,,,,01.41Z,NAFRev2,N,,,0,,,,,,
428026108,00012,42802610800012,O,,,,,,true,1,,,,,,39270,CRESSIA,,,39180,,,,,,,,,,,,,,,,,,,1985-01-01,F,,,,,01.3Z,NAF1993,N,,,0,,,,,,
428151989,00012,42815198900012,O,1994-01-01,NN,,,2008-01-05T01:22:56,true,3,,,,,,39270,CRESSIA,,,39180,,,,,,,,,,,,,,,,,,,2008-01-01,A,,,,,94.91Z,NAFRev2,N,,,0,,,,,,
429308158,00014,42930815800014,O,2000-02-01,NN,,,2013-05-18T02:43:44,true,5,,,,,,39270,CRESSIA,,,39180,,,,,,,,,,,,,,,,,,,2011-12-31,F,,,,,46.77Z,NAFRev2,O,,,0,,,,,,
431270941,00013,43127094100013,O,1997-12-01,NN,,,2008-01-04T18:05:46,true,3,,,,CHE,DE LA FORET,39270,CRESSIA,,,39180,,,,,,,,,,,,,,,,,,,2008-01-01,A,,,,,68.20B,NAFRev2,N,5.483179,46.520119,0.82,locality,Chemin de la Forêt 39270 Cressia,39180_0055,G,CHEMIN DE LA FORET,
431448521,00010,43144852100010,O,2000-04-01,NN,,1629ZA,2014-06-27T00:16:53,true,5,LA PERRIERE,,,CHE,DU CHAMP GUERIN,39270,CRESSIA,,,39180,,,,,,,,,,,,,,,,,,,2010-06-28,A,,,,,77.39Z,NAFRev2,N,5.489632,46.528354,0.7,locality,Chemin du Champ Guirin 39270 Cressia,39180_0025,G,CHEMIN DU CHAMP GUIRIN,
435006507,00014,43500650700014,O,2001-05-01,NN,,,2006-11-25T17:20:09,false,4,,,,,,39270,CRESSIA,,,39180,,,,,,,,,,,,,,,,,,,2004-06-15,F,,,,,92.3A,NAFRev1,O,,,0,,,,,,
440201317,00011,44020131700011,O,2001-12-01,NN,,,2006-11-25T17:41:15,true,3,,,,,,39270,CRESSIA,,,39180,,,,,,,,,,,,,,,,,,,2005-03-31,F,,,,,55.1A,NAFRev1,N,,,0,,,,,,
481041630,00015,48104163000015,O,2003-01-02,NN,,,2008-01-05T00:20:03,true,3,,,,,,39270,CRESSIA,,,39180,,,,,,,,,,,,,,,,,,,2008-01-01,A,,,,,94.99Z,NAFRev2,N,,,0,,,,,,
482000908,00012,48200090800012,O,2005-04-01,,,,2011-06-17T08:29:58,true,3,,,,,,39270,CRESSIA,,,39180,,,,,,,,,,,,,,,,,,,2010-05-31,F,,,,,55.10Z,NAFRev2,N,,,0,,,,,,
482512910,00019,48251291000019,O,2005-05-01,NN,,,2015-01-22T11:19:05,true,5,,,,,LES SERANS,39270,CRESSIA,,,39180,,,,,,,,,,,,,,,,,,,2011-11-13,A,LES SERANS,,,,55.20Z,NAFRev2,O,5.489701,46.531496,0.67,locality,Route des Serrans 39270 Cressia,39180_0150,G,ROUTE DES SERRANS,
482512910,00027,48251291000027,O,2015-01-01,00,2017,,2019-06-24T13:18:25,false,2,LES SERANS,,,,,39270,CRESSIA,,,39180,,,,,,,,,,,,,,,,,,,2015-01-01,A,LES SERANS,,,,01.47Z,NAFRev2,O,5.489701,46.531496,0.67,locality,Route des Serrans 39270 Cressia,39180_0150,D,ROUTE DES SERRANS,
482955374,00020,48295537400020,O,2016-10-01,,,,2018-02-13T04:11:33,true,2,,,,RUE,DE LA FONTAINE,39270,CRESSIA,,,39180,,,,,,,,,,,,,,,,,,,2017-11-30,F,,,,,45.32Z,NAFRev2,N,5.478661,46.528148,0.93,locality,Rue de la Fontaine 39270 Cressia,39180_0050,G,RUE DE LA FONTAINE,
483090361,00013,48309036100013,O,2005-02-03,,,,2008-01-05T21:51:07,true,2,,,,RUE,DE LA FRUITIERE,39270,CRESSIA,,,39180,,,,,,,,,,,,,,,,,,,2008-01-01,A,,,,,68.20B,NAFRev2,N,5.482208,46.526808,0.75,locality,Chemin de la Fruitière 39270 Cressia,39180_0060,G,CHEMIN DE LA FRUITIERE,
483672119,00011,48367211900011,O,2005-09-01,,,4332AA,2014-06-27T00:20:44,true,2,LA PERRIERE,,,IMP,DES ECOLIERS,39270,CRESSIA,,,39180,,,,,,,,,,,,,,,,,,,2008-01-01,A,,,,,43.32A,NAFRev2,N,5.485484,46.526962,0.82,locality,Impasse des Ecoliers 39270 Cressia,39180_0045,G,IMPASSE DES ECOLIERS,
484717046,00029,48471704600029,O,2009-09-15,,,,2019-09-20T03:47:37,true,3,,,,CHE,DE LA FRUITIERE,39270,CRESSIA,,,39180,,,,,,,,,,,,,,,,,,,2019-04-01,F,,,,,38.32Z,NAFRev2,N,5.482208,46.526808,0.84,locality,Chemin de la Fruitière 39270 Cressia,39180_0060,G,CHEMIN DE LA FRUITIERE,
484717046,00037,48471704600037,O,2018-03-26,,,,2019-09-20T03:47:37,false,2,,,,RTE,DE LONS,39270,CRESSIA,,,39180,,,,,,,,,,,,,,,,,,,2019-04-01,F,,,,,46.77Z,NAFRev2,N,5.479558,46.529346,0.93,locality,Rte de Lons 39270 Cressia,39180_0080,G,RTE DE LONS,
491197877,00013,49119787700013,O,2006-07-24,,,,2008-11-08T03:05:28,true,2,,,,RTE,DE COUSANCE,39270,CRESSIA,,,39180,,,,,,,,,,,,,,,,,,,2007-10-01,F,,,,,74.8F,NAFRev1,N,5.477005,46.529404,0.82,street,Route de Cousance 39270 Cressia,39180_0040,G,ROUTE DE COUSANCE,
497656934,00013,49765693400013,O,2007-04-01,01,2017,,2019-06-24T13:31:11,true,2,LES RIPPES,,,,,39270,CRESSIA,,,39180,,,,,,,,,,,,,,,,,,,2008-01-01,A,,,,,01.42Z,NAFRev2,N,5.511958,46.539377,0.63,locality,Rippes des Vincents 39270 Cressia,39180_a010,D,RIPPES DES VINCENTS,
498194521,00015,49819452100015,O,2006-01-01,,,,2016-01-12T00:27:20,true,2,,,,RUE,DU CHAMP DE FOIRE,39270,CRESSIA,,,39180,,,,,,,,,,,,,,,,,,,2008-01-01,A,,,,,02.20Z,NAFRev2,N,5.480786,46.526038,0.93,locality,Rue du Champ de Foire 39270 Cressia,39180_0020,G,RUE DU CHAMP DE FOIRE,
504277690,00013,50427769000013,O,2007-01-01,,,,2016-01-12T00:27:53,true,1,,59,,LD,AU VILLAGE,39270,CRESSIA,,,39180,,,,,,,,,,,,,,,,,,,2007-01-01,A,,,,,02.20Z,NAFRev2,N,-1.6854522,47.8876296,0.9,poi.cafe,Au Village (Café) Poligné,https://osm.org/node/4456269839,G,,
504372327,00016,50437232700016,O,2008-06-01,,,,2014-10-06T08:52:37,true,2,LA PERRIERE,,,,,39270,CRESSIA,,,39180,,,,,,,,,,,,,,,,,,,2014-09-20,F,,,,,70.22Z,NAFRev2,N,5.482208,46.526808,0.46,locality,Chemin de la Fruitière 39270 Cressia,39180_0060,D,CHEMIN DE LA FRUITIERE,
507550911,00014,50755091100014,O,2000-03-01,,,,2008-08-06T14:10:20,true,1,MAIRIE,,,RUE,ORGELET,39270,CRESSIA,,,39180,,,,,,,,,,,,,,,,,,,2000-03-01,A,,,,,94.99Z,NAFRev2,N,5.486568,46.526055,0.63,locality,Route d'Orgelet 39270 Cressia,39180_0100,G,ROUTE D ORGELET,
511578320,00018,51157832000018,O,2009-04-06,,,,2013-12-18T03:44:25,true,2,HAM DE LA PERRIERE,5110,,RTE,DE LA CONDAMINE,39270,CRESSIA,,,39180,,,,,,,,,,,,,,,,,,,2013-12-31,F,,,,,49.41B,NAFRev2,N,5.48649,46.525577,0.69,locality,Route de la Condamine 39270 Cressia,39180_0035,G,ROUTE DE LA CONDAMINE,
513177071,00018,51317707100018,O,2009-05-13,,,,2012-11-10T00:59:44,false,2,,,,RUE,BOIS ROUILLOT,39270,CRESSIA,,,39180,,,,,,,,,,,,,,,,,,,2009-08-24,F,,,,,47.99A,NAFRev2,N,5.506211,46.537729,0.88,locality,Rue du Bois Rouillot 39270 Cressia,39180_0005,G,RUE DU BOIS ROUILLOT,
521321729,00019,52132172900019,O,2010-03-17,,,,2019-12-03T14:32:17,false,2,,,,,LES RIPPES,39270,CRESSIA,,,39180,,,,,,,,,,,,,,,,,,,2011-04-24,F,,,,,66.22Z,NAFRev2,N,5.511958,46.539377,0.63,locality,Rippes des Vincents 39270 Cressia,39180_a010,G,RIPPES DES VINCENTS,
521321729,00027,52132172900027,O,2019-12-01,,,8219ZP,2020-02-06T04:09:39,true,1,,,,RUE,DE LA SELLIERE,39270,CRESSIA,,,39180,,,,,,,,,,,,,,,,,,,2019-12-01,A,,,,,47.91A,NAFRev2,N,5.506566,46.536265,0.7,locality,Rue de la Seillère 39270 Cressia,39180_0140,G,RUE DE LA SEILLERE,
532986437,00012,53298643700012,O,2011-06-01,NN,,,2014-02-21T14:53:52,true,5,,,,,LE VILLAGE,39270,CRESSIA,,,39180,,,,,,,,,,,,,,,,,,,2013-06-28,F,,,,,56.10A,NAFRev2,N,2.2950702,48.9311749,0.9,poi.bar,bar le village Gennevilliers,https://osm.org/node/3287755128,G,,
538143769,00023,53814376900023,O,2018-08-20,,,,2019-05-23T03:57:39,true,1,,,,RTE,DES SERANS,39270,CRESSIA,,,39180,,,,,,,,,,,,,,,,,,,2018-08-20,A,,,,,47.91A,NAFRev2,N,5.489701,46.531496,0.75,locality,Route des Serrans 39270 Cressia,39180_0150,G,ROUTE DES SERRANS,
538660663,00013,53866066300013,O,2012-01-01,,,,2012-04-30T02:33:15,true,1,LA PERRIERE,,,,,39270,CRESSIA,,,39180,,,,,,,,,,,,,,,,,,,2012-01-01,A,,,,,01.41Z,NAFRev2,N,5.482208,46.526808,0.46,locality,Chemin de la Fruitière 39270 Cressia,39180_0060,D,CHEMIN DE LA FRUITIERE,
645440280,00016,64544028000016,O,,,,,,true,1,,,,,,39270,CRESSIA,,,39180,,,,,,,,,,,,,,,,,,,1996-10-31,F,,,,,70.2C,NAF1993,N,,,0,,,,,,
646750331,00019,64675033100019,O,,,,,,true,1,,,,,,39270,CRESSIA,,,39180,,,,,,,,,,,,,,,,,,,,F,,,,,84.05,NAP,N,,,0,,,,,,
646950238,00014,64695023800014,O,,NN,,,,true,1,,,,,,39270,CRESSIA,,,39180,,,,,,,,,,,,,,,,,,,1992-09-30,F,,,,,51.3J,NAF1993,N,,,0,,,,,,
750358392,00017,75035839200017,O,2012-03-09,,,,2013-10-01T08:41:28,true,1,,,,,LA PERRIERE,39270,CRESSIA,,,39180,,,,,,,,,,,,,,,,,,,2012-03-09,A,,,,,70.10Z,NAFRev2,N,5.482208,46.526808,0.46,locality,Chemin de la Fruitière 39270 Cressia,39180_0060,G,CHEMIN DE LA FRUITIERE,
751875964,00015,75187596400015,O,2012-06-01,,,3109BA,2015-03-18T01:36:32,false,2,LA CROCHERE,,,RUE,DU CHATEAU,39270,CRESSIA,,,39180,,,,,,,,,,,,,,,,,,,2015-01-01,F,,,,EBENISTERIE CONTEMPORAINE,31.09B,NAFRev2,N,5.482892,46.521406,0.93,locality,Rue du Château 39270 Cressia,39180_0030,G,RUE DU CHATEAU,
751875964,00023,75187596400023,O,2015-01-01,,,3109BA,2015-01-22T16:17:18,true,1,HAMEAU LA PERRIERE,,,CHE,DU CHAMP GUERIN,39270,CRESSIA,,,39180,,,,,,,,,,,,,,,,,,,2015-01-01,A,,,,FIBRES EBENISTES,31.09B,NAFRev2,N,5.489632,46.528354,0.7,locality,Chemin du Champ Guirin 39270 Cressia,39180_0025,G,CHEMIN DU CHAMP GUIRIN,
752958207,00017,75295820700017,O,2011-05-09,,,,2012-07-25T14:38:14,true,1,,,,,LES SERANS,39270,CRESSIA,,,39180,,,,,,,,,,,,,,,,,,,2011-05-09,A,,,,,94.99Z,NAFRev2,N,5.489701,46.531496,0.67,locality,Route des Serrans 39270 Cressia,39180_0150,G,ROUTE DES SERRANS,
778376780,00012,77837678000012,O,1900-01-01,NN,,,2006-11-25T22:10:13,true,3,,,,,,39270,CRESSIA,,,39180,,,,,,,,,,,,,,,,,,,1998-12-25,F,,,,,92.6C,NAF1993,N,,,0,,,,,,
778376798,00014,77837679800014,O,,NN,,,,true,1,,,,,,39270,CRESSIA,,,39180,,,,,,,,,,,,,,,,,,,1993-06-30,F,,,,,29.3D,NAF1993,N,,,0,,,,,,
778376806,00015,77837680600015,O,1900-01-01,NN,,,,true,3,,,,,,39270,CRESSIA,,,39180,,,,,,,,,,,,,,,,,,,2000-12-31,F,,,,,70.2C,NAF1993,N,,,0,,,,,,
778376822,00012,77837682200012,O,,NN,,,,true,1,,,,,,39270,CRESSIA,,,39180,,,,,,,,,,,,,,,,,,,1990-06-30,F,,,,,55.71,NAP,N,,,0,,,,,,
778376848,00017,77837684800017,O,1970-01-01,NN,,,2010-06-18T16:33:23,true,4,BOIS,,,HAM,LA PERRIERE,39270,CRESSIA,,,39180,,,,,,,,,,,,,,,,,,,2008-07-22,F,,,,,68.20B,NAFRev2,N,5.482208,46.526808,0.46,locality,Chemin de la Fruitière 39270 Cressia,39180_0060,G,CHEMIN DE LA FRUITIERE,
778376863,00016,77837686300016,O,1900-01-01,NN,,,2008-01-05T03:07:32,true,3,,,,,,39270,CRESSIA,,,39180,,,,,,,,,,,,,,,,,,,2008-01-01,A,,,,,94.91Z,NAFRev2,N,,,0,,,,,,
778376871,00019,77837687100019,O,1900-01-01,NN,,,2008-01-05T03:07:33,true,3,,,,,,39270,CRESSIA,,,39180,,,,,,,,,,,,,,,,,,,2008-01-01,A,,,,,93.12Z,NAFRev2,N,,,0,,,,,,
781602776,00010,78160277600010,O,,,,,,true,1,,,,,,39270,CRESSIA,,,39180,,,,,,,,,,,,,,,,,,,1984-12-25,F,,,,,67.04,NAP,N,,,0,,,,,,
789319415,00012,78931941500012,O,2012-10-12,NN,,,2017-05-04T08:58:59,true,4,,,,RTE,DE LA FRUITIERE,39270,CRESSIA,,,39180,,,,,,,,,,,,,,,,,,,2015-02-20,A,,,,,56.10A,NAFRev2,N,5.482208,46.526808,0.75,locality,Chemin de la Fruitière 39270 Cressia,39180_0060,G,CHEMIN DE LA FRUITIERE,
791885262,00018,79188526200018,O,2013-03-18,,,,2020-06-25T04:07:21,false,2,,,,,LES LAURIERS,39270,CRESSIA,,,39180,,,,,,,,,,,,,,,,,,,2020-06-01,F,,,,,71.20B,NAFRev2,N,5.478291,46.523757,0.78,locality,Rue des Lauriers 39270 Cressia,39180_0073,G,RUE DES LAURIERS,
792315137,00010,79231513700010,O,2013-04-02,,,,2013-04-09T08:29:36,true,1,LA CROCHERE,,,CHE,DU SAPIN,39270,CRESSIA,,,39180,,,,,,,,,,,,,,,,,,,2013-04-02,A,,,,,45.20A,NAFRev2,N,5.482656,46.52079,0.79,street,Chemin du Sapin 39270 Cressia,39180_0130,G,CHEMIN DU SAPIN,
793319138,00012,79331913800012,O,2013-06-01,,,,2015-01-14T03:18:53,true,2,,,,RUE,DU CHATEAU,39270,CRESSIA,,,39180,,,,,,,,,,,,,,,,,,,2014-12-31,F,,,,,31.09B,NAFRev2,N,5.482892,46.521406,0.93,locality,Rue du Château 39270 Cressia,39180_0030,G,RUE DU CHATEAU,
803465616,00016,80346561600016,O,2014-04-01,,,,2015-01-26T10:14:54,false,2,LA PERRIERE,,,,SUR LA VIE DU MOULIN,39270,CRESSIA,,,39180,,,,,,,,,,,,,,,,,,,2014-12-01,F,,,,,68.20B,NAFRev2,N,5.496803,46.528794,0.5,locality,Impasse du Moulin 39270 Cressia,39180_0093,G,IMPASSE DU MOULIN,
803465616,00024,80346561600024,O,2014-12-01,,,,2015-01-26T10:14:54,true,1,LA PERRIERE,,,CHE,DU CHAMP GUERIN,39270,CRESSIA,,,39180,,,,,,,,,,,,,,,,,,,2014-12-01,A,,,,,68.20B,NAFRev2,N,5.489632,46.528354,0.7,locality,Chemin du Champ Guirin 39270 Cressia,39180_0025,G,CHEMIN DU CHAMP GUIRIN,
819211194,00017,81921119400017,O,2016-03-12,01,2016,,2018-09-29T14:00:45,true,2,,,,CHE,DU CHAMP GUERIN,39270,CRESSIA,,,39180,,,,,,,,,,,,,,,,,,,2016-04-01,A,,,,,64.20Z,NAFRev2,O,5.489632,46.528354,0.7,locality,Chemin du Champ Guirin 39270 Cressia,39180_0025,G,CHEMIN DU CHAMP GUIRIN,
820291722,00016,82029172200016,O,2016-01-01,,,,2016-05-17T07:36:27,true,1,,,,RUE,DU CHAMP DE FOIRE,39270,CRESSIA,,,39180,,,,,,,,,,,,,,,,,,,2016-01-01,A,,,,,35.11Z,NAFRev2,N,5.480786,46.526038,0.93,locality,Rue du Champ de Foire 39270 Cressia,39180_0020,G,RUE DU CHAMP DE FOIRE,
821443587,00034,82144358700034,O,2017-12-20,,,,2017-11-23T04:16:22,true,1,,,,CHE,DE LA FRUITIERE,39270,CRESSIA,,,39180,,,,,,,,,,,,,,,,,,,2017-12-20,A,,,,,86.90D,NAFRev2,N,5.482208,46.526808,0.84,locality,Chemin de la Fruitière 39270 Cressia,39180_0060,G,CHEMIN DE LA FRUITIERE,