siren,nic,siret,statutDiffusionEtablissement,dateCreationEtablissement,trancheEffectifsEtablissement,anneeEffectifsEtablissement,activitePrincipaleRegistreMetiersEtablissement,dateDernierTraitementEtablissement,etablissementSiege,nombrePeriodesEtablissement,complementAdresseEtablissement,numeroVoieEtablissement,indiceRepetitionEtablissement,typeVoieEtablissement,libelleVoieEtablissement,codePostalEtablissement,libelleCommuneEtablissement,libelleCommuneEtrangerEtablissement,distributionSpecialeEtablissement,codeCommuneEtablissement,codeCedexEtablissement,libelleCedexEtablissement,codePaysEtrangerEtablissement,libellePaysEtrangerEtablissement,complementAdresse2Etablissement,numeroVoie2Etablissement,indiceRepetition2Etablissement,typeVoie2Etablissement,libelleVoie2Etablissement,codePostal2Etablissement,libelleCommune2Etablissement,libelleCommuneEtranger2Etablissement,distributionSpeciale2Etablissement,codeCommune2Etablissement,codeCedex2Etablissement,libelleCedex2Etablissement,codePaysEtranger2Etablissement,libellePaysEtranger2Etablissement,dateDebut,etatAdministratifEtablissement,enseigne1Etablissement,enseigne2Etablissement,enseigne3Etablissement,denominationUsuelleEtablissement,activitePrincipaleEtablissement,nomenclatureActivitePrincipaleEtablissement,caractereEmployeurEtablissement,longitude,latitude,geo_score,geo_type,geo_adresse,geo_id,geo_ligne,geo_l4,geo_l5
213902505,00014,21390250500014,O,1983-03-01,03,2017,,2019-06-24T13:10:31,true,3,,,,,,39570,GERUGE,,,39250,,,,,,,,,,,,,,,,,,,2008-01-01,A,MAIRIE,,,,84.11Z,NAFRev2,N,,,0,,,,,,
263902504,00012,26390250400012,O,1983-03-01,NN,,,2016-07-23T12:18:58,true,4,,,,,MAIRIE,39570,GERUGE,,,39250,,,,,,,,,,,,,,,,,,,2015-12-31,F,CCAS,,,,88.99B,NAFRev2,N,3.0709671,50.6304695,0.92,poi.townhall,Hôtel de Ville Lille,https://osm.org/way/40917078,G,,
310152244,00011,31015224400011,O,1900-01-01,NN,,,2008-11-07T00:25:03,false,4,,,,,,39570,GERUGE,,,39250,,,,,,,,,,,,,,,,,,,1994-12-25,F,,,,,45.4D,NAF1993,O,,,0,,,,,,
324962968,00024,32496296800024,O,1995-07-03,NN,,,2008-11-07T00:42:03,false,4,,,R,,DE LA CHAPELLE,39570,GERUGE,,,39250,,,,,,,,,,,,,,,,,,,2002-03-09,F,36 SERVICES,,,,52.7H,NAF1993,N,5.529637,46.62656,0.82,street,Rue de la Chapelle 39570 Geruge,39250_0020,G,RUE DE LA CHAPELLE,
341943728,00012,34194372800012,O,1987-07-29,NN,,,2019-12-30T10:49:27,false,4,,,,,AU VILLAGE,39570,GERUGE,,,39250,,,,,,,,,,,,,,,,,,,2000-12-25,F,,,,,73.1Z,NAF1993,N,-1.6854522,47.8876296,0.9,poi.cafe,Au Village (Café) Poligné,https://osm.org/node/4456269839,G,,
343756425,00017,34375642500017,O,1988-01-01,NN,,,2007-10-31T16:45:11,true,3,,,,,,39570,GERUGE,,,39250,,,,,,,,,,,,,,,,,,,2005-10-31,F,,,,,51.2E,NAFRev1,N,,,0,,,,,,
343756425,00025,34375642500025,O,1997-01-01,NN,,,2006-10-27T03:23:42,false,3,,,,,,39570,GERUGE,,,39250,,,,,,,,,,,,,,,,,,,2005-10-31,F,,,,,01.3Z,NAFRev1,N,,,0,,,,,,
351833553,00024,35183355300024,O,1990-09-01,,,,2008-11-08T00:28:26,false,5,,,,CHE,DU HAUT DE GRAVELLE,39570,GERUGE,,,39250,,,,,,,,,,,,,,,,,,,2006-09-30,F,,,,,25.2H,NAFRev1,N,5.530108,46.63009,0.75,street,Chemin de Haut de Gravelle 39570 Geruge,39250_0050,G,CHEMIN DE HAUT DE GRAVELLE,
392178059,00011,39217805900011,O,1992-01-01,NN,,,,true,3,,,,,,39570,GERUGE,,,39250,,,,,,,,,,,,,,,,,,,2003-12-31,F,,,,,01.2A,NAFRev1,N,,,0,,,,,,
400035101,00015,40003510100015,O,1995-02-01,NN,,,,true,3,,,,,,39570,GERUGE,,,39250,,,,,,,,,,,,,,,,,,,1995-12-25,F,,,,,25.2H,NAF1993,O,,,0,,,,,,
402505432,00011,40250543200011,O,1995-10-13,NN,,,2015-12-30T16:18:32,true,4,,,,,,39570,GERUGE,,,39250,,,,,,,,,,,,,,,,,,,2015-11-25,F,,,,,68.20B,NAFRev2,N,,,0,,,,,,
423409689,00027,42340968900027,O,2002-03-01,NN,,,2005-12-07T17:36:44,false,3,,,,CHE,DE LA GRANGE ROUGE,39570,GERUGE,,,39250,,,,,,,,,,,,,,,,,,,2003-10-01,F,,,,,85.1G,NAFRev1,N,5.530093,46.626478,0.85,street,Chemin de la Grange Rouge 39570 Geruge,39250_0040,G,CHEMIN DE LA GRANGE ROUGE,
423458462,00011,42345846200011,O,1999-07-02,NN,,,2017-04-28T14:51:26,false,4,GINETTE GRIGI,,,CHE,DU HAUT DE GRAVELLE,39570,GERUGE,,,39250,,,,,,,,,,,,,,,,,,,2014-12-31,F,,,,,68.20B,NAFRev2,N,5.530108,46.63009,0.75,street,Chemin de Haut de Gravelle 39570 Geruge,39250_0050,G,CHEMIN DE HAUT DE GRAVELLE,
424888410,00034,42488841000034,O,2013-07-01,,,,2016-02-18T03:57:25,true,2,,396,,RTE,DE MONTORIENT,39570,GERUGE,,,39250,,,,,,,,,,,,,,,,,,,2016-02-05,F,,,,,86.90F,NAFRev2,N,5.52868,46.6315,0.85,housenumber,396 Route de Montorient 39570 Geruge,39250_0060_00396,G,396 ROUTE DE MONTORIENT,
433939717,00016,43393971700016,O,1998-01-01,NN,,,,true,1,,,,,,39570,GERUGE,,,39250,,,,,,,,,,,,,,,,,,,2001-10-31,F,,,,,01.2A,NAF1993,N,,,0,,,,,,
437850886,00015,43785088600015,O,1998-01-01,NN,,,2016-01-12T00:23:26,true,3,,,,CHE,DES VIGNES,39570,GERUGE,,,39250,,,,,,,,,,,,,,,,,,,2008-01-01,A,,,,,01.41Z,NAFRev2,N,5.528283,46.627567,0.8,street,Chemin des Vignes 39570 Geruge,39250_0090,G,CHEMIN DES VIGNES,
441936085,00014,44193608500014,O,2001-11-01,NN,,,2006-10-31T03:17:55,true,3,,,,,,39570,GERUGE,,,39250,,,,,,,,,,,,,,,,,,,2005-10-31,F,,,,,01.2A,NAFRev1,N,,,0,,,,,,
447707787,00027,44770778700027,O,2016-09-10,,,,2018-12-03T03:39:42,true,3,,396,,RTE,DE MONTORIENT,39570,GERUGE,,,39250,,,,,,,,,,,,,,,,,,,2018-09-01,A,,,,,47.99A,NAFRev2,N,5.52868,46.6315,0.85,housenumber,396 Route de Montorient 39570 Geruge,39250_0060_00396,G,396 ROUTE DE MONTORIENT,
483549580,00049,48354958000049,O,2017-07-01,,,,2020-01-01T03:56:46,true,2,,2,,RUE,DU PUITS,39570,GERUGE,,,39250,,,,,,,,,,,,,,,,,,,2019-12-31,F,,,,,90.03A,NAFRev2,N,5.529394,46.626524,0.93,housenumber,2 Rue du Puits 39570 Geruge,39250_0070_00002,G,2 RUE DU PUITS,
484486287,00028,48448628700028,O,2005-10-01,NN,,,2014-07-10T00:17:04,false,3,,,,CHE,DU HAUT DE GRAVELLE,39570,GERUGE,,,39250,,,,,,,,,,,,,,,,,,,2012-01-25,F,,,,,22.29B,NAFRev2,O,5.530108,46.63009,0.75,street,Chemin de Haut de Gravelle 39570 Geruge,39250_0050,G,CHEMIN DE HAUT DE GRAVELLE,
487539843,00010,48753984300010,O,2005-11-01,01,2017,,2019-06-24T13:21:48,true,2,,,,CHE,DE LA GRANGE ROUGE,39570,GERUGE,,,39250,,,,,,,,,,,,,,,,,,,2008-01-01,A,,,,,01.50Z,NAFRev2,N,5.530093,46.626478,0.85,street,Chemin de la Grange Rouge 39570 Geruge,39250_0040,G,CHEMIN DE LA GRANGE ROUGE,
493421390,00037,49342139000037,O,2018-07-20,,,4540ZP,2018-07-06T09:14:05,true,1,,86,,RUE,DES GRILLERES,39570,GERUGE,,,39250,,,,,,,,,,,,,,,,,,,2018-07-20,A,,,,WOODY-MOTORS,45.40Z,NAFRev2,N,5.529533,46.628185,0.93,housenumber,86 Rue des Grillères 39570 Geruge,39250_0045_00086,G,86 RUE DES GRILLERES,
497659722,00019,49765972200019,O,2007-05-01,,,,2017-10-25T03:40:01,true,3,,,,CHE,DE MONTORIENT,39570,GERUGE,,,39250,,,,,,,,,,,,,,,,,,,2017-10-17,F,,,,,47.82Z,NAFRev2,N,5.528832,46.628469,0.77,street,Route de Montorient 39570 Geruge,39250_0060,G,ROUTE DE MONTORIENT,
503970352,00020,50397035200020,O,2020-02-17,,,,2020-02-19T03:55:10,true,1,,140,,CHE,DE LA GRANDE ROUGE,39570,GERUGE,,,39250,,,,,,,,,,,,,,,,,,,2020-02-17,A,,,,,90.03A,NAFRev2,N,5.531538,46.625875,0.79,housenumber,140 Chemin de la Grange Rouge 39570 Geruge,39250_0040_00140,G,140 CHEMIN DE LA GRANGE ROUGE,
513001636,00010,51300163600010,O,2009-07-01,,,,2013-01-02T15:23:05,false,1,,,,CHE,DU HAUT DE GRAVELLE,39570,GERUGE,,,39250,,,,,,,,,,,,,,,,,,,2009-07-01,F,,,,,49.41B,NAFRev2,N,5.530108,46.63009,0.75,street,Chemin de Haut de Gravelle 39570 Geruge,39250_0050,G,CHEMIN DE HAUT DE GRAVELLE,
513803221,00011,51380322100011,O,2009-07-15,,,,2012-11-10T01:06:11,true,2,RTE DE SAINT JULIEN,82,,,,39570,GERUGE,,,39250,,,,,,,,,,,,,,,,,,,2012-03-31,F,,,,,96.09Z,NAFRev2,N,5.529562,46.625977,0.85,housenumber,82 Route de Saint Julien 39570 Geruge,39250_0080_00082,D,82 ROUTE DE SAINT JULIEN,
519166367,00010,51916636700010,O,2010-01-04,,,,2012-11-10T01:37:45,true,2,,241,,CHE,DE LA GRANGE ROUGE,39570,GERUGE,,,39250,,,,,,,,,,,,,,,,,,,2010-03-31,F,,,,,82.99Z,NAFRev2,N,5.532538,46.625489,0.86,housenumber,241 Chemin de la Grange Rouge 39570 Geruge,39250_0040_00241,G,241 CHEMIN DE LA GRANGE ROUGE,
530810480,00018,53081048000018,O,2011-03-07,,,,2011-03-08T04:41:59,true,1,,40,,RUE,DE LA CHAPELLE,39570,GERUGE,,,39250,,,,,,,,,,,,,,,,,,,2011-03-07,A,,,,,68.32A,NAFRev2,N,5.529305,46.62664,0.93,housenumber,40 Rue de la Chapelle 39570 Geruge,39250_0020_00040,G,40 RUE DE LA CHAPELLE,
532242310,00029,53224231000029,O,2015-06-01,,,,2018-05-25T04:07:29,true,4,,74,,RUE,DES GRILLERES,39570,GERUGE,,,39250,,,,,,,,,,,,,,,,,,,2017-12-31,F,,,,,82.19Z,NAFRev2,N,5.529569,46.628068,0.93,housenumber,74 Rue des Grillères 39570 Geruge,39250_0045_00074,G,74 RUE DES GRILLERES,
535383335,00010,53538333500010,O,2011-11-07,,,1392ZA,2017-03-24T10:20:34,true,3,,310,,RTE,DE MONTORIENT,39570,GERUGE,,,39250,,,,,,,,,,,,,,,,,,,2017-04-01,A,P'TIT MAG' DE NICOLE,,,,16.29Z,NAFRev2,N,5.529294,46.630861,0.85,housenumber,310 Route de Montorient 39570 Geruge,39250_0060_00310,G,310 ROUTE DE MONTORIENT,
750921462,00016,75092146200016,O,2002-05-30,,,,2012-04-13T12:50:23,true,1,MAIRIE,,,RUE,DE LA CHAPELLE,39570,GERUGE,,,39250,,,,,,,,,,,,,,,,,,,2002-05-30,A,,,,,94.99Z,NAFRev2,N,5.529637,46.62656,0.93,street,Rue de la Chapelle 39570 Geruge,39250_0020,G,RUE DE LA CHAPELLE,
751870874,00011,75187087400011,O,2012-05-20,,,,2014-04-11T14:57:59,false,2,,,,,RUE DES GRILLERES,39570,GERUGE,,,39250,,,,,,,,,,,,,,,,,,,2014-04-09,F,,,,,45.11Z,NAFRev2,N,5.529335,46.627804,0.93,street,Rue des Grillères 39570 Geruge,39250_0045,G,RUE DES GRILLERES,
778387118,00012,77838711800012,O,1988-12-31,NN,,,2012-07-28T16:09:47,true,4,,,,,,39570,GERUGE,,,39250,,,,,,,,,,,,,,,,,,,2010-12-25,F,,,,,01.41Z,NAFRev2,N,,,0,,,,,,
789721966,00016,78972196600016,O,2012-07-01,,,,2012-12-04T08:32:33,true,1,,25,,CHE,DE LA GRANGE ROUGE,39570,GERUGE,,,39250,,,,,,,,,,,,,,,,,,,2012-07-01,A,,,,,47.99A,NAFRev2,N,5.530137,46.626467,0.86,housenumber,25 Chemin de la Grange Rouge 39570 Geruge,39250_0040_00025,G,25 CHEMIN DE LA GRANGE ROUGE,
790853360,00010,79085336000010,O,2013-01-21,,,,2014-01-17T08:30:19,true,2,,25,,,CHEMIN DE LA GRANGE ROUGE,39570,GERUGE,,,39250,,,,,,,,,,,,,,,,,,,2013-09-30,F,,,,,47.99A,NAFRev2,N,5.530137,46.626467,0.93,housenumber,25 Chemin de la Grange Rouge 39570 Geruge,39250_0040_00025,G,25 CHEMIN DE LA GRANGE ROUGE,
813466422,00025,81346642200025,O,2016-05-25,,,,2017-05-22T07:52:20,true,1,CHEZ CECILE COMBAUT,2,,RUE,DU PUITS,39570,GERUGE,,,39250,,,,,,,,,,,,,,,,,,,2016-05-25,A,,,,,85.10Z,NAFRev2,N,5.529394,46.626524,0.93,housenumber,2 Rue du Puits 39570 Geruge,39250_0070_00002,G,2 RUE DU PUITS,
818195612,00028,81819561200028,O,2019-09-27,,,,2019-10-18T03:48:08,true,1,,431,,RTE,DE MONTORIENT,39570,GERUGE,,,39250,,,,,,,,,,,,,,,,,,,2019-09-27,A,,,,,68.20B,NAFRev2,N,5.528832,46.628469,0.69,street,Route de Montorient 39570 Geruge,39250_0060,G,ROUTE DE MONTORIENT,
820320406,00011,82032040600011,O,2016-04-14,,,,2016-05-18T05:21:10,true,1,,243,,CHE,DU HAUT DE GRAVELLE,39570,GERUGE,,,39250,,,,,,,,,,,,,,,,,,,2016-04-14,A,,,,,47.99A,NAFRev2,N,5.531276,46.631846,0.77,housenumber,243 Chemin de Haut de Gravelle 39570 Geruge,39250_0050_00243,G,243 CHEMIN DE HAUT DE GRAVELLE,
834606667,00014,83460666700014,O,2018-01-12,,,,2019-07-09T03:36:31,false,2,,52,,RUE,DES GRILLERES,39570,GERUGE,,,39250,,,,,,,,,,,,,,,,,,,2019-01-01,F,ELEVAGE DU COMTE DE TREPUGNAT,,,,01.49Z,NAFRev2,N,5.529519,46.62787,0.93,housenumber,52 Rue des Grillères 39570 Geruge,39250_0045_00052,G,52 RUE DES GRILLERES,
834960478,00016,83496047800016,O,2018-01-11,,,9609ZP,2018-10-11T15:25:06,false,2,,52,,RUE,DES GRILLERES,39570,GERUGE,,,39250,,,,,,,,,,,,,,,,,,,2018-07-14,F,,,,,96.09Z,NAFRev2,N,5.529519,46.62787,0.93,housenumber,52 Rue des Grillères 39570 Geruge,39250_0045_00052,G,52 RUE DES GRILLERES,
882975949,00018,88297594900018,O,2020-04-16,,,,2020-06-25T04:04:39,true,2,,86,,RUE,DES GRILLERES,39570,GERUGE,,,39250,,,,,,,,,,,,,,,,,,,2020-06-22,A,,,,,68.31Z,NAFRev2,O,5.529533,46.628185,0.93,housenumber,86 Rue des Grillères 39570 Geruge,39250_0045_00086,G,86 RUE DES GRILLERES,
