siren,nic,siret,statutDiffusionEtablissement,dateCreationEtablissement,trancheEffectifsEtablissement,anneeEffectifsEtablissement,activitePrincipaleRegistreMetiersEtablissement,dateDernierTraitementEtablissement,etablissementSiege,nombrePeriodesEtablissement,complementAdresseEtablissement,numeroVoieEtablissement,indiceRepetitionEtablissement,typeVoieEtablissement,libelleVoieEtablissement,codePostalEtablissement,libelleCommuneEtablissement,libelleCommuneEtrangerEtablissement,distributionSpecialeEtablissement,codeCommuneEtablissement,codeCedexEtablissement,libelleCedexEtablissement,codePaysEtrangerEtablissement,libellePaysEtrangerEtablissement,complementAdresse2Etablissement,numeroVoie2Etablissement,indiceRepetition2Etablissement,typeVoie2Etablissement,libelleVoie2Etablissement,codePostal2Etablissement,libelleCommune2Etablissement,libelleCommuneEtranger2Etablissement,distributionSpeciale2Etablissement,codeCommune2Etablissement,codeCedex2Etablissement,libelleCedex2Etablissement,codePaysEtranger2Etablissement,libellePaysEtranger2Etablissement,dateDebut,etatAdministratifEtablissement,enseigne1Etablissement,enseigne2Etablissement,enseigne3Etablissement,denominationUsuelleEtablissement,activitePrincipaleEtablissement,nomenclatureActivitePrincipaleEtablissement,caractereEmployeurEtablissement,longitude,latitude,geo_score,geo_type,geo_adresse,geo_id,geo_ligne,geo_l4,geo_l5
017050667,00256,01705066700256,O,2000-06-01,NN,,,,false,3,,,,CHE,D'AMANCE,54130,DOMMARTEMONT,,,54165,,,,,,,,,,,,,,,,,,,2002-08-15,F,,,,,45.2E,NAF1993,N,6.208158,48.712109,0.94,street,Che d'Amance 54130 Dommartemont,54165_0020,G,CHE D AMANCE,
195417068,00010,19541706800010,O,1983-03-01,12,2017,,2019-06-24T13:08:03,true,3,,,,RUE,DE MALZEVILLE,54130,DOMMARTEMONT,,,54165,,,,,,,,,,,,,,,,,,,2008-01-01,A,,,,,85.31Z,NAFRev2,N,6.213983,48.712177,0.94,street,Rue de Malzeville 54130 Dommartemont,54165_0100,G,RUE DE MALZEVILLE,
215401654,00011,21540165400011,O,1983-03-01,02,2017,,2019-06-24T13:11:02,true,4,,,,PL,DU FORUM,54130,DOMMARTEMONT,,,54165,,,,,,,,,,,,,,,,,,,2008-01-01,A,MAIRIE,,,,84.11Z,NAFRev2,O,7.5651425,47.5888047,0.75,poi.parking,Place du Forum (Parking) Saint-Louis,https://osm.org/way/180721104,G,,
215401654,00037,21540165400037,O,1983-12-21,NN,,,2013-05-18T02:14:52,false,2,,,,CHE,D'AMANCE,54130,DOMMARTEMONT,,,54165,,,,,,,,,,,,,,,,,,,2008-01-01,A,ECOLE MATERNELLE JEAN ROSTAND,,,,85.20Z,NAFRev2,N,6.208158,48.712109,0.94,street,Che d'Amance 54130 Dommartemont,54165_0020,G,CHE D AMANCE,
215401654,00045,21540165400045,O,1983-12-21,NN,,,2012-05-05T00:28:38,false,2,,,,CHE,D'AMANCE,54130,DOMMARTEMONT,,,54165,,,,,,,,,,,,,,,,,,,2008-01-01,A,ECOLE ELEMENTAIRE JEAN ROSTAND,,,,85.20Z,NAFRev2,N,6.208158,48.712109,0.94,street,Che d'Amance 54130 Dommartemont,54165_0020,G,CHE D AMANCE,
215401654,00052,21540165400052,O,1983-12-21,NN,,,2016-04-26T01:24:17,false,2,,,,CHE,D'AMANCE,54130,DOMMARTEMONT,,,54165,,,,,,,,,,,,,,,,,,,2008-01-01,A,ECOLE PRIMAIRE PUBLIQUE PLEIN AIR,,,,85.20Z,NAFRev2,N,6.208158,48.712109,0.94,street,Che d'Amance 54130 Dommartemont,54165_0020,G,CHE D AMANCE,
215401654,00060,21540165400060,O,1983-01-01,NN,,,2009-06-27T03:22:36,false,3,,,,,,54130,DOMMARTEMONT,,,54165,,,,,,,,,,,,,,,,,,,2008-01-01,F,COLONIE SCOLAIRE BON ACCUEIL,,,,55.20Z,NAFRev2,N,,,0,,,,,,
215404823,00027,21540482300027,O,1983-01-01,NN,,,2017-05-04T01:27:01,false,4,,,,,,54130,DOMMARTEMONT,,,54165,,,,,,,,,,,,,,,,,,,2008-02-03,A,CENTRE AERE BON ACCUEIL,,,,93.29Z,NAFRev2,O,,,0,,,,,,
215404823,00050,21540482300050,O,1983-12-21,NN,,,2013-05-18T02:14:54,false,3,,,,,CHEMIN D AMANCE,54130,DOMMARTEMONT,,,54165,,,,,,,,,,,,,,,,,,,2009-01-21,A,ECOLE MATERNELLE PUB JEAN ROSTAND,,,,85.10Z,NAFRev2,N,6.208158,48.712109,0.67,street,Che d'Amance 54130 Dommartemont,54165_0020,G,CHE D AMANCE,
215404823,00068,21540482300068,O,1983-12-21,NN,,,2013-05-18T02:14:54,false,4,,,,,CHEMIN D AMANCE,54130,DOMMARTEMONT,,,54165,,,,,,,,,,,,,,,,,,,2009-01-21,A,ECOLE ELEMENTAIRE PUB JEAN ROSTAND,,,,85.20Z,NAFRev2,N,6.208158,48.712109,0.67,street,Che d'Amance 54130 Dommartemont,54165_0020,G,CHE D AMANCE,
215404823,00076,21540482300076,O,1983-12-21,NN,,,2008-10-16T14:52:56,false,2,,,,RUE,D AMANCE,54130,DOMMARTEMONT,,,54165,,,,,,,,,,,,,,,,,,,1996-12-25,F,ECOLE PRIMAIRE PL.AIR PUBLIQUE,,,,80.1Z,NAF1993,N,6.208158,48.712109,0.72,street,Che d'Amance 54130 Dommartemont,54165_0020,G,CHE D AMANCE,
255402653,00018,25540265300018,O,,NN,,,,true,1,,14,,RUE,HAUTE,54130,DOMMARTEMONT,,,54165,,,,,,,,,,,,,,,,,,,1994-06-23,F,,,,,75.1C,NAF1993,N,6.213942,48.713459,0.94,interpolation,14 Rue Haute 54130 Dommartemont,,G,12 RUE HAUTE,
265403261,00018,26540326100018,O,1992-01-01,NN,,,2016-07-23T12:10:10,true,4,MAIRIE,12,,RUE,HAUTE,54130,DOMMARTEMONT,,,54165,,,,,,,,,,,,,,,,,,,2016-01-01,F,CCAS,,,,88.99B,NAFRev2,N,6.214049,48.713232,0.94,housenumber,12 Rue Haute 54130 Dommartemont,54165_0080_00012,G,12 RUE HAUTE,
302300413,00036,30230041300036,O,2005-01-01,,,,2008-01-04T19:19:34,true,2,,73,,RUE,SAINTE GENEVIEVE,54130,DOMMARTEMONT,,,54165,,,,,,,,,,,,,,,,,,,2008-01-01,A,,,,,70.22Z,NAFRev2,N,6.219242,48.716417,0.94,housenumber,73 Rue Sainte Genevieve 54130 Dommartemont,54165_0180_00073,G,73 RUE SAINTE GENEVIEVE,
307244558,00028,30724455800028,O,2000-06-01,NN,,,2012-07-27T05:30:31,true,7,,55,,CHE,D'AMANCE,54130,DOMMARTEMONT,,,54165,,,,,,,,,,,,,,,,,,,2012-06-30,F,,,,,46.14Z,NAFRev2,N,6.215931,48.716396,0.94,housenumber,55 Che d'Amance 54130 Dommartemont,54165_0020_00055,G,55 CHE D AMANCE,
308869007,00028,30886900700028,O,,NN,,,,true,1,,5,,RUE,DES ERABLES,54130,DOMMARTEMONT,,,54165,,,,,,,,,,,,,,,,,,,1992-12-31,F,,,,,92.4Z,NAF1993,N,6.21628,48.710353,0.94,housenumber,5 Rue des Erables 54130 Dommartemont,54165_0070_00005,G,5 RUE DES ERABLES,
309913929,00043,30991392900043,O,2013-05-05,,,,2014-05-19T11:01:48,true,1,PARCELLE AB 47 CHE DE DEFRUITEMENT,,,,VIA CHE DU PAIN DE SUCRE,54130,DOMMARTEMONT,,,54165,,,,,,,,,,,,,,,,,,,2013-05-05,A,,,,,01.49Z,NAFRev2,N,6.218668,48.718698,0.81,street,Che du Pain de Sucre 54130 Dommartemont,54165_0120,G,CHE DU PAIN DE SUCRE,
309917201,00092,30991720100092,O,2018-08-24,,,,2018-12-11T04:12:02,true,1,,64,,CHE,D'AMANCE,54130,DOMMARTEMONT,,,54165,,,,,,,,,,,,,,,,,,,2018-08-24,A,,,,,70.10Z,NAFRev2,N,6.214897,48.715702,0.94,housenumber,64 Che d'Amance 54130 Dommartemont,54165_0020_00064,G,64 CHE D AMANCE,
312816028,00053,31281602800053,O,2016-11-01,,,,2020-05-06T03:48:08,true,1,,16,,RUE,DE MALZEVILLE,54130,DOMMARTEMONT,,,54165,,,,,,,,,,,,,,,,,,,2016-11-01,A,,,,,68.20B,NAFRev2,N,6.212711,48.711866,0.94,housenumber,16 Rue de Malzeville 54130 Dommartemont,54165_0100_00016,G,16 RUE DE MALZEVILLE,
312838162,00039,31283816200039,O,2012-09-01,,,,2016-01-08T14:45:03,true,2,,5,,RUE,DES FRANOUES,54130,DOMMARTEMONT,,,54165,,,,,,,,,,,,,,,,,,,2015-11-01,F,,,,,68.31Z,NAFRev2,N,6.217174,48.715601,0.94,housenumber,5 Rue des Franoues 54130 Dommartemont,54165_0073_00005,G,5 RUE DES FRANOUES,
314023219,00020,31402321900020,O,,NN,,,,true,1,,,,CHE,D AMANCE,54130,DOMMARTEMONT,,,54165,,,,,,,,,,,,,,,,,,,1996-12-04,F,,,,,51.1E,NAF1993,N,6.208158,48.712109,0.94,street,Che d'Amance 54130 Dommartemont,54165_0020,G,CHE D AMANCE,
317962983,00019,31796298300019,O,1980-01-01,NN,,,2019-04-04T03:59:48,true,3,,65,,RUE,SAINTE GENEVIEVE,54130,DOMMARTEMONT,,,54165,,,,,,,,,,,,,,,,,,,2008-01-01,A,,,,,68.20B,NAFRev2,N,6.218409,48.715551,0.94,housenumber,65 Rue Sainte Genevieve 54130 Dommartemont,54165_0180_00065,G,65 RUE SAINTE GENEVIEVE,
318647302,00054,31864730200054,O,2001-06-01,,,,2008-11-07T00:34:26,false,4,,39,,RUE,DE MALZEVILLE,54130,DOMMARTEMONT,,,54165,,,,,,,,,,,,,,,,,,,2005-04-30,F,,,,,45.3E,NAFRev1,O,6.207942,48.710938,0.94,interpolation,39 Rue de Malzeville 54130 Dommartemont,,G,37 RUE DE MALZEVILLE,
318871951,00022,31887195100022,O,1982-04-19,NN,,,2008-11-07T00:34:44,false,4,,,,CHE,DU PAIN DE SUCRE,54130,DOMMARTEMONT,,BP 11,54165,,,,,,,,,,,,,,,,,,,2004-09-01,F,,,,,45.2K,NAFRev1,O,6.218668,48.718698,0.94,street,Che du Pain de Sucre 54130 Dommartemont,54165_0120,G,CHE DU PAIN DE SUCRE,
320476914,00017,32047691400017,O,1980-09-30,NN,,,2008-01-04T18:14:33,true,3,,41,,RUE,DE MALZEVILLE,54130,DOMMARTEMONT,,,54165,,,,,,,,,,,,,,,,,,,2008-01-01,A,,,,,68.20A,NAFRev2,N,6.207809,48.710931,0.94,housenumber,41 Rue de Malzeville 54130 Dommartemont,54165_0100_00041,G,41 RUE DE MALZEVILLE,
321690489,00018,32169048900018,O,1981-04-30,NN,,,2018-06-08T04:05:38,true,3,,18,,CHE,DU PIN DE SUCRE,54130,DOMMARTEMONT,,,54165,,,,,,,,,,,,,,,,,,,2008-01-01,A,,,,,68.20A,NAFRev2,N,6.218535,48.718333,0.86,housenumber,18 Che du Pain de Sucre 54130 Dommartemont,54165_0120_00018,G,18 CHE DU PAIN DE SUCRE,
321768392,00011,32176839200011,O,1981-05-01,NN,,,,true,1,,26,,RUE,MALZEVILLE,54130,DOMMARTEMONT,,,54165,,,,,,,,,,,,,,,,,,,1996-07-15,F,,,,,70.2A,NAF1993,N,6.210529,48.711537,0.93,housenumber,26 Rue de Malzeville 54130 Dommartemont,54165_0100_00026,G,26 RUE DE MALZEVILLE,
321768467,00045,32176846700045,O,2004-01-01,,,,2013-02-28T10:22:32,true,5,,10,,LOT,DU SAULCY,54130,DOMMARTEMONT,,,54165,,,,,,,,,,,,,,,,,,,2011-05-13,A,,,,,68.31Z,NAFRev2,N,6.217541,48.712615,0.66,housenumber,10 Rue du Saulcy 54130 Dommartemont,54165_0182_00010,G,10 RUE DU SAULCY,
322293242,00010,32229324200010,O,1981-05-10,NN,,,,true,4,,,,CHE,STRATEGIQUE,54130,DOMMARTEMONT,,,54165,,,,,,,,,,,,,,,,,,,1992-12-25,F,,,,,92.3H,NAF1993,N,6.207371,48.711379,0.94,street,Che Strategique 54130 Dommartemont,54165_0190,G,CHE STRATEGIQUE,
323794875,00019,32379487500019,O,1981-05-15,NN,,,2010-11-19T12:48:47,false,4,,,,CHE,STRATEGIQUE,54130,DOMMARTEMONT,,,54165,,,,,,,,,,,,,,,,,,,2008-01-01,A,,,,,68.20B,NAFRev2,N,6.207371,48.711379,0.94,street,Che Strategique 54130 Dommartemont,54165_0190,G,CHE STRATEGIQUE,
324730696,00030,32473069600030,O,1995-05-15,00,2017,,2020-04-17T03:47:57,true,6,,56,B,RUE,SAINTE GENEVIEVE,54130,DOMMARTEMONT,,,54165,,,,,,,,,,,,,,,,,,,2018-12-14,F,,,,,64.20Z,NAFRev2,O,6.218535,48.71501,0.94,interpolation,56 Rue Sainte Genevieve 54130 Dommartemont,,G,54 RUE SAINTE GENEVIEVE,
325192979,00012,32519297900012,O,1982-07-26,NN,,,,false,3,,26,,RUE,SAINTE GENEVIEVE,54130,DOMMARTEMONT,,,54165,,,,,,,,,,,,,,,,,,,1993-03-02,F,,,,,02.0D,NAF1993,N,6.215781,48.713328,0.94,housenumber,26 Rue Sainte Genevieve 54130 Dommartemont,54165_0180_00026,G,26 RUE SAINTE GENEVIEVE,
325435972,00014,32543597200014,O,1982-09-01,NN,,,2008-04-05T00:25:49,true,3,,19,,CHE,D AMANCE,54130,DOMMARTEMONT,,,54165,,,,,,,,,,,,,,,,,,,2008-01-01,A,,,,,68.20A,NAFRev2,N,6.211754,48.714052,0.94,housenumber,19 Che d'Amance 54130 Dommartemont,54165_0020_00019,G,19 CHE D AMANCE,
325583904,00017,32558390400017,O,,NN,,,,true,1,,3,,ALL,DES TILLEULS,54130,DOMMARTEMONT,,,54165,,,,,,,,,,,,,,,,,,,,F,,,,,60.09,NAP,N,6.215001,48.710263,0.94,housenumber,3 All des Tilleuls 54130 Dommartemont,54165_0200_00003,G,3 ALL DES TILLEULS,
326051166,00030,32605116600030,O,2007-11-14,,,,2008-07-02T10:48:47,false,2,,14,,RUE,DE MALZEVILLE,54130,DOMMARTEMONT,,,54165,,,,,,,,,,,,,,,,,,,2008-01-01,F,,,,,86.21Z,NAFRev2,N,6.21319,48.711961,0.94,housenumber,14 Rue de Malzeville 54130 Dommartemont,54165_0100_00014,G,14 RUE DE MALZEVILLE,
326123130,00048,32612313000048,O,2004-10-01,NN,,,2012-01-20T10:45:26,false,4,,37,B,RUE,STE GENEVIEVE,54130,DOMMARTEMONT,,,54165,,,,,,,,,,,,,,,,,,,2011-12-31,F,,,,,46.19B,NAFRev2,N,6.215914,48.714185,0.69,housenumber,37 bis Rue du Clos Sainte Genevieve 54130 Dommartemont,54165_0101_00037_bis,G,37 B RUE DU CLOS STE GENEVIEVE,
326123130,00063,32612313000063,O,2012-01-01,,,,2014-09-26T08:58:28,true,2,,37,B,RUE,SAINTE GENEVIEVE,54130,DOMMARTEMONT,,,54165,,,,,,,,,,,,,,,,,,,2014-07-31,F,,,,,81.10Z,NAFRev2,N,6.215939,48.714047,0.91,interpolation,37 Rue Sainte Genevieve 54130 Dommartemont,,G,35 RUE SAINTE GENEVIEVE,
326631751,00012,32663175100012,O,1983-01-10,NN,,,,true,1,,42,,CHE,D AMANCE,54130,DOMMARTEMONT,,,54165,,,,,,,,,,,,,,,,,,,2002-08-31,F,,,,,74.1A,NAF1993,N,6.211797,48.713935,0.94,housenumber,42 Che d'Amance 54130 Dommartemont,54165_0020_00042,G,42 CHE D AMANCE,
327042420,00023,32704242000023,O,1988-08-10,NN,,,2006-10-27T01:42:30,false,3,,10,,,HAUTS DE DOMMARTEMONT,54130,DOMMARTEMONT,,,54165,,,,,,,,,,,,,,,,,,,2006-07-01,F,,,,,85.1G,NAFRev1,N,6.216486,48.715412,0.89,housenumber,10 All des Hauts de Dommartemont 54130 Dommartemont,54165_0085_00010,G,10 ALL DES HAUTS DE DOMMARTEMONT,
327042420,00031,32704242000031,O,2006-07-01,,,,2012-02-13T11:39:24,true,3,,3,,RUE,DES VIGNES,54130,DOMMARTEMONT,,,54165,,,,,,,,,,,,,,,,,,,2010-12-31,F,,,,,86.90D,NAFRev2,N,6.218073,48.715891,0.83,street,Rue des Vignes 54130 Dommartemont,54165_0205,G,RUE DES VIGNES,
328875489,00028,32887548900028,O,2015-03-09,,,,2015-04-10T12:09:39,true,1,,2,,CHE,DU PAIN DE SUCRE,54130,DOMMARTEMONT,,,54165,,,,,,,,,,,,,,,,,,,2015-03-09,A,,,,,68.20B,NAFRev2,N,6.221393,48.718697,0.94,housenumber,2 Che du Pain de Sucre 54130 Dommartemont,54165_0120_00002,G,2 CHE DU PAIN DE SUCRE,
329162085,00016,32916208500016,O,,NN,,,,true,1,,85,,CHE,D AMANCE,54130,DOMMARTEMONT,,,54165,,,,,,,,,,,,,,,,,,,1985-01-01,F,,,,,77.14,NAP,N,6.220197,48.71775,0.94,housenumber,85 Che d'Amance 54130 Dommartemont,54165_0020_00085,G,85 CHE D AMANCE,
329361265,00013,32936126500013,O,1984-01-11,NN,,,,false,3,,47,,CHE,D AMANCE,54130,DOMMARTEMONT,,,54165,,,,,,,,,,,,,,,,,,,1995-09-25,F,,,,,70.2C,NAF1993,N,6.21536,48.716081,0.94,housenumber,47 Che d'Amance 54130 Dommartemont,54165_0020_00047,G,47 CHE D AMANCE,
329816995,00016,32981699500016,O,1984-05-11,NN,,,,false,4,,33,,RUE,MALZEVILLE,54130,DOMMARTEMONT,,,54165,,,,,,,,,,,,,,,,,,,1993-10-24,F,,,,,70.2A,NAF1993,N,6.208966,48.711049,0.93,housenumber,33 Rue de Malzeville 54130 Dommartemont,54165_0100_00033,G,33 RUE DE MALZEVILLE,
330126269,00035,33012626900035,O,2011-11-01,,,,2012-11-15T08:32:50,true,2,,16,,RUE,DU SAULCY,54130,DOMMARTEMONT,,,54165,,,,,,,,,,,,,,,,,,,2012-12-01,F,,,,,80.10Z,NAFRev2,N,6.216814,48.711787,0.94,housenumber,16 Rue du Saulcy 54130 Dommartemont,54165_0182_00016,G,16 RUE DU SAULCY,
330384108,00040,33038410800040,O,2010-05-01,,,,2012-05-24T10:36:17,false,2,,47,,CHE,D AMANCE,54130,DOMMARTEMONT,,,54165,,,,,,,,,,,,,,,,,,,2012-01-01,F,,,,,86.22A,NAFRev2,N,6.21536,48.716081,0.94,housenumber,47 Che d'Amance 54130 Dommartemont,54165_0020_00047,G,47 CHE D AMANCE,
330525775,00012,33052577500012,O,1984-08-21,NN,,,2019-08-01T11:34:08,true,3,,70,T,RUE,SAINTE GENEVIEVE,54130,DOMMARTEMONT,,,54165,,,,,,,,,,,,,,,,,,,2008-01-01,A,,,,,68.20B,NAFRev2,N,6.219671,48.716096,0.83,housenumber,70 ter Rue Sainte Genevieve 54130 Dommartemont,54165_0180_00070_ter,G,70 TER RUE SAINTE GENEVIEVE,
331177634,00051,33117763400051,O,1998-11-01,NN,,,2011-01-20T14:54:18,true,4,,4,,RUE,BASSE,54130,DOMMARTEMONT,,,54165,,,,,,,,,,,,,,,,,,,2009-09-15,F,,,,,71.11Z,NAFRev2,N,6.214285,48.71162,0.94,housenumber,4 Rue Basse 54130 Dommartemont,54165_0040_00004,G,4 RUE BASSE,
331952739,00042,33195273900042,O,1992-09-30,,,,,false,4,,70,,CHE,D AMANCE,54130,DOMMARTEMONT,,,54165,,,,,,,,,,,,,,,,,,,1993-12-25,F,,,,,74.1C,NAF1993,N,6.218247,48.71701,0.94,housenumber,70 Che d'Amance 54130 Dommartemont,54165_0020_00070,G,70 CHE D AMANCE,
332572049,00010,33257204900010,O,,NN,,,,true,1,,,,CHE,DU PIN,54130,DOMMARTEMONT,,,54165,,,,,,,,,,,,,,,,,,,,F,,,,,67.01,NAP,N,6.4351435,43.0181884,0.89,poi.track,Corniche du Pin Pignon (Chemin) Hyères,https://osm.org/way/427332550,G,,
333217941,00017,33321794100017,O,,NN,,,,true,1,,,,RUE,D AMANCE,54130,DOMMARTEMONT,,,54165,,,,,,,,,,,,,,,,,,,1989-09-15,F,,,,,55.72,NAP,N,6.208158,48.712109,0.72,street,Che d'Amance 54130 Dommartemont,54165_0020,G,CHE D AMANCE,
334432648,00015,33443264800015,O,1986-01-06,NN,,,2008-11-07T00:54:37,true,3,,42,,RUE,STE GENEVIEVE,54130,DOMMARTEMONT,,,54165,,,,,,,,,,,,,,,,,,,2004-03-30,F,,,,,45.4C,NAFRev1,N,6.217185,48.714403,0.85,housenumber,42 Rue Sainte Genevieve 54130 Dommartemont,54165_0180_00042,G,42 RUE SAINTE GENEVIEVE,
334440955,00014,33444095500014,O,,NN,,,,true,1,,42,,RUE,STE GENEVIEVE,54130,DOMMARTEMONT,,,54165,,,,,,,,,,,,,,,,,,,1987-09-30,F,,,,,55.71,NAP,N,6.217185,48.714403,0.85,housenumber,42 Rue Sainte Genevieve 54130 Dommartemont,54165_0180_00042,G,42 RUE SAINTE GENEVIEVE,
338228109,00041,33822810900041,O,1989-01-01,NN,,,,true,4,,1,,RUE,DE MALZEVILLE,54130,DOMMARTEMONT,,,54165,,,,,,,,,,,,,,,,,,,2000-12-31,F,,,,,40.1Z,NAF1993,N,6.213983,48.712177,0.94,housenumber,1 Rue de Malzeville 54130 Dommartemont,54165_0100_00001,G,1 RUE DE MALZEVILLE,
338253131,00969,33825313100969,O,1988-04-18,NN,,,,false,4,ECOLE,,,CHE,D'AMANCE,54130,DOMMARTEMONT,,,54165,,,,,,,,,,,,,,,,,,,1999-08-31,F,SODEXHO FRANCE ECOLES UNIVERSITES,,,,55.5A,NAF1993,O,6.208158,48.712109,0.94,street,Che d'Amance 54130 Dommartemont,54165_0020,G,CHE D AMANCE,
338740103,00019,33874010300019,O,1986-09-10,NN,,,,true,1,,60,,CHE,D AMANCE,54130,DOMMARTEMONT,,,54165,,,,,,,,,,,,,,,,,,,2001-09-27,F,,,,,51.1R,NAF1993,N,6.214099,48.715327,0.94,housenumber,60 Che d'Amance 54130 Dommartemont,54165_0020_00060,G,60 CHE D AMANCE,
339249013,00014,33924901300014,O,1986-08-14,NN,,,,true,1,,60,,CHE,D AMANCE,54130,DOMMARTEMONT,,,54165,,,,,,,,,,,,,,,,,,,2002-12-31,F,,,,,45.4M,NAF1993,N,6.214099,48.715327,0.94,housenumber,60 Che d'Amance 54130 Dommartemont,54165_0020_00060,G,60 CHE D AMANCE,
340685114,00019,34068511400019,O,1987-02-22,NN,,,2008-01-04T21:44:43,true,3,,27,,RUE,DE MALZEVILLE,54130,DOMMARTEMONT,,,54165,,,,,,,,,,,,,,,,,,,2008-01-01,A,,,,,94.91Z,NAFRev2,N,6.210651,48.711467,0.94,housenumber,27 Rue de Malzeville 54130 Dommartemont,54165_0100_00027,G,27 RUE DE MALZEVILLE,
341535730,00012,34153573000012,O,1987-01-01,NN,,,,false,4,,10,,RTE,STRATEGIQUE,54130,DOMMARTEMONT,,,54165,,,,,,,,,,,,,,,,,,,1996-12-16,F,,,,,92.6C,NAF1993,N,6.207426,48.712257,0.78,housenumber,10 Che Strategique 54130 Dommartemont,54165_0190_00010,G,10 CHE STRATEGIQUE,
341535730,00020,34153573000020,O,1996-12-16,NN,,,2020-06-03T08:39:42,true,6,,87,,CHE,D'AMANCE,54130,DOMMARTEMONT,,,54165,,,,,,,,,,,,,,,,,,,2020-04-01,F,,,,,85.51Z,NAFRev2,N,6.22055,48.71785,0.94,housenumber,87 Che d'Amance 54130 Dommartemont,54165_0020_00087,G,87 CHE D AMANCE,
342389376,00027,34238937600027,O,1991-02-20,NN,,,,false,4,,11,,RUE,STE GENEVIEVE,54130,DOMMARTEMONT,,,54165,,,,,,,,,,,,,,,,,,,1998-06-16,F,,,,,85.1C,NAF1993,N,6.21481,48.712643,0.85,housenumber,11 Rue Sainte Genevieve 54130 Dommartemont,54165_0180_00011,G,11 RUE SAINTE GENEVIEVE,
342816394,00015,34281639400015,O,1987-11-01,NN,,,,true,1,,68,,RUE,SAINTE GENEVIEVE,54130,DOMMARTEMONT,,,54165,,,,,,,,,,,,,,,,,,,1999-12-31,F,,,,,52.1B,NAF1993,N,6.218836,48.715776,0.94,housenumber,68 Rue Sainte Genevieve 54130 Dommartemont,54165_0180_00068,G,68 RUE SAINTE GENEVIEVE,
342816683,00011,34281668300011,O,,NN,,,,true,1,,19,,RUE,HAUTE,54130,DOMMARTEMONT,,,54165,,,,,,,,,,,,,,,,,,,1990-12-31,F,,,,,45.2V,NAF1993,N,6.213841,48.713412,0.94,housenumber,19 Rue Haute 54130 Dommartemont,54165_0080_00019,G,19 RUE HAUTE,
343790077,00014,34379007700014,O,1988-02-10,NN,,,2008-01-04T22:20:12,true,3,,72,,RUE,SAINTE CATHERINE,54130,DOMMARTEMONT,,,54165,,,,,,,,,,,,,,,,,,,2008-01-01,A,,,,,68.20A,NAFRev2,N,6.219304,48.716257,0.56,housenumber,72 Rue Sainte Genevieve 54130 Dommartemont,54165_0180_00072,G,72 RUE SAINTE GENEVIEVE,
343807954,00015,34380795400015,O,,NN,,,,true,1,,85,,CHE,,54130,DOMMARTEMONT,,,54165,,,,,,,,,,,,,,,,,,,1992-03-31,F,,,,,74.8K,NAF1993,N,6.220197,48.71775,0.91,housenumber,85 Che d'Amance 54130 Dommartemont,54165_0020_00085,G,85 CHE D AMANCE,
344133574,00048,34413357400048,O,2005-10-06,,,,2010-09-10T15:02:44,false,3,,11,,RUE,HAUTE,54130,DOMMARTEMONT,,,54165,,,,,,,,,,,,,,,,,,,2010-09-22,F,,,,,46.69B,NAFRev2,N,6.21403,48.712902,0.94,housenumber,11 Rue Haute 54130 Dommartemont,54165_0080_00011,G,11 RUE HAUTE,
345344568,00018,34534456800018,O,1988-05-27,NN,,,,false,4,,18,,RUE,HAUTE,54130,DOMMARTEMONT,,,54165,,,,,,,,,,,,,,,,,,,1998-10-01,F,,,,,70.2A,NAF1993,N,6.213753,48.713938,0.94,housenumber,18 Rue Haute 54130 Dommartemont,54165_0080_00018,G,18 RUE HAUTE,
347976052,00022,34797605200022,O,1991-06-21,NN,,,2009-06-27T05:44:34,false,4,,45,B,RUE,SAINTE GENEVIEVE,54130,DOMMARTEMONT,,,54165,,,,,,,,,,,,,,,,,,,2007-03-01,F,,,,,45.2J,NAFRev1,O,6.217206,48.7146,0.83,housenumber,45 bis Rue Sainte Genevieve 54130 Dommartemont,54165_0180_00045_bis,G,45 BIS RUE SAINTE GENEVIEVE,
347976052,00030,34797605200030,O,2007-03-01,NN,,,2014-07-08T00:51:05,false,3,,5,,RUE,DE MALZEVILLE,54130,DOMMARTEMONT,,,54165,,,,,,,,,,,,,,,,,,,2010-10-01,F,,,,,43.91B,NAFRev2,O,6.213838,48.712106,0.94,housenumber,5 Rue de Malzeville 54130 Dommartemont,54165_0100_00005,G,5 RUE DE MALZEVILLE,
348087305,00010,34808730500010,O,1988-09-17,NN,,,,true,4,,1,,RUE,DE MALZEVILLE,54130,DOMMARTEMONT,,,54165,,,,,,,,,,,,,,,,,,,1992-12-24,F,,,,,74.1J,NAF1993,N,6.213983,48.712177,0.94,housenumber,1 Rue de Malzeville 54130 Dommartemont,54165_0100_00001,G,1 RUE DE MALZEVILLE,
348293846,00013,34829384600013,O,1987-01-01,NN,,,2008-01-04T22:50:22,true,3,,13,,RUE,STE GENEVIEVE,54130,DOMMARTEMONT,,,54165,,,,,,,,,,,,,,,,,,,2008-01-01,A,,,,,68.20A,NAFRev2,N,6.214911,48.712704,0.85,housenumber,13 Rue Sainte Genevieve 54130 Dommartemont,54165_0180_00013,G,13 RUE SAINTE GENEVIEVE,
349356998,00030,34935699800030,O,1996-01-01,NN,,,,true,1,,21,,RUE,DE MALZEVILLE,54130,DOMMARTEMONT,,,54165,,,,,,,,,,,,,,,,,,,2001-06-30,F,,,,,70.2A,NAF1993,N,6.211659,48.711717,0.94,housenumber,21 Rue de Malzeville 54130 Dommartemont,54165_0100_00021,G,21 RUE DE MALZEVILLE,
350135919,00016,35013591900016,O,1989-03-29,NN,,,,false,4,,1,,RUE,DE MALZEVILLE,54130,DOMMARTEMONT,,,54165,,,,,,,,,,,,,,,,,,,2000-09-10,F,,,,,70.2A,NAF1993,N,6.213983,48.712177,0.94,housenumber,1 Rue de Malzeville 54130 Dommartemont,54165_0100_00001,G,1 RUE DE MALZEVILLE,
350658563,00019,35065856300019,O,1989-04-11,NN,,,2009-02-03T20:17:19,true,4,,34,,CHE,D AMANCE,54130,DOMMARTEMONT,,,54165,,,,,,,,,,,,,,,,,,,2008-11-28,F,,,,,68.31Z,NAFRev2,N,6.210951,48.71339,0.94,housenumber,34 Che d'Amance 54130 Dommartemont,54165_0020_00034,G,34 CHE D AMANCE,
350833620,00015,35083362000015,O,,NN,,,,true,1,,4,,RUE,BASSE,54130,DOMMARTEMONT,,,54165,,,,,,,,,,,,,,,,,,,1990-03-27,F,,,,,76.00,NAP,N,6.214285,48.71162,0.94,housenumber,4 Rue Basse 54130 Dommartemont,54165_0040_00004,G,4 RUE BASSE,
350979415,00022,35097941500022,O,,NN,,,,true,1,,34,,CHE,D AMANCE,54130,DOMMARTEMONT,,,54165,,,,,,,,,,,,,,,,,,,1994-12-31,F,,,,,70.3A,NAF1993,O,6.210951,48.71339,0.94,housenumber,34 Che d'Amance 54130 Dommartemont,54165_0020_00034,G,34 CHE D AMANCE,
351016944,00016,35101694400016,O,1989-04-26,NN,,,2020-03-06T19:37:13,true,3,,19,,RUE,SAINTE GENEVIEVE,54130,DOMMARTEMONT,,,54165,,,,,,,,,,,,,,,,,,,2008-01-01,A,,,,,68.20A,NAFRev2,N,6.215456,48.713184,0.94,housenumber,19 Rue Sainte Genevieve 54130 Dommartemont,54165_0180_00019,G,19 RUE SAINTE GENEVIEVE,
351324256,00020,35132425600020,O,2015-04-01,,,,2015-06-04T09:41:55,true,1,,19,,CHE,D AMANCE,54130,DOMMARTEMONT,,,54165,,,,,,,,,,,,,,,,,,,2015-04-01,A,,,,,86.22C,NAFRev2,N,6.211754,48.714052,0.94,housenumber,19 Che d'Amance 54130 Dommartemont,54165_0020_00019,G,19 CHE D AMANCE,
351860333,00035,35186033300035,O,2018-08-25,,,,2020-04-28T03:58:26,true,1,,64,,CHE,D'AMANCE,54130,DOMMARTEMONT,,,54165,,,,,,,,,,,,,,,,,,,2018-08-25,A,,,,,64.20Z,NAFRev2,N,6.214897,48.715702,0.94,housenumber,64 Che d'Amance 54130 Dommartemont,54165_0020_00064,G,64 CHE D AMANCE,
352260566,00034,35226056600034,O,2002-04-01,NN,,,2017-12-27T09:32:27,true,11,,29,,RUE,SAINTE GENEVIEVE,54130,DOMMARTEMONT,,,54165,,,,,,,,,,,,,,,,,,,2018-01-02,A,,,,,46.19B,NAFRev2,N,6.215909,48.713563,0.94,housenumber,29 Rue Sainte Genevieve 54130 Dommartemont,54165_0180_00029,G,29 RUE SAINTE GENEVIEVE,
352340830,00012,35234083000012,O,1989-11-09,NN,,,,true,4,,1,,RUE,DE MALZEVILLE,54130,DOMMARTEMONT,,,54165,,,,,,,,,,,,,,,,,,,1995-12-25,F,,,,,40.1Z,NAF1993,N,6.213983,48.712177,0.94,housenumber,1 Rue de Malzeville 54130 Dommartemont,54165_0100_00001,G,1 RUE DE MALZEVILLE,