siren,nic,siret,statutDiffusionEtablissement,dateCreationEtablissement,trancheEffectifsEtablissement,anneeEffectifsEtablissement,activitePrincipaleRegistreMetiersEtablissement,dateDernierTraitementEtablissement,etablissementSiege,nombrePeriodesEtablissement,complementAdresseEtablissement,numeroVoieEtablissement,indiceRepetitionEtablissement,typeVoieEtablissement,libelleVoieEtablissement,codePostalEtablissement,libelleCommuneEtablissement,libelleCommuneEtrangerEtablissement,distributionSpecialeEtablissement,codeCommuneEtablissement,codeCedexEtablissement,libelleCedexEtablissement,codePaysEtrangerEtablissement,libellePaysEtrangerEtablissement,complementAdresse2Etablissement,numeroVoie2Etablissement,indiceRepetition2Etablissement,typeVoie2Etablissement,libelleVoie2Etablissement,codePostal2Etablissement,libelleCommune2Etablissement,libelleCommuneEtranger2Etablissement,distributionSpeciale2Etablissement,codeCommune2Etablissement,codeCedex2Etablissement,libelleCedex2Etablissement,codePaysEtranger2Etablissement,libellePaysEtranger2Etablissement,dateDebut,etatAdministratifEtablissement,enseigne1Etablissement,enseigne2Etablissement,enseigne3Etablissement,denominationUsuelleEtablissement,activitePrincipaleEtablissement,nomenclatureActivitePrincipaleEtablissement,caractereEmployeurEtablissement,longitude,latitude,geo_score,geo_type,geo_adresse,geo_id,geo_ligne,geo_l4,geo_l5
216100412,00016,21610041200016,O,1983-03-01,02,2017,,2019-11-14T14:00:49,true,4,,,,,LE BOURG,61130,BELLOU-LE-TRICHARD,,,61041,,,,,,,,,,,,,,,,,,,2008-01-01,A,MAIRIE,,,,84.11Z,NAFRev2,O,0.549165,48.26851,0.93,street,Le Bourg 61130 Bellou-le-Trichard,61041_lzxteo,G,LE BOURG,
256103482,00012,25610348200012,O,1992-10-09,NN,,,2019-11-14T14:00:49,true,4,MAIRIE,,,,LE BOURG,61130,BELLOU-LE-TRICHARD,,,61041,,,,,,,,,,,,,,,,,,,2013-12-31,F,,,,,84.12Z,NAFRev2,N,0.549165,48.26851,0.93,street,Le Bourg 61130 Bellou-le-Trichard,61041_lzxteo,G,LE BOURG,
266104405,00011,26610440500011,O,1995-12-25,,,,2019-11-14T14:00:49,true,2,MAIRIE,,,,LE BOURG,61130,BELLOU-LE-TRICHARD,,,61041,,,,,,,,,,,,,,,,,,,2008-01-01,A,CCAS,,,,88.99B,NAFRev2,N,0.549165,48.26851,0.93,street,Le Bourg 61130 Bellou-le-Trichard,61041_lzxteo,G,LE BOURG,
276100591,00011,27610059100011,O,,,,,2019-11-14T14:00:49,true,1,,,,,,61130,BELLOU-LE-TRICHARD,,,61041,,,,,,,,,,,,,,,,,,,1995-05-02,F,,,,,41.0Z,NAF1993,N,,,0,,,,,,
306078528,00024,30607852800024,O,,,,,2019-11-14T14:00:49,true,1,,,,,LE JARDIN,61130,BELLOU-LE-TRICHARD,,,61041,,,,,,,,,,,,,,,,,,,1984-12-25,F,,,,,55.60,NAP,N,0.541729,48.251824,0.46,street,La Bouchardiere 61130 Bellou-le-Trichard,61041_zzx9ku,G,LA BOUCHARDIERE,
316195619,00010,31619561900010,O,,NN,,,2019-11-14T14:00:49,true,1,,,,PL,DE L EGLISE,61130,BELLOU-LE-TRICHARD,,,61041,,,,,,,,,,,,,,,,,,,1986-10-20,F,,,,,67.08,NAP,N,0.54064,48.268632,0.39,street,Champ de l'Etang 61130 Bellou-le-Trichard,61041_b092,G,CHAMP DE L ETANG,
319726584,00018,31972658400018,O,,NN,,,2019-11-14T14:00:49,true,1,,,,LD,GEVRAISE,61130,BELLOU-LE-TRICHARD,,,61041,,,,,,,,,,,,,,,,,,,1988-06-20,F,,,,,65.06,NAP,N,0.553726,48.276302,0.93,street,Gevraise 61130 Bellou-le-Trichard,61041_lv609j,G,GEVRAISE,
320071822,00011,32007182200011,O,,NN,,,2019-11-14T14:00:49,true,1,,,,,LA JOUSTIERE,61130,BELLOU-LE-TRICHARD,,,61041,,,,,,,,,,,,,,,,,,,,F,,,,,55.70,NAP,N,0.553151,48.266777,0.93,street,La Joustiere 61130 Bellou-le-Trichard,61041_kxjwmr,G,LA JOUSTIERE,
325968410,00028,32596841000028,O,1986-04-01,01,2017,4322BA,2019-11-14T14:00:49,true,6,,,,,LA MASURE,61130,BELLOU-LE-TRICHARD,,,61041,,,,,,,,,,,,,,,,,,,2008-01-01,A,,,,,43.22A,NAFRev2,O,0.559911,48.262895,0.93,street,La Masure 61130 Bellou-le-Trichard,61041_88ito5,G,LA MASURE,
329056980,00025,32905698000025,O,1990-12-05,NN,,,2019-11-14T14:00:49,true,3,,,,,LE SABLON,61130,BELLOU-LE-TRICHARD,,,61041,,,,,,,,,,,,,,,,,,,1994-06-15,F,,,,,01.1A,NAF1993,N,0.543013,48.262746,0.93,street,Le Sablon 61130 Bellou-le-Trichard,61041_pchlbk,G,LE SABLON,
331307355,00023,33130735500023,O,2009-03-03,,,,2019-11-14T14:00:49,true,2,,,,,CHAMP SAUVAGE,61130,BELLOU-LE-TRICHARD,,,61041,,,,,,,,,,,,,,,,,,,2011-07-01,F,,,,,43.22A,NAFRev2,N,0.568488,48.269948,0.93,street,Champ Sauvage 61130 Bellou-le-Trichard,61041_b180,G,CHAMP SAUVAGE,
333581692,00014,33358169200014,O,,NN,,,2019-11-14T14:00:49,true,1,,,,,LA HAUTE BLATRIE,61130,BELLOU-LE-TRICHARD,,,61041,,,,,,,,,,,,,,,,,,,1988-10-31,F,,,,,01.1A,NAF1993,N,0.546886,48.286099,0.93,street,La Haute Blatrie 61130 Bellou-le-Trichard,61041_b277,G,LA HAUTE BLATRIE,
343217857,00030,34321785700030,O,2003-05-01,NN,,,2019-11-14T14:00:49,false,4,,,,,LAUSERAIE,61130,BELLOU-LE-TRICHARD,,,61041,,,,,,,,,,,,,,,,,,,2009-12-31,F,,,,,90.03B,NAFRev2,N,0.565305,48.268577,0.93,street,Lauseraie 61130 Bellou-le-Trichard,61041_939fbu,G,LAUSERAIE,
348566704,00014,34856670400014,O,,NN,,,2019-11-14T14:00:49,true,1,,,,PL,DE L'EGLISE,61130,BELLOU-LE-TRICHARD,,,61041,,,,,,,,,,,,,,,,,,,1989-10-31,F,,,,,67.01,NAP,N,0.54064,48.268632,0.39,street,Champ de l'Etang 61130 Bellou-le-Trichard,61041_b092,G,CHAMP DE L ETANG,
349264556,00011,34926455600011,O,1988-11-01,NN,,,2019-11-14T14:00:49,true,4,,,,,LA HAUTE BLATRIE,61130,BELLOU-LE-TRICHARD,,,61041,,,,,,,,,,,,,,,,,,,2004-02-29,F,,,,,01.2A,NAFRev1,N,0.546886,48.286099,0.93,street,La Haute Blatrie 61130 Bellou-le-Trichard,61041_b277,G,LA HAUTE BLATRIE,
350782884,00018,35078288400018,O,1957-11-01,NN,,,2019-11-14T14:00:49,true,3,,,,,VEAU SOURIS,61130,BELLOU-LE-TRICHARD,,,61041,,,,,,,,,,,,,,,,,,,2005-12-25,F,,,,,01.1A,NAFRev1,N,0.554464,48.26191,0.79,street,Veau Souri 61130 Bellou-le-Trichard,61041_b410,G,VEAU SOURI,
352504518,00015,35250451800015,O,1989-10-31,NN,,,2019-11-14T14:00:49,true,4,,,,PL,DE L'EGLISE,61130,BELLOU-LE-TRICHARD,,,61041,,,,,,,,,,,,,,,,,,,1998-12-07,F,,,,,55.3A,NAF1993,N,0.54064,48.268632,0.39,street,Champ de l'Etang 61130 Bellou-le-Trichard,61041_b092,G,CHAMP DE L ETANG,
378339618,00019,37833961800019,O,1989-08-01,,,,2019-11-14T14:00:49,true,1,,,,,LA CORMIER,61130,BELLOU-LE-TRICHARD,,,61041,,,,,,,,,,,,,,,,,,,1999-12-31,F,,,,,01.1A,NAF1993,N,0.556843,48.260748,0.68,street,Le Cormier 61130 Bellou-le-Trichard,61041_qh3rz4,G,LE CORMIER,
378459655,00015,37845965500015,O,1989-01-01,NN,,,2019-11-14T14:00:49,true,3,,,,,MONTHORIN,61130,BELLOU-LE-TRICHARD,,,61041,,,,,,,,,,,,,,,,,,,1996-01-01,F,,,,,01.1A,NAF1993,N,0.562695,48.268044,0.93,street,Monthorin 61130 Bellou-le-Trichard,61041_iz06pj,G,MONTHORIN,
382111532,00018,38211153200018,O,1991-01-10,NN,,,2019-11-14T14:00:49,true,3,,,,,LES ARPENTS,61130,BELLOU-LE-TRICHARD,,,61041,,,,,,,,,,,,,,,,,,,2008-01-01,A,,,,,01.41Z,NAFRev2,N,0.560972,48.252686,0.69,street,Les Arpens des Alleux 61130 Bellou-le-Trichard,61041_b004,G,LES ARPENS DES ALLEUX,
382262624,00010,38226262400010,O,1988-07-07,,,,2019-11-14T14:00:49,true,4,,,,,CHAMP SAUVAGE,61130,BELLOU-LE-TRICHARD,,,61041,,,,,,,,,,,,,,,,,,,1997-09-01,F,,,,,55.2E,NAF1993,N,0.568488,48.269948,0.93,street,Champ Sauvage 61130 Bellou-le-Trichard,61041_b180,G,CHAMP SAUVAGE,
382757615,00036,38275761500036,O,2004-03-08,NN,,,2019-11-14T14:00:49,true,4,HAMEAU DE BOIS VALLIERE,,,,LE SABLON,61130,BELLOU-LE-TRICHARD,,,61041,,,,,,,,,,,,,,,,,,,2015-11-30,F,,,,,68.20B,NAFRev2,N,0.543013,48.262746,0.93,street,Le Sablon 61130 Bellou-le-Trichard,61041_pchlbk,G,LE SABLON,
383170933,00014,38317093300014,O,1990-01-01,NN,,,2019-11-14T14:00:49,true,6,,,,,LA COUR,61130,BELLOU-LE-TRICHARD,,,61041,,,,,,,,,,,,,,,,,,,2015-07-01,F,,,,,01.29Z,NAFRev2,N,0.546924,48.268224,0.9,street,Cour de la Charbonnerie 61130 Bellou-le-Trichard,61041_0010,G,COUR DE LA CHARBONNERIE,
388350571,00013,38835057100013,O,,NN,,,2019-11-14T14:00:49,true,1,,,,,LE BOURG,61130,BELLOU-LE-TRICHARD,,,61041,,,,,,,,,,,,,,,,,,,1993-12-31,F,,,,,45.2V,NAF1993,O,0.549165,48.26851,0.93,street,Le Bourg 61130 Bellou-le-Trichard,61041_lzxteo,G,LE BOURG,
391391653,00220,39139165300220,O,2003-10-01,NN,,,2019-11-14T14:00:49,false,3,MARCHAND SAMUEL,,,,LA COUR,61130,BELLOU-LE-TRICHARD,,,61041,,,,,,,,,,,,,,,,,,,2005-01-01,F,,,,,51.1L,NAFRev1,O,0.546924,48.268224,0.9,street,Cour de la Charbonnerie 61130 Bellou-le-Trichard,61041_0010,G,COUR DE LA CHARBONNERIE,
393726666,00018,39372666600018,O,1989-01-01,NN,,,2019-11-14T14:00:49,true,4,,,,,LES ARPENTS,61130,BELLOU-LE-TRICHARD,,,61041,,,,,,,,,,,,,,,,,,,2003-10-20,F,,,,,01.1A,NAFRev1,N,0.560972,48.252686,0.69,street,Les Arpens des Alleux 61130 Bellou-le-Trichard,61041_b004,G,LES ARPENS DES ALLEUX,
401365341,00015,40136534100015,O,1994-01-01,NN,,,2019-11-14T14:00:49,false,3,,,,,LA DURANDIERE,61130,BELLOU-LE-TRICHARD,,,61041,,,,,,,,,,,,,,,,,,,2001-04-30,F,,,,,01.2A,NAF1993,N,0.550755,48.251966,0.93,street,La Durandiere 61130 Bellou-le-Trichard,61041_iaer62,G,LA DURANDIERE,
402434617,00021,40243461700021,O,1999-01-01,NN,,,2019-11-14T14:00:49,true,3,,,,,LE SABLON,61130,BELLOU-LE-TRICHARD,,,61041,,,,,,,,,,,,,,,,,,,2005-04-11,F,,,,,60.2M,NAFRev1,O,0.543013,48.262746,0.93,street,Le Sablon 61130 Bellou-le-Trichard,61041_pchlbk,G,LE SABLON,
404086696,00022,40408669600022,O,1995-12-20,NN,,,2019-11-14T14:00:49,false,3,,,,,LES ARPENS,61130,BELLOU-LE-TRICHARD,,,61041,,,,,,,,,,,,,,,,,,,2008-01-01,A,,,,,02.20Z,NAFRev2,N,0.560972,48.252686,0.91,street,Les Arpens des Alleux 61130 Bellou-le-Trichard,61041_b004,G,LES ARPENS DES ALLEUX,
407840248,00014,40784024800014,O,1996-06-21,NN,,,2019-11-14T14:00:49,true,3,,,,,,61130,BELLOU-LE-TRICHARD,,,61041,,,,,,,,,,,,,,,,,,,2008-01-01,A,,,,,68.20B,NAFRev2,N,,,0,,,,,,
408593028,00041,40859302800041,O,2006-07-01,,,,2019-11-14T14:00:49,false,3,LA BERTINIERE,,,,,61130,BELLOU-LE-TRICHARD,,,61041,,,,,,,,,,,,,,,,,,,2012-12-31,F,,,,,90.01Z,NAFRev2,N,0.540649,48.26603,0.93,street,La Bertiniere 61130 Bellou-le-Trichard,61041_f19f8e,D,LA BERTINIERE,
408593028,00058,40859302800058,O,2014-10-01,,,,2019-11-14T14:00:49,false,1,,,,,LA BERTINIERE,61130,BELLOU-LE-TRICHARD,,,61041,,,,,,,,,,,,,,,,,,,2014-10-01,A,,,,,90.03A,NAFRev2,N,0.540649,48.26603,0.93,street,La Bertiniere 61130 Bellou-le-Trichard,61041_f19f8e,G,LA BERTINIERE,
413320060,00010,41332006000010,O,1988-12-31,NN,,,2019-11-14T14:00:49,true,1,,,,,LA RENAUDIERE,61130,BELLOU-LE-TRICHARD,,,61041,,,,,,,,,,,,,,,,,,,2000-12-31,F,,,,,01.1A,NAF1993,N,0.536196,48.273034,0.93,street,La Renaudiere 61130 Bellou-le-Trichard,61041_ldqpg9,G,LA RENAUDIERE,
414405027,00023,41440502700023,O,2001-07-26,NN,,,2019-11-14T14:00:49,false,3,,,,,LA CHENEE,61130,BELLOU-LE-TRICHARD,,,61041,,,,,,,,,,,,,,,,,,,2007-03-20,F,,,,,45.2V,NAFRev1,N,0.546924,48.268224,0.46,street,Cour de la Charbonnerie 61130 Bellou-le-Trichard,61041_0010,G,COUR DE LA CHARBONNERIE,
414405027,00031,41440502700031,O,2007-03-20,,,4399CZ,2019-11-14T14:00:49,true,4,,,,,MONTHORIN,61130,BELLOU-LE-TRICHARD,,,61041,,,,,,,,,,,,,,,,,,,2014-11-24,A,,,,,43.99C,NAFRev2,N,0.562695,48.268044,0.93,street,Monthorin 61130 Bellou-le-Trichard,61041_iz06pj,G,MONTHORIN,
418706024,00019,41870602400019,O,1993-01-01,NN,,,2019-11-14T14:00:49,false,4,,,,,LAUSERAIE,61130,BELLOU-LE-TRICHARD,,,61041,,,,,,,,,,,,,,,,,,,2012-05-02,F,,,,,96.09Z,NAFRev2,N,0.565305,48.268577,0.93,street,Lauseraie 61130 Bellou-le-Trichard,61041_939fbu,G,LAUSERAIE,
421754094,00025,42175409400025,O,2014-04-01,,,,2019-11-14T14:00:49,true,1,,,,,LIEUDIT LE SABLON,61130,BELLOU-LE-TRICHARD,,,61041,,,,,,,,,,,,,,,,,,,2014-04-01,A,,,,,68.20B,NAFRev2,N,0.543013,48.262746,0.93,street,Le Sablon 61130 Bellou-le-Trichard,61041_pchlbk,G,LE SABLON,
428070593,00010,42807059300010,O,1976-01-01,NN,,,2019-11-14T14:00:49,true,3,,,,,,61130,BELLOU-LE-TRICHARD,,,61041,,,,,,,,,,,,,,,,,,,2008-01-01,A,,,,,01.50Z,NAFRev2,N,,,0,,,,,,
429172349,00012,42917234900012,O,2000-01-01,NN,,,2019-11-14T14:00:49,true,5,,,,,LA CORMIER,61130,BELLOU-LE-TRICHARD,,,61041,,,,,,,,,,,,,,,,,,,2017-10-01,F,,,,,01.50Z,NAFRev2,N,0.556843,48.260748,0.68,street,Le Cormier 61130 Bellou-le-Trichard,61041_qh3rz4,G,LE CORMIER,
429507387,00018,42950738700018,O,1997-01-01,NN,,,2019-11-14T14:00:49,true,3,,,,,LE BOURG,61130,BELLOU-LE-TRICHARD,,,61041,,,,,,,,,,,,,,,,,,,2001-12-31,F,,,,,91.3E,NAF1993,N,0.549165,48.26851,0.93,street,Le Bourg 61130 Bellou-le-Trichard,61041_lzxteo,G,LE BOURG,
429591506,00010,42959150600010,O,2000-03-06,NN,,,2019-11-14T14:00:49,false,3,,,,,LE SABLON,61130,BELLOU-LE-TRICHARD,,,61041,,,,,,,,,,,,,,,,,,,2004-01-01,F,,,,,01.4A,NAFRev1,N,0.543013,48.262746,0.93,street,Le Sablon 61130 Bellou-le-Trichard,61041_pchlbk,G,LE SABLON,
430227611,00018,43022761100018,O,2000-04-05,NN,,4334ZC,2019-11-14T14:00:49,true,3,,,,,LE BOURG,61130,BELLOU-LE-TRICHARD,,,61041,,,,,,,,,,,,,,,,,,,2008-01-01,A,,,,,43.34Z,NAFRev2,N,0.549165,48.26851,0.93,street,Le Bourg 61130 Bellou-le-Trichard,61041_lzxteo,G,LE BOURG,
430468678,00015,43046867800015,O,2000-05-02,NN,,,2019-11-14T14:00:49,true,6,,,,,LE BOURG,61130,BELLOU-LE-TRICHARD,,,61041,,,,,,,,,,,,,,,,,,,2015-02-01,F,,,,,90.03B,NAFRev2,N,0.549165,48.26851,0.93,street,Le Bourg 61130 Bellou-le-Trichard,61041_lzxteo,G,LE BOURG,
433096369,00015,43309636900015,O,1989-01-01,NN,,,2019-11-14T14:00:49,true,3,,,,,VEAU SOURIS,61130,BELLOU-LE-TRICHARD,,,61041,,,,,,,,,,,,,,,,,,,2008-01-01,A,,,,,01.42Z,NAFRev2,N,0.554464,48.26191,0.79,street,Veau Souri 61130 Bellou-le-Trichard,61041_b410,G,VEAU SOURI,
434761672,00022,43476167200022,O,2003-07-01,NN,,,2019-11-14T14:00:49,false,4,,,,,LE SABLON,61130,BELLOU-LE-TRICHARD,,,61041,,,,,,,,,,,,,,,,,,,2014-04-01,F,,,,,93.29Z,NAFRev2,N,0.543013,48.262746,0.93,street,Le Sablon 61130 Bellou-le-Trichard,61041_pchlbk,G,LE SABLON,
438101727,00016,43810172700016,O,1946-06-15,02,2017,,2019-11-14T14:00:49,true,3,,,,,LE BAS MONTHORIN,61130,BELLOU-LE-TRICHARD,,,61041,,,,,,,,,,,,,,,,,,,2008-01-01,A,,,,,90.01Z,NAFRev2,O,0.562695,48.268044,0.63,street,Monthorin 61130 Bellou-le-Trichard,61041_iz06pj,G,MONTHORIN,
440802510,00014,44080251000014,O,2002-01-15,NN,,4391AZ,2020-05-13T14:36:41,true,4,,,,,LE BOURG,61130,BELLOU-LE-TRICHARD,,,61041,,,,,,,,,,,,,,,,,,,2019-10-28,A,,,,,43.91B,NAFRev2,O,0.549165,48.26851,0.93,street,Le Bourg 61130 Bellou-le-Trichard,61041_lzxteo,G,LE BOURG,
442284618,00018,44228461800018,O,2002-06-10,NN,,,2019-11-20T14:43:08,true,3,,,,,LE CHARNOIS,61130,BELLOU-LE-TRICHARD,,,61041,,,,,,,,,,,,,,,,,,,2008-01-01,A,,,,,68.20B,NAFRev2,N,0.53488,48.26218,0.54,street,Le Charmoie 61130 Bellou-le-Trichard,61041_b03lll,G,LE CHARMOIE,
443106026,00018,44310602600018,O,1992-10-14,NN,,,2019-11-14T14:00:49,true,3,,,,,LA GUILLERIE,61130,BELLOU-LE-TRICHARD,,,61041,,,,,,,,,,,,,,,,,,,2008-01-01,A,,,,,01.43Z,NAFRev2,N,0.544603,48.262037,0.72,street,Le Guillerie 61130 Bellou-le-Trichard,61041_5ru99y,G,LE GUILLERIE,
445265341,00013,44526534100013,O,2003-01-23,NN,,,2019-11-14T14:00:49,true,3,CHEZ MR ET MME SCHNEIDER,,,,LE CHAMP BOVINIERE,61130,BELLOU-LE-TRICHARD,,,61041,,,,,,,,,,,,,,,,,,,2008-01-01,A,,,,,68.20B,NAFRev2,N,0.535377,48.270681,0.84,street,Le Champ Boivinière 61130 Bellou-le-Trichard,61041_b077,G,LE CHAMP BOIVINIERE,
449899905,00011,44989990500011,O,2000-04-25,NN,,,2019-11-14T14:00:49,true,3,,,,,PRES LE BOURG,61130,BELLOU-LE-TRICHARD,,,61041,,,,,,,,,,,,,,,,,,,2008-01-01,A,,,,,94.99Z,NAFRev2,N,0.549165,48.26851,0.63,street,Le Bourg 61130 Bellou-le-Trichard,61041_lzxteo,G,LE BOURG,
450090642,00023,45009064200023,O,2017-09-01,,,,2019-11-14T14:00:49,true,2,,,,,LA BOISSIERE,61130,BELLOU-LE-TRICHARD,,,61041,,,,,,,,,,,,,,,,,,,2017-09-16,A,,,,,59.11A,NAFRev2,N,0.540613,48.276481,0.93,street,La Boissiere 61130 Bellou-le-Trichard,61041_ge2nxo,G,LA BOISSIERE,
452765373,00017,45276537300017,O,2004-03-01,NN,,,2019-11-14T14:00:49,true,4,,,,,LA HAUTE BLATRIE,61130,BELLOU-LE-TRICHARD,,,61041,,,,,,,,,,,,,,,,,,,2016-01-01,A,,,,,68.20B,NAFRev2,O,0.546886,48.286099,0.93,street,La Haute Blatrie 61130 Bellou-le-Trichard,61041_b277,G,LA HAUTE BLATRIE,
487970030,00028,48797003000028,O,2010-08-03,,,,2019-11-14T14:00:49,true,1,CHEZ MARIE JOSE FLAHAULT,,,,LE BOURG,61130,BELLOU-LE-TRICHARD,,,61041,,,,,,,,,,,,,,,,,,,2010-08-03,A,,,,,94.99Z,NAFRev2,N,0.549165,48.26851,0.93,street,Le Bourg 61130 Bellou-le-Trichard,61041_lzxteo,G,LE BOURG,
492295100,00019,49229510000019,O,2006-10-01,,,,2019-11-14T14:00:49,true,2,,,,,LE BOURG,61130,BELLOU-LE-TRICHARD,,,61041,,,,,,,,,,,,,,,,,,,2008-01-01,A,,,,,68.20B,NAFRev2,N,0.549165,48.26851,0.93,street,Le Bourg 61130 Bellou-le-Trichard,61041_lzxteo,G,LE BOURG,
494110141,00012,49411014100012,O,2007-02-01,,,,2019-11-14T14:00:49,false,3,LE SABLON,,,,HAMEAU DE BOIS VALLIERE,61130,BELLOU-LE-TRICHARD,,,61041,,,,,,,,,,,,,,,,,,,2014-06-28,F,,,,,71.11Z,NAFRev2,N,0.540613,48.276481,0.33,street,La Boissiere 61130 Bellou-le-Trichard,61041_ge2nxo,G,LA BOISSIERE,
498872480,00013,49887248000013,O,2007-07-01,,,,2019-11-14T14:00:49,true,2,,,,,LA RENARDIERE,61130,BELLOU-LE-TRICHARD,,,61041,,,,,,,,,,,,,,,,,,,2008-01-01,A,,,,,68.20B,NAFRev2,N,0.568826,48.258394,0.93,street,La Renardiere 61130 Bellou-le-Trichard,61041_q1174r,G,LA RENARDIERE,
505183772,00027,50518377200027,O,2019-01-01,,,,2019-11-14T14:00:49,true,1,,,,,LA GENNETIERE,61130,BELLOU-LE-TRICHARD,,,61041,,,,,,,,,,,,,,,,,,,2019-01-01,A,,,,,68.20B,NAFRev2,N,0.542024,48.27992,0.93,street,La Gennetiere 61130 Bellou-le-Trichard,61041_dns1zf,G,LA GENNETIERE,
508060258,00011,50806025800011,O,2007-01-01,,,,2019-11-14T14:00:49,true,1,,,,,GEVRAISE,61130,BELLOU-LE-TRICHARD,,,61041,,,,,,,,,,,,,,,,,,,2007-01-01,A,,,,,02.20Z,NAFRev2,N,0.553726,48.276302,0.93,street,Gevraise 61130 Bellou-le-Trichard,61041_lv609j,G,GEVRAISE,
513825000,00021,51382500000021,O,2011-01-01,,,,2019-11-14T14:00:49,true,1,LE BOURG,,,,LE CHAMP DES CAILLOUX,61130,BELLOU-LE-TRICHARD,,,61041,,,,,,,,,,,,,,,,,,,2011-01-01,A,,,,,25.50A,NAFRev2,N,0.571845,48.246704,0.93,street,Le Champ des Cailloux 61130 Bellou-le-Trichard,61041_b127,G,LE CHAMP DES CAILLOUX,
522019082,00018,52201908200018,O,2010-05-01,,,,2019-11-14T14:00:49,true,2,,,,,LES ARPENTS,61130,BELLOU-LE-TRICHARD,,,61041,,,,,,,,,,,,,,,,,,,2014-08-10,F,,,,,62.02B,NAFRev2,N,0.560972,48.252686,0.69,street,Les Arpens des Alleux 61130 Bellou-le-Trichard,61041_b004,G,LES ARPENS DES ALLEUX,
530196104,00018,53019610400018,O,2011-02-21,,,,2019-11-14T14:00:49,true,1,,,,,LA HAUTE BLATRIE,61130,BELLOU-LE-TRICHARD,,,61041,,,,,,,,,,,,,,,,,,,2011-02-21,F,,,,,47.89Z,NAFRev2,N,0.546886,48.286099,0.93,street,La Haute Blatrie 61130 Bellou-le-Trichard,61041_b277,G,LA HAUTE BLATRIE,
536541568,00013,53654156800013,O,1965-01-01,NN,,,2019-11-14T14:00:49,true,1,,,,,LE BOURG,61130,BELLOU-LE-TRICHARD,,,61041,,,,,,,,,,,,,,,,,,,1998-12-31,F,,,,,28.4A,NAF1993,N,0.549165,48.26851,0.93,street,Le Bourg 61130 Bellou-le-Trichard,61041_lzxteo,G,LE BOURG,
539655449,00038,53965544900038,O,2014-12-01,,,,2020-03-06T10:13:59,false,3,,,,,LA HAUTE BLATRIE,61130,BELLOU-LE-TRICHARD,,,61041,,,,,,,,,,,,,,,,,,,2015-10-01,F,,,,,90.03B,NAFRev2,N,0.546886,48.286099,0.93,street,La Haute Blatrie 61130 Bellou-le-Trichard,61041_b277,G,LA HAUTE BLATRIE,
722940343,00048,72294034300048,O,1990-01-01,NN,,,2019-11-14T14:00:49,true,1,,,,LD,LA PELLETERIE,61130,BELLOU-LE-TRICHARD,,,61041,,,,,,,,,,,,,,,,,,,1999-06-30,F,,,,,71.4B,NAF1993,N,0.551194,48.26789,0.75,street,La Pelletrie 61130 Bellou-le-Trichard,61041_cufpar,G,LA PELLETRIE,
751730904,00016,75173090400016,O,2012-05-10,,,3831ZA,2019-11-14T14:00:49,true,1,,,,RUE,LA CROIX GAILLARD,61130,BELLOU-LE-TRICHARD,,,61041,,,,,,,,,,,,,,,,,,,2012-05-10,A,,,,,38.32Z,NAFRev2,N,0.545935,48.268181,0.4,street,Rue de la Saboterie 61130 Bellou-le-Trichard,61041_0050,G,RUE DE LA SABOTERIE,
780943791,00019,78094379100019,O,1900-01-01,NN,,,2019-11-14T14:00:49,true,3,,,,,MAIRIE,61130,BELLOU-LE-TRICHARD,,,61041,,,,,,,,,,,,,,,,,,,2008-01-01,A,,,,,01.61Z,NAFRev2,N,0.546924,48.268224,0.37,street,Cour de la Charbonnerie 61130 Bellou-le-Trichard,61041_0010,G,COUR DE LA CHARBONNERIE,
780943809,00019,78094380900019,O,,NN,,,2019-11-14T14:00:49,true,1,,,,,,61130,BELLOU-LE-TRICHARD,,,61041,,,,,,,,,,,,,,,,,,,,F,,,,,55.71,NAP,N,,,0,,,,,,
780943817,00012,78094381700012,O,,NN,,,2019-11-14T14:00:49,true,1,,,,,LES ARPENTS,61130,BELLOU-LE-TRICHARD,,,61041,,,,,,,,,,,,,,,,,,,1996-06-09,F,,,,,01.3Z,NAF1993,N,0.560972,48.252686,0.69,street,Les Arpens des Alleux 61130 Bellou-le-Trichard,61041_b004,G,LES ARPENS DES ALLEUX,
780943825,00015,78094382500015,O,,NN,,,2019-11-14T14:00:49,true,1,,,,,,61130,BELLOU-LE-TRICHARD,,,61041,,,,,,,,,,,,,,,,,,,,F,,,,,67.02,NAP,N,,,0,,,,,,
794526251,00010,79452625100010,O,2013-08-01,,,,2019-11-14T14:00:49,true,1,,,,,LE BOURG,61130,BELLOU-LE-TRICHARD,,,61041,,,,,,,,,,,,,,,,,,,2013-08-01,A,,,,,68.20B,NAFRev2,N,0.549165,48.26851,0.93,street,Le Bourg 61130 Bellou-le-Trichard,61041_lzxteo,G,LE BOURG,
799962139,00025,79996213900025,O,2014-03-15,,,,2019-11-14T14:00:49,true,1,,,,LD,LES SABLON,61130,BELLOU-LE-TRICHARD,,,61041,,,,,,,,,,,,,,,,,,,2014-03-15,A,,,,,64.20Z,NAFRev2,N,0.543013,48.262746,0.69,street,Le Sablon 61130 Bellou-le-Trichard,61041_pchlbk,G,LE SABLON,
800620536,00014,80062053600014,O,2014-02-18,,,,2020-03-25T03:39:18,true,2,,,,,LIEUDIT LE SABLON,61130,BELLOU-LE-TRICHARD,,,61041,,,,,,,,,,,,,,,,,,,2019-12-31,F,,,,,96.09Z,NAFRev2,N,0.543013,48.262746,0.93,street,Le Sablon 61130 Bellou-le-Trichard,61041_pchlbk,G,LE SABLON,
800717860,00012,80071786000012,O,2014-02-18,01,2017,,2019-11-14T14:00:49,true,2,,,,LD,LE SABLON,61130,BELLOU-LE-TRICHARD,,,61041,,,,,,,,,,,,,,,,,,,2014-12-31,A,,,,,01.43Z,NAFRev2,O,0.543013,48.262746,0.93,street,Le Sablon 61130 Bellou-le-Trichard,61041_pchlbk,G,LE SABLON,
803338938,00019,80333893800019,O,2014-04-01,,,,2020-02-26T03:54:07,true,1,,,,LD,LE SABLON,61130,BELLOU-LE-TRICHARD,,,61041,,,,,,,,,,,,,,,,,,,2014-04-01,A,,,,,68.20B,NAFRev2,N,0.543013,48.262746,0.93,street,Le Sablon 61130 Bellou-le-Trichard,61041_pchlbk,G,LE SABLON,
804164713,00021,80416471300021,O,2016-08-05,,,,2019-11-14T14:00:49,true,1,,,,,LIEUDIT LA THORIERE,61130,BELLOU-LE-TRICHARD,,,61041,,,,,,,,,,,,,,,,,,,2016-08-05,A,,,,,82.99Z,NAFRev2,N,0.541952,48.276387,0.93,street,La Thoriere 61130 Bellou-le-Trichard,61041_4wlez6,G,LA THORIERE,
810036764,00019,81003676400019,O,2015-02-01,01,2016,,2019-12-05T09:29:16,true,1,,,,,LA HAUTE BLATRIE,61130,BELLOU-LE-TRICHARD,,,61041,,,,,,,,,,,,,,,,,,,2015-02-01,A,,,,,01.50Z,NAFRev2,O,0.546886,48.286099,0.93,street,La Haute Blatrie 61130 Bellou-le-Trichard,61041_b277,G,LA HAUTE BLATRIE,
817840176,00017,81784017600017,O,2007-05-30,,,,2019-11-14T14:00:49,true,1,,,,,LA RENARDIERE,61130,BELLOU-LE-TRICHARD,,,61041,,,,,,,,,,,,,,,,,,,2007-05-30,A,,,,,68.20A,NAFRev2,N,0.568826,48.258394,0.93,street,La Renardiere 61130 Bellou-le-Trichard,61041_q1174r,G,LA RENARDIERE,
839582962,00016,83958296200016,O,2018-04-12,,,,2019-11-14T14:00:49,true,1,,,,,MONTHORIN,61130,BELLOU-LE-TRICHARD,,,61041,,,,,,,,,,,,,,,,,,,2018-04-12,A,,,,,64.99Z,NAFRev2,N,0.562695,48.268044,0.93,street,Monthorin 61130 Bellou-le-Trichard,61041_iz06pj,G,MONTHORIN,
849195169,00016,84919516900016,O,2019-03-18,,,,2019-11-14T14:00:49,true,1,,,,,LA BUCHERE,61130,BELLOU-LE-TRICHARD,,,61041,,,,,,,,,,,,,,,,,,,2019-03-18,A,,,,,68.20B,NAFRev2,N,0.566219,48.265441,0.93,street,La Buchere 61130 Bellou-le-Trichard,61041_yy4h4m,G,LA BUCHERE,
881902357,00014,88190235700014,O,2020-03-01,,,,2020-02-25T15:33:42,true,1,,,,,LA HAUTE BLATRIE,61130,BELLOU-LE-TRICHARD,,,61041,,,,,,,,,,,,,,,,,,,2020-03-01,A,LPW PASSION,,,LPW PASSION,45.40Z,NAFRev2,N,0.546886,48.286099,0.93,street,La Haute Blatrie 61130 Bellou-le-Trichard,61041_b277,G,LA HAUTE BLATRIE,
