siren,nic,siret,statutDiffusionEtablissement,dateCreationEtablissement,trancheEffectifsEtablissement,anneeEffectifsEtablissement,activitePrincipaleRegistreMetiersEtablissement,dateDernierTraitementEtablissement,etablissementSiege,nombrePeriodesEtablissement,complementAdresseEtablissement,numeroVoieEtablissement,indiceRepetitionEtablissement,typeVoieEtablissement,libelleVoieEtablissement,codePostalEtablissement,libelleCommuneEtablissement,libelleCommuneEtrangerEtablissement,distributionSpecialeEtablissement,codeCommuneEtablissement,codeCedexEtablissement,libelleCedexEtablissement,codePaysEtrangerEtablissement,libellePaysEtrangerEtablissement,complementAdresse2Etablissement,numeroVoie2Etablissement,indiceRepetition2Etablissement,typeVoie2Etablissement,libelleVoie2Etablissement,codePostal2Etablissement,libelleCommune2Etablissement,libelleCommuneEtranger2Etablissement,distributionSpeciale2Etablissement,codeCommune2Etablissement,codeCedex2Etablissement,libelleCedex2Etablissement,codePaysEtranger2Etablissement,libellePaysEtranger2Etablissement,dateDebut,etatAdministratifEtablissement,enseigne1Etablissement,enseigne2Etablissement,enseigne3Etablissement,denominationUsuelleEtablissement,activitePrincipaleEtablissement,nomenclatureActivitePrincipaleEtablissement,caractereEmployeurEtablissement,longitude,latitude,geo_score,geo_type,geo_adresse,geo_id,geo_ligne,geo_l4,geo_l5
216100693,00011,21610069300011,O,1983-03-01,01,2017,,2019-06-24T13:11:25,true,3,,,,,LE BOURG,61430,CAHAN,,,61069,,,,,,,,,,,,,,,,,,,2008-01-01,A,MAIRIE,,,,84.11Z,NAFRev2,N,-0.443876,48.858928,0.93,street,Le Bourg 61430 Cahan,61069_fq65tm,G,LE BOURG,
266104645,00012,26610464500012,O,1995-12-25,,,,2017-08-06T14:14:47,true,3,MAIRIE,,,,LE BOURG,61430,CAHAN,,,61069,,,,,,,,,,,,,,,,,,,2017-08-01,F,CCAS,,,,88.99B,NAFRev2,N,-0.443876,48.858928,0.93,street,Le Bourg 61430 Cahan,61069_fq65tm,G,LE BOURG,
304222227,00031,30422222700031,O,,NN,,,,true,1,,,,,LES FOURNEAUX,61430,CAHAN,,,61069,,,,,,,,,,,,,,,,,,,1992-04-30,F,,,,,51.6L,NAF1993,N,-0.428881,48.865707,0.69,street,Fourneaux 61430 Cahan,61069_g6gnh8,G,FOURNEAUX,
310517164,00029,31051716400029,O,,NN,,,,true,1,,,,,LES PLANCHES,61430,CAHAN,,,61069,,,,,,,,,,,,,,,,,,,1994-02-15,F,,,,,55.1A,NAF1993,N,-0.438662,48.867148,0.91,street,Lieu Dit les Planches 61430 Cahan,61069_gglhr6,G,LIEU DIT LES PLANCHES,
316340702,00018,31634070200018,O,1979-01-01,NN,,,,true,1,,,,,LE BOURG,61430,CAHAN,,,61069,,,,,,,,,,,,,,,,,,,2002-09-30,F,,,,,01.3Z,NAF1993,N,-0.443876,48.858928,0.93,street,Le Bourg 61430 Cahan,61069_fq65tm,G,LE BOURG,
321702193,00038,32170219300038,O,,,,,,true,1,,,,,USINE DE ROCRAY,61430,CAHAN,,,61069,,,,,,,,,,,,,,,,,,,1993-07-22,F,,,,,17.5G,NAF1993,N,,,0,,,,,,
326361938,00011,32636193800011,O,,,,,2007-01-18T09:17:10,true,1,,,,,LES PLANCHES,61430,CAHAN,,,61069,,,,,,,,,,,,,,,,,,,1984-09-01,F,,,,,01.2A,NAF1993,N,-0.438662,48.867148,0.91,street,Lieu Dit les Planches 61430 Cahan,61069_gglhr6,G,LIEU DIT LES PLANCHES,
332610419,00019,33261041900019,O,1985-01-01,NN,,,2007-01-18T09:20:30,true,3,,,,,LE BOURG,61430,CAHAN,,,61069,,,,,,,,,,,,,,,,,,,1998-12-25,F,,,,,01.3Z,NAF1993,N,-0.443876,48.858928,0.93,street,Le Bourg 61430 Cahan,61069_fq65tm,G,LE BOURG,
334495678,00016,33449567800016,O,1986-01-01,NN,,,2013-01-21T14:46:12,true,4,,,,,LE HAMEL,61430,CAHAN,,,61069,,,,,,,,,,,,,,,,,,,2012-11-30,F,,,,,01.41Z,NAFRev2,N,-0.449447,48.858024,0.93,street,Le Hamel 61430 Cahan,61069_dq66w4,G,LE HAMEL,
338142029,00010,33814202900010,O,,NN,,,,true,1,,,,,LES PLANCHES,61430,CAHAN,,,61069,,,,,,,,,,,,,,,,,,,,F,,,,,62.46,NAP,N,-0.438662,48.867148,0.91,street,Lieu Dit les Planches 61430 Cahan,61069_gglhr6,G,LIEU DIT LES PLANCHES,
345046536,00024,34504653600024,O,1988-12-29,11,2017,,2019-06-24T13:33:01,false,5,,,,,,61430,CAHAN,,,61069,,,,,,,,,,,,,,,,,,,2017-12-31,A,,,,,15.20Z,NAFRev2,N,,,0,,,,,,
350389292,00011,35038929200011,O,1989-04-03,NN,,,2012-11-20T05:43:43,true,6,,,,,LA BIJUDE,61430,CAHAN,,,61069,,,,,,,,,,,,,,,,,,,2012-11-16,F,,,,,43.99C,NAFRev2,N,-0.447358,48.843253,0.91,street,Lieu Dit la Bijude 61430 Cahan,61069_gkkng1,G,LIEU DIT LA BIJUDE,
352380653,00019,35238065300019,O,,NN,,,,true,1,,,,,LES PLANCHES,61430,CAHAN,,,61069,,,,,,,,,,,,,,,,,,,1990-06-28,F,,,,,69.23,NAP,N,-0.438662,48.867148,0.91,street,Lieu Dit les Planches 61430 Cahan,61069_gglhr6,G,LIEU DIT LES PLANCHES,
375750205,00011,37575020500011,O,,,,,,true,1,,,,,DE FOURNEAUX,61430,CAHAN,,,61069,,,,,,,,,,,,,,,,,,,1988-12-29,F,,,,,46.01,NAP,N,-0.428881,48.865707,0.74,street,Fourneaux 61430 Cahan,61069_g6gnh8,G,FOURNEAUX,
382600187,00019,38260018700019,O,1991-06-25,NN,,,,true,4,,,,,,61430,CAHAN,,,61069,,,,,,,,,,,,,,,,,,,1993-12-25,F,,,,,70.2C,NAF1993,N,,,0,,,,,,
385102249,00021,38510224900021,O,2005-02-28,,,,2014-11-13T19:32:12,true,2,,,,LD,SAINT MARC D OUILLY,61430,CAHAN,,,61069,,,,,,,,,,,,,,,,,,,2008-01-01,A,,,,,64.20Z,NAFRev2,N,-0.434852,48.872876,0.93,street,Saint Marc d'Ouilly 61430 Cahan,61069_b313,G,SAINT MARC D OUILLY,
392339628,00019,39233962800019,O,1993-09-05,NN,,,2008-11-08T00:56:06,false,4,,,,,USINE DU ROCRAY,61430,CAHAN,,,61069,,,,,,,,,,,,,,,,,,,1995-12-25,F,,,,,17.5G,NAF1993,O,,,0,,,,,,
392638805,00037,39263880500037,O,1995-11-01,NN,,4321AB,2015-07-04T14:31:56,true,3,,,,,LA BIJUDE,61430,CAHAN,,,61069,,,,,,,,,,,,,,,,,,,2008-01-01,A,,,,,43.21A,NAFRev2,N,-0.447358,48.843253,0.91,street,Lieu Dit la Bijude 61430 Cahan,61069_gkkng1,G,LIEU DIT LA BIJUDE,
394252746,00018,39425274600018,O,,NN,,,,true,1,,,,,LES PLANCHES,61430,CAHAN,,,61069,,,,,,,,,,,,,,,,,,,1995-05-31,F,,,,,55.3A,NAF1993,N,-0.438662,48.867148,0.91,street,Lieu Dit les Planches 61430 Cahan,61069_gglhr6,G,LIEU DIT LES PLANCHES,
398724989,00015,39872498900015,O,1994-10-10,NN,,,,true,4,,,,,,61430,CAHAN,,,61069,,,,,,,,,,,,,,,,,,,1996-12-25,F,,,,,52.4E,NAF1993,N,,,0,,,,,,
403222169,00019,40322216900019,O,1995-11-21,NN,,,2010-02-09T06:18:28,true,3,,,,,LES PLANCHES,61430,CAHAN,,,61069,,,,,,,,,,,,,,,,,,,2008-01-01,A,,,,,68.20B,NAFRev2,N,-0.438662,48.867148,0.91,street,Lieu Dit les Planches 61430 Cahan,61069_gglhr6,G,LIEU DIT LES PLANCHES,
408958320,00017,40895832000017,O,1996-07-15,NN,,,2012-02-09T18:42:59,false,4,,,,,ANCIENNE ROUTE DE BRETAGNE,61430,CAHAN,,,61069,,,,,,,,,,,,,,,,,,,2008-01-01,F,,,,,77.34Z,NAFRev2,N,,,0,,,,,,
413320557,00015,41332055700015,O,,NN,,,,true,1,,,,,LA RIVIERE,61430,CAHAN,,,61069,,,,,,,,,,,,,,,,,,,1997-04-26,F,,,,,01.1A,NAF1993,N,-0.467164,48.868701,0.93,street,La Riviere 61430 Cahan,61069_4wc9q4,G,LA RIVIERE,
413320565,00018,41332056500018,O,1984-12-31,NN,,,2008-01-04T22:31:54,true,3,,,,,L-ETRE DUMONT,61430,CAHAN,,,61069,,,,,,,,,,,,,,,,,,,2008-01-01,A,,,,,01.41Z,NAFRev2,N,-0.44502,48.865663,0.91,street,Lieu Dit l'Etre Dumont 61430 Cahan,61069_b154,G,LIEU DIT L ETRE DUMONT,
423387919,00016,42338791900016,O,1999-04-01,NN,,,2008-01-05T00:36:43,true,3,,,,,LA FORET,61430,CAHAN,,,61069,,,,,,,,,,,,,,,,,,,2008-01-01,A,,,,,90.03B,NAFRev2,N,-0.450261,48.854234,0.93,street,La Foret 61430 Cahan,61069_3oild6,G,LA FORET,
428069744,00012,42806974400012,O,1974-01-01,NN,,,2008-01-05T01:21:54,true,3,,,,,,61430,CAHAN,,,61069,,,,,,,,,,,,,,,,,,,2008-01-01,A,,,,,01.11Z,NAFRev2,N,,,0,,,,,,
432858405,00025,43285840500025,O,2000-01-01,NN,,,2007-11-07T05:46:46,false,3,,,,,LES HAUTS MONTS,61430,CAHAN,,,61069,,,,,,,,,,,,,,,,,,,2007-05-15,F,,,,,45.1A,NAFRev1,N,,,0,,,,,,
433556941,00014,43355694100014,O,2000-10-02,NN,,4520AA,2014-06-27T00:35:58,true,3,,,,,LES FOURNEAUX,61430,CAHAN,,,61069,,,,,,,,,,,,,,,,,,,2008-01-01,A,,,,,45.20A,NAFRev2,N,-0.428881,48.865707,0.69,street,Fourneaux 61430 Cahan,61069_g6gnh8,G,FOURNEAUX,
438172512,00016,43817251200016,O,2001-05-14,NN,,,2007-02-20T04:23:46,true,3,,,,,LA COUVRIE,61430,CAHAN,,,61069,,,,,,,,,,,,,,,,,,,2006-12-29,F,,,,,70.2C,NAFRev1,N,-0.440281,48.86735,0.41,street,La Basse-cour 61430 Cahan,61069_b006,G,LA BASSE COUR,
438895120,00014,43889512000014,O,1998-09-29,NN,,,2008-01-04T20:22:16,true,3,,,,,LA RIVIERE,61430,CAHAN,,,61069,,,,,,,,,,,,,,,,,,,2008-01-01,A,,,,,01.42Z,NAFRev2,N,-0.467164,48.868701,0.93,street,La Riviere 61430 Cahan,61069_4wc9q4,G,LA RIVIERE,
443640370,00013,44364037000013,O,2002-10-01,NN,,,2006-10-31T03:45:15,true,3,,,,,LE CANET,61430,CAHAN,,,61069,,,,,,,,,,,,,,,,,,,2005-12-31,F,,,,,01.3Z,NAFRev1,N,-0.443291,48.859071,0.93,street,Le Canet 61430 Cahan,61069_ipmx76,G,LE CANET,
445199581,00015,44519958100015,O,2003-02-06,NN,,,2006-11-25T18:19:35,true,3,,,,,LA RUE,61430,CAHAN,,,61069,,,,,,,,,,,,,,,,,,,2005-06-14,F,,,,,51.1T,NAFRev1,N,-0.442569,48.868619,0.9,street,Lieu Dit la Rue 61430 Cahan,61069_k6dhnm,G,LIEU DIT LA RUE,
447914979,00037,44791497900037,O,2018-02-24,,,4332AA,2020-06-05T04:03:05,true,2,,,,,LA BIJUDE,61430,CAHAN,,,61069,,,,,,,,,,,,,,,,,,,2020-03-16,F,,,,ID'CO,43.32A,NAFRev2,N,-0.447358,48.843253,0.91,street,Lieu Dit la Bijude 61430 Cahan,61069_gkkng1,G,LIEU DIT LA BIJUDE,
451268015,00026,45126801500026,O,2007-05-15,,,,2014-01-21T19:32:36,false,2,LE TABOU,,,LD,ST MARC D'OUILLY,61430,CAHAN,,,61069,,,,,,,,,,,,,,,,,,,2013-12-31,F,,,,,46.63Z,NAFRev2,N,-0.434852,48.872876,0.82,street,Saint Marc d'Ouilly 61430 Cahan,61069_b313,G,SAINT MARC D OUILLY,
453186678,00018,45318667800018,O,2004-04-01,00,2016,,2018-09-29T12:12:39,true,3,,,,,LE BOURG,61430,CAHAN,,,61069,,,,,,,,,,,,,,,,,,,2008-01-01,A,,,,,01.41Z,NAFRev2,N,-0.443876,48.858928,0.93,street,Le Bourg 61430 Cahan,61069_fq65tm,G,LE BOURG,
477723589,00024,47772358900024,O,2017-07-27,02,2017,4399CZ,2020-03-24T10:45:29,true,1,,,,,LIEUDIT SAINT MARC D'OUILLY,61430,CAHAN,,,61069,,,,,,,,,,,,,,,,,,,2017-07-27,A,,,,,41.20A,NAFRev2,O,-0.434852,48.872876,0.93,street,Saint Marc d'Ouilly 61430 Cahan,61069_b313,G,SAINT MARC D OUILLY,
479788325,00013,47978832500013,O,2004-09-14,NN,,,2008-11-08T02:45:51,true,3,,,,,LES PLANCHES,61430,CAHAN,,,61069,,,,,,,,,,,,,,,,,,,2005-06-30,F,,,,,45.2V,NAFRev1,N,-0.438662,48.867148,0.91,street,Lieu Dit les Planches 61430 Cahan,61069_gglhr6,G,LIEU DIT LES PLANCHES,
487871915,00012,48787191500012,O,2006-01-02,,,,2012-02-16T09:36:55,false,3,,,,,LE BOURG,61430,CAHAN,,,61069,,,,,,,,,,,,,,,,,,,2012-01-16,F,,,,,43.29A,NAFRev2,N,-0.443876,48.858928,0.93,street,Le Bourg 61430 Cahan,61069_fq65tm,G,LE BOURG,
488762451,00026,48876245100026,O,2018-03-01,,,,2018-03-19T13:26:56,true,1,,,,,LES PLANCHES,61430,CAHAN,,,61069,,,,,,,,,,,,,,,,,,,2018-03-01,A,,,,,55.20Z,NAFRev2,N,-0.438662,48.867148,0.91,street,Lieu Dit les Planches 61430 Cahan,61069_gglhr6,G,LIEU DIT LES PLANCHES,
489715730,00029,48971573000029,O,2007-09-01,NN,,,2013-06-26T20:03:36,true,4,,,,,LA BIJUDE,61430,CAHAN,,,61069,,,,,,,,,,,,,,,,,,,2011-06-20,F,,,,,41.20A,NAFRev2,O,-0.447358,48.843253,0.91,street,Lieu Dit la Bijude 61430 Cahan,61069_gkkng1,G,LIEU DIT LA BIJUDE,
490719614,00011,49071961400011,O,2006-06-20,,,,2008-01-05T03:39:49,true,2,SAINT MARC D OUILLY,,,LD,LE MONT BENI,61430,CAHAN,,,61069,,,,,,,,,,,,,,,,,,,2008-01-01,A,,,,,70.10Z,NAFRev2,N,-0.432172,48.874812,0.37,street,Route du Mont Saint Michel 61430 Cahan,61069_0127,G,ROUTE DU MONT SAINT MICHEL,
497657759,00013,49765775900013,O,2007-01-01,,,,2009-11-30T10:46:03,true,2,,,,,SAINT MARC D'OUILLY,61430,CAHAN,,,61069,,,,,,,,,,,,,,,,,,,2008-01-01,A,,,,,01.45Z,NAFRev2,N,-0.434852,48.872876,0.93,street,Saint Marc d'Ouilly 61430 Cahan,61069_b313,G,SAINT MARC D OUILLY,
500035928,00018,50003592800018,O,2007-09-01,,,,2008-11-05T04:12:38,true,3,,,,,LES PLANCHES,61430,CAHAN,,,61069,,,,,,,,,,,,,,,,,,,2008-08-31,F,,,,,47.79Z,NAFRev2,N,-0.438662,48.867148,0.91,street,Lieu Dit les Planches 61430 Cahan,61069_gglhr6,G,LIEU DIT LES PLANCHES,
504218033,00018,50421803300018,O,2008-05-01,,,,2015-07-07T04:11:57,true,1,,,,,LE BOURG,61430,CAHAN,,,61069,,,,,,,,,,,,,,,,,,,2008-05-01,A,,,,,01.41Z,NAFRev2,N,-0.443876,48.858928,0.93,street,Le Bourg 61430 Cahan,61069_fq65tm,G,LE BOURG,
508664869,00015,50866486900015,O,2008-09-23,,,,2009-11-10T15:30:07,false,2,,,,,LE GRAND CLOS,61430,CAHAN,,,61069,,,,,,,,,,,,,,,,,,,2008-12-20,F,,,,,86.90F,NAFRev2,N,-0.454408,48.865681,0.51,street,Le Clos 61430 Cahan,61069_jw99vr,G,LE CLOS,
517954293,00026,51795429300026,O,2017-03-01,,,,2017-03-02T09:10:09,true,1,,,,,LE COTIL,61430,CAHAN,,,61069,,,,,,,,,,,,,,,,,,,2017-03-01,A,,,,,01.13Z,NAFRev2,N,-0.448438,48.844349,0.4,street,Le Clos Chevalier 61430 Cahan,61069_b087,G,LE CLOS CHEVALIER,
519426845,00029,51942684500029,O,2013-07-24,,,,2015-11-26T19:26:06,true,1,,,,,LA BIJUDE,61430,CAHAN,,,61069,,,,,,,,,,,,,,,,,,,2013-07-24,A,,,,LA ROULOTTE A PIZZAS,56.10C,NAFRev2,N,-0.447358,48.843253,0.91,street,Lieu Dit la Bijude 61430 Cahan,61069_gkkng1,G,LIEU DIT LA BIJUDE,
531203834,00019,53120383400019,O,2011-03-01,,,,2018-05-30T12:35:32,true,2,,,,,LA BUTTE,61430,CAHAN,,,61069,,,,,,,,,,,,,,,,,,,2018-05-25,F,,,,,01.43Z,NAFRev2,N,-0.460475,48.858156,0.93,street,La Butte 61430 Cahan,61069_d1qjg9,G,LA BUTTE,
531976488,00019,53197648800019,O,2011-06-10,,,,2012-08-02T08:35:42,false,2,,,,,LES BROUDIERES,61430,CAHAN,,,61069,,,,,,,,,,,,,,,,,,,2012-01-05,F,,,,,01.11Z,NAFRev2,N,-0.456576,48.86919,0.93,street,Les Broudieres 61430 Cahan,61069_jsc1jh,G,LES BROUDIERES,
789793650,00019,78979365000019,O,2012-10-10,,,,2013-02-27T08:28:57,true,1,,,,,LA BIJUDE,61430,CAHAN,,,61069,,,,,,,,,,,,,,,,,,,2012-10-10,A,,,,,47.99A,NAFRev2,N,-0.447358,48.843253,0.91,street,Lieu Dit la Bijude 61430 Cahan,61069_gkkng1,G,LIEU DIT LA BIJUDE,
805039476,00017,80503947600017,O,2014-09-01,,,,2014-10-08T03:45:21,true,1,,,,,LE HAMEL,61430,CAHAN,,,61069,,,,,,,,,,,,,,,,,,,2014-09-01,A,,,,,47.99A,NAFRev2,N,-0.449447,48.858024,0.93,street,Le Hamel 61430 Cahan,61069_dq66w4,G,LE HAMEL,
815084587,00014,81508458700014,O,2014-11-27,,,,2015-12-07T10:32:23,true,1,,,,,LA BIJUDE,61430,CAHAN,,,61069,,,,,,,,,,,,,,,,,,,2014-11-27,A,,,,,94.99Z,NAFRev2,N,-0.447358,48.843253,0.91,street,Lieu Dit la Bijude 61430 Cahan,61069_gkkng1,G,LIEU DIT LA BIJUDE,
828732024,00017,82873202400017,O,2016-11-23,,,,2019-01-09T04:00:37,true,3,,,,LD,LA BIJUDE,61430,CAHAN,,,61069,,,,,,,,,,,,,,,,,,,2019-01-07,A,,,,,47.89Z,NAFRev2,N,-0.447358,48.843253,0.91,street,Lieu Dit la Bijude 61430 Cahan,61069_gkkng1,G,LIEU DIT LA BIJUDE,
830184388,00015,83018438800015,O,2017-06-01,,,,2017-06-14T13:57:26,true,1,,,,LD,SAINT MARC D'OUILLY,61430,CAHAN,,,61069,,,,,,,,,,,,,,,,,,,2017-06-01,A,,,,,68.20B,NAFRev2,N,-0.434852,48.872876,0.93,street,Saint Marc d'Ouilly 61430 Cahan,61069_b313,G,SAINT MARC D OUILLY,
830679098,00020,83067909800020,O,2017-11-20,,,,2018-09-07T11:10:52,true,1,,,,,LD LES FOURNEAUX,61430,CAHAN,,,61069,,,,,,,,,,,,,,,,,,,2017-11-20,A,,,,,90.01Z,NAFRev2,N,-0.428881,48.865707,0.69,street,Fourneaux 61430 Cahan,61069_g6gnh8,G,FOURNEAUX,
831662234,00036,83166223400036,O,2019-02-18,,,,2019-09-27T03:37:36,false,1,,,,,LE CAPET,61430,CAHAN,,,61069,,,,,,,,,,,,,,,,,,,2019-02-18,F,,,,,68.20A,NAFRev2,N,-0.443291,48.859071,0.61,street,Le Canet 61430 Cahan,61069_ipmx76,G,LE CANET,
878900711,00010,87890071100010,O,2019-11-06,,,,2019-11-14T03:47:08,true,1,,,,,LES FOURNEAUX,61430,CAHAN,,,61069,,,,,,,,,,,,,,,,,,,2019-11-06,A,,,,,47.99A,NAFRev2,N,-0.428881,48.865707,0.69,street,Fourneaux 61430 Cahan,61069_g6gnh8,G,FOURNEAUX,
882296841,00019,88229684100019,O,2020-03-09,,,,2020-05-10T18:01:09,true,1,,,,,LES BROUDIERES,61430,CAHAN,,,61069,,,,,,,,,,,,,,,,,,,2020-03-09,A,,,,,70.21Z,NAFRev2,N,-0.456576,48.86919,0.93,street,Les Broudieres 61430 Cahan,61069_jsc1jh,G,LES BROUDIERES,
936720069,00025,93672006900025,O,,NN,,,,true,1,,,,,FOURNEAUX,61430,CAHAN,,,61069,,,,,,,,,,,,,,,,,,,1999-02-22,F,,,,,28.5D,NAF1993,O,-0.428881,48.865707,0.93,street,Fourneaux 61430 Cahan,61069_g6gnh8,G,FOURNEAUX,
