siren,nic,siret,statutDiffusionEtablissement,dateCreationEtablissement,trancheEffectifsEtablissement,anneeEffectifsEtablissement,activitePrincipaleRegistreMetiersEtablissement,dateDernierTraitementEtablissement,etablissementSiege,nombrePeriodesEtablissement,complementAdresseEtablissement,numeroVoieEtablissement,indiceRepetitionEtablissement,typeVoieEtablissement,libelleVoieEtablissement,codePostalEtablissement,libelleCommuneEtablissement,libelleCommuneEtrangerEtablissement,distributionSpecialeEtablissement,codeCommuneEtablissement,codeCedexEtablissement,libelleCedexEtablissement,codePaysEtrangerEtablissement,libellePaysEtrangerEtablissement,complementAdresse2Etablissement,numeroVoie2Etablissement,indiceRepetition2Etablissement,typeVoie2Etablissement,libelleVoie2Etablissement,codePostal2Etablissement,libelleCommune2Etablissement,libelleCommuneEtranger2Etablissement,distributionSpeciale2Etablissement,codeCommune2Etablissement,codeCedex2Etablissement,libelleCedex2Etablissement,codePaysEtranger2Etablissement,libellePaysEtranger2Etablissement,dateDebut,etatAdministratifEtablissement,enseigne1Etablissement,enseigne2Etablissement,enseigne3Etablissement,denominationUsuelleEtablissement,activitePrincipaleEtablissement,nomenclatureActivitePrincipaleEtablissement,caractereEmployeurEtablissement,longitude,latitude,geo_score,geo_type,geo_adresse,geo_id,geo_ligne,geo_l4,geo_l5
216205989,00017,21620598900017,O,1983-03-01,03,2017,,2019-11-14T14:00:50,true,4,,17,,RUE,DE LA MAIRIE,62890,MUNCQ-NIEURLET,,,62598,,,,,,,,,,,,,,,,,,,2008-01-01,A,MAIRIE,,,,84.11Z,NAFRev2,O,2.11473,50.84731,0.94,housenumber,17 Rue de la Mairie 62890 Muncq-Nieurlet,62598_0007_00017,G,17 RUE DE LA MAIRIE,
216205989,00025,21620598900025,O,1983-12-21,01,2017,,2019-11-14T14:00:50,false,3,,,,RUE,DE LA MAIRIE,62890,MUNCQ-NIEURLET,,,62598,,,,,,,,,,,,,,,,,,,2008-01-01,A,ECOLE PRIMAIRE PUBLIQUE,,,,85.20Z,NAFRev2,N,2.113764,50.849273,0.94,street,Rue de la Mairie 62890 Muncq-Nieurlet,62598_0007,G,RUE DE LA MAIRIE,
266205988,00014,26620598800014,O,1983-03-01,01,2017,,2019-11-14T14:00:50,true,4,MAIRIE,17,,RUE,DE LA MAIRIE,62890,MUNCQ-NIEURLET,,,62598,,,,,,,,,,,,,,,,,,,2008-01-01,A,CCAS,,,,88.99B,NAFRev2,O,2.11473,50.84731,0.94,housenumber,17 Rue de la Mairie 62890 Muncq-Nieurlet,62598_0007_00017,G,17 RUE DE LA MAIRIE,
300697448,00011,30069744800011,O,1974-01-01,NN,,,2019-11-14T14:00:50,false,4,,,,RUE,DU BOURG,62890,MUNCQ-NIEURLET,,,62598,,,,,,,,,,,,,,,,,,,2007-10-31,F,,,,,93.0D,NAFRev1,O,2.10908,50.848005,0.94,street,Rue du Bourg 62890 Muncq-Nieurlet,62598_0006,G,RUE DU BOURG,
310498530,00016,31049853000016,O,,NN,,,2019-11-14T14:00:50,true,1,,,,RTE,DEPARTEMENTALE 217,62890,MUNCQ-NIEURLET,,,62598,,,,,,,,,,,,,,,,,,,1992-10-15,F,,,,,60.2L,NAF1993,N,6.2322097,48.3888613,0.7,poi.track,Route Départementale (Chemin) Avrainville,https://osm.org/way/492497059,G,,
310649702,00019,31064970200019,O,,,,,2019-11-14T14:00:50,true,1,,,,,,62890,MUNCQ-NIEURLET,,,62598,,,,,,,,,,,,,,,,,,,1984-12-25,F,,,,,69.12,NAP,N,,,0,,,,,,
317796423,00042,31779642300042,O,2007-02-01,,,,2019-11-14T14:00:50,false,2,,13,,RUE,DES FERMES,62890,MUNCQ-NIEURLET,,,62598,,,,,,,,,,,,,,,,,,,2008-01-01,A,,,,,90.03B,NAFRev2,N,2.116613,50.856136,0.94,housenumber,13 Rue des Fermes 62890 Muncq-Nieurlet,62598_0011_00013,G,13 RUE DES FERMES,
317796423,00059,31779642300059,O,2005-01-01,,,,2019-11-14T14:00:50,true,2,LE TIRET,13,,RUE,DES FERMES,62890,MUNCQ-NIEURLET,,,62598,,,,,,,,,,,,,,,,,,,2008-01-01,A,LE TIRET,,,,01.45Z,NAFRev2,N,2.116613,50.856136,0.94,housenumber,13 Rue des Fermes 62890 Muncq-Nieurlet,62598_0011_00013,G,13 RUE DES FERMES,
318386844,00027,31838684400027,O,,NN,,,2019-11-14T14:00:50,true,1,,,,RUE,DE LA PAIX,62890,MUNCQ-NIEURLET,,,62598,,,,,,,,,,,,,,,,,,,1985-06-13,F,,,,,55.73,NAP,N,2.114443,50.843726,0.94,street,Rue de la Paix 62890 Muncq-Nieurlet,62598_0015,G,RUE DE LA PAIX,
320116718,00026,32011671800026,O,1986-12-30,NN,,,2019-11-14T14:00:50,true,4,,,,RUE,DE LA PETIT HOLLANDE,62890,MUNCQ-NIEURLET,,,62598,,,,,,,,,,,,,,,,,,,1995-12-25,F,,,,,01.4A,NAF1993,O,2.116219,50.844489,0.86,street,Rue de la Petite Hollande 62890 Muncq-Nieurlet,62598_0038,G,RUE DE LA PETITE HOLLANDE,
322706946,00017,32270694600017,O,,NN,,,2019-11-14T14:00:50,true,1,,,,DOM,NOTRE DAME,62890,MUNCQ-NIEURLET,,,62598,,,,,,,,,,,,,,,,,,,1986-10-20,F,,,,,01.00,NAP,N,0.6942992,47.4478711,0.77,poi.3,Domaine de Chassetière (Patrimoine national) Notre-Dame-d'Oé,https://osm.org/way/72054684,G,,
323641670,00043,32364167000043,O,1997-10-10,NN,,,2019-11-14T14:00:50,true,1,,,,RUE,DE LA PETITE HOLLANDE,62890,MUNCQ-NIEURLET,,,62598,,,,,,,,,,,,,,,,,,,2002-06-27,F,,,,,52.6E,NAF1993,N,2.116219,50.844489,0.94,street,Rue de la Petite Hollande 62890 Muncq-Nieurlet,62598_0038,G,RUE DE LA PETITE HOLLANDE,
325255594,00013,32525559400013,O,,,,,2019-11-14T14:00:50,true,1,,,,LD,LA WATTINE,62890,MUNCQ-NIEURLET,,,62598,,,,,,,,,,,,,,,,,,,1984-12-25,F,,,,,62.41,NAP,N,2.117855,50.834529,0.34,street,Rue de la Panne 62890 Muncq-Nieurlet,62598_0035,G,RUE DE LA PANNE,
325259281,00013,32525928100013,O,1982-06-01,NN,,,2019-11-14T14:00:50,false,4,,,,,,62890,MUNCQ-NIEURLET,,,62598,,,,,,,,,,,,,,,,,,,1995-12-25,F,,,,,01.3Z,NAF1993,N,,,0,,,,,,
325259281,00039,32525928100039,O,1998-03-01,01,2017,,2019-11-14T14:00:50,true,3,,195,,RUE,DU BOURG,62890,MUNCQ-NIEURLET,,,62598,,,,,,,,,,,,,,,,,,,2008-01-01,A,,,,,01.11Z,NAFRev2,N,2.13633,50.854257,0.94,housenumber,195 Rue du Bourg 62890 Muncq-Nieurlet,62598_0006_00195,G,195 RUE DU BOURG,
325599751,00014,32559975100014,O,,,,,2019-11-14T14:00:50,true,1,,,,RTE,DEPARTEMENTALE 17,62890,MUNCQ-NIEURLET,,,62598,,,,,,,,,,,,,,,,,,,1988-09-20,F,,,,,69.12,NAP,N,,,0,,,,,,
326890605,00016,32689060500016,O,,NN,,,2019-11-14T14:00:50,true,1,,,,,LIEU DIT LA PANNE,62890,MUNCQ-NIEURLET,,,62598,,,,,,,,,,,,,,,,,,,,F,,,,,38.40,NAP,N,2.117855,50.834529,0.92,street,Rue de la Panne 62890 Muncq-Nieurlet,62598_0035,G,RUE DE LA PANNE,
328720602,00015,32872060200015,O,1983-12-27,NN,,,2019-11-14T14:00:50,true,3,,,,,,62890,MUNCQ-NIEURLET,,,62598,,,,,,,,,,,,,,,,,,,2005-08-31,F,,,,,01.3Z,NAFRev1,N,,,0,,,,,,
334243599,00019,33424359900019,O,1974-01-01,NN,,,2019-11-14T14:00:50,true,3,,,,,FERME DE LA PANNE,62890,MUNCQ-NIEURLET,,,62598,,,,,,,,,,,,,,,,,,,2003-12-31,F,,,,,01.3Z,NAFRev1,N,2.117855,50.834529,0.7,street,Rue de la Panne 62890 Muncq-Nieurlet,62598_0035,G,RUE DE LA PANNE,
334843091,00029,33484309100029,O,2017-03-10,,,,2019-11-14T14:00:50,true,1,,19,,RUE,DU COMMUNAL,62890,MUNCQ-NIEURLET,,,62598,,,,,,,,,,,,,,,,,,,2017-03-10,A,,,,,47.99A,NAFRev2,N,2.117468,50.821558,0.94,housenumber,19 Rue du Communal 62890 Muncq-Nieurlet,62598_0004_00019,G,19 RUE DU COMMUNAL,
338734064,00029,33873406400029,O,,NN,,,2019-11-14T14:00:50,true,1,,,,RUE,DU BOURG,62890,MUNCQ-NIEURLET,,,62598,,,,,,,,,,,,,,,,,,,1987-06-20,F,,,,,77.14,NAP,N,2.10908,50.848005,0.94,street,Rue du Bourg 62890 Muncq-Nieurlet,62598_0006,G,RUE DU BOURG,
339124570,00013,33912457000013,O,1986-09-22,,,,2019-11-14T14:00:50,true,1,,,,,FERME NOTRE DAME,62890,MUNCQ-NIEURLET,,,62598,,,,,,,,,,,,,,,,,,,2000-12-31,F,,,,,01.3Z,NAF1993,N,3.4215654,49.4463981,0.89,poi.farmyard,La Ferme Notre-Dame (Corps de ferme) Laffaux,https://osm.org/way/329945954,G,,
341260008,00014,34126000800014,O,1987-03-18,NN,,,2019-11-14T14:00:50,true,4,,,,RUE,DE LA PETITE HOLLANDE,62890,MUNCQ-NIEURLET,,,62598,,,,,,,,,,,,,,,,,,,2001-12-25,F,,,,,45.2V,NAF1993,O,2.116219,50.844489,0.94,street,Rue de la Petite Hollande 62890 Muncq-Nieurlet,62598_0038,G,RUE DE LA PETITE HOLLANDE,
343450730,00019,34345073000019,O,,NN,,,2019-11-14T14:00:50,true,1,,,,RUE,DE LA PETITE HOLLANDE,62890,MUNCQ-NIEURLET,,,62598,,,,,,,,,,,,,,,,,,,1991-12-31,F,,,,,01.07,NAP,N,2.116219,50.844489,0.94,street,Rue de la Petite Hollande 62890 Muncq-Nieurlet,62598_0038,G,RUE DE LA PETITE HOLLANDE,
344353313,00010,34435331300010,O,,,,,2019-11-14T14:00:50,true,1,,,,RUE,DU BOURG,62890,MUNCQ-NIEURLET,,,62598,,,,,,,,,,,,,,,,,,,1989-06-30,F,,,,,67.05,NAP,N,2.10908,50.848005,0.94,street,Rue du Bourg 62890 Muncq-Nieurlet,62598_0006,G,RUE DU BOURG,
348045113,00019,34804511300019,O,1987-01-28,NN,,,2019-11-14T14:00:50,true,6,,,,RTE,DEPARTEMENTALE 217,62890,MUNCQ-NIEURLET,,,62598,,,,,,,,,,,,,,,,,,,2018-10-01,F,,,,,49.41B,NAFRev2,N,6.2322097,48.3888613,0.7,poi.track,Route Départementale (Chemin) Avrainville,https://osm.org/way/492497059,G,,
351629183,00010,35162918300010,O,1989-07-01,NN,,,2019-11-14T14:00:50,true,3,,,,RUE,DU BOURG,62890,MUNCQ-NIEURLET,,,62598,,,,,,,,,,,,,,,,,,,2005-09-30,F,,,,,55.4A,NAFRev1,N,2.10908,50.848005,0.94,street,Rue du Bourg 62890 Muncq-Nieurlet,62598_0006,G,RUE DU BOURG,
377693528,00012,37769352800012,O,1990-02-15,NN,,,2019-11-14T14:00:50,true,3,,,,LD,HAMEAU DU COMMUNAL,62890,MUNCQ-NIEURLET,,,62598,,,,,,,,,,,,,,,,,,,2008-01-01,A,,,,,68.20A,NAFRev2,N,2.117352,50.819055,0.61,street,Rue du Communal 62890 Muncq-Nieurlet,62598_0004,G,RUE DU COMMUNAL,
384124236,00017,38412423600017,O,1991-12-01,NN,,,2019-11-14T14:00:50,true,1,,24,,RUE,DES FERMES,62890,MUNCQ-NIEURLET,,,62598,,,,,,,,,,,,,,,,,,,1998-09-30,F,,,,,01.3Z,NAF1993,N,2.118851,50.85417,0.94,housenumber,24 Rue des Fermes 62890 Muncq-Nieurlet,62598_0011_00024,G,24 RUE DES FERMES,
384506341,00021,38450634100021,O,2017-12-31,,,,2019-11-14T14:00:50,true,1,,42,,RUE,DE LA PETITE HOLLANDE,62890,MUNCQ-NIEURLET,,,62598,,,,,,,,,,,,,,,,,,,2017-12-31,A,,,,,01.11Z,NAFRev2,N,2.10806,50.843221,0.94,housenumber,42 Rue de la Petite Hollande 62890 Muncq-Nieurlet,62598_0038_00042,G,42 RUE DE LA PETITE HOLLANDE,
390133619,00010,39013361900010,O,1993-01-01,NN,,,2019-11-14T14:00:50,true,1,,,,,LA BELLE VUE,62890,MUNCQ-NIEURLET,,,62598,,,,,,,,,,,,,,,,,,,2000-09-30,F,,,,,01.3Z,NAF1993,N,2.113509,50.837369,0.71,street,Rue de la Bellevue 62890 Muncq-Nieurlet,62598_0005,G,RUE DE LA BELLEVUE,
394712384,00038,39471238400038,O,1996-04-29,NN,,,2019-11-14T14:00:50,false,4,,58,,RUE,DU BOURG,62890,MUNCQ-NIEURLET,,,62598,,,,,,,,,,,,,,,,,,,2001-04-22,F,,,,,93.0D,NAF1993,N,2.112792,50.849174,0.94,housenumber,58 Rue du Bourg 62890 Muncq-Nieurlet,62598_0006_00058,G,58 RUE DU BOURG,
400031381,00017,40003138100017,O,1995-01-01,NN,,,2019-11-14T14:00:50,true,1,,13,,RUE,DE LA PETITE HOLLANDE,62890,MUNCQ-NIEURLET,,,62598,,,,,,,,,,,,,,,,,,,2001-10-30,F,,,,,60.2M,NAF1993,O,2.114836,50.844224,0.94,housenumber,13 Rue de la Petite Hollande 62890 Muncq-Nieurlet,62598_0038_00013,G,13 RUE DE LA PETITE HOLLANDE,
401189386,00014,40118938600014,O,1995-04-01,NN,,,2019-11-14T14:00:50,false,3,,3,,RUE,DE LA MAIRIE,62890,MUNCQ-NIEURLET,,,62598,,,,,,,,,,,,,,,,,,,2006-03-31,F,,,,,01.3Z,NAFRev1,N,2.114107,50.848557,0.94,housenumber,3 Rue de la Mairie 62890 Muncq-Nieurlet,62598_0007_00003,G,3 RUE DE LA MAIRIE,
402613616,00034,40261361600034,O,2011-04-01,,,1085ZZ,2019-11-14T14:00:50,true,1,6 ZAE LES 24,,,RUE,DE LA CALIFORNIE,62890,MUNCQ-NIEURLET,,,62598,,,,,,,,,,,,,,,,,,,2011-04-01,A,FRITERIE DE LA VALLEE,,,,56.10C,NAFRev2,N,2.123199,50.843366,0.94,street,Rue de la Californie 62890 Muncq-Nieurlet,62598_0008,G,RUE DE LA CALIFORNIE,
403621766,00027,40362176600027,O,2016-04-05,01,2017,4722ZB,2019-11-14T14:00:50,true,3,RUE DE LA CALIFORNIE,,,,4 ZAE LES VINGT QUATRE,62890,MUNCQ-NIEURLET,,,62598,,,,,,,,,,,,,,,,,,,2016-09-06,A,,,,LA BELLE VIANDE,47.22Z,NAFRev2,O,2.119725,50.849179,0.89,housenumber,4 Rue Zae les Vingt Quatre 62890 Muncq-Nieurlet,62598_0075_00004,G,4 RUE ZAE LES VINGT QUATRE,
408624104,00019,40862410400019,O,1996-07-29,NN,,,2019-11-14T14:00:50,true,5,MAIRIE,17,,RUE,DE LA MAIRIE,62890,MUNCQ-NIEURLET,,,62598,,,,,,,,,,,,,,,,,,,2014-06-02,A,,,,,94.99Z,NAFRev2,N,2.11473,50.84731,0.94,housenumber,17 Rue de la Mairie 62890 Muncq-Nieurlet,62598_0007_00017,G,17 RUE DE LA MAIRIE,
413400557,00018,41340055700018,O,1997-08-06,NN,,,2019-11-14T14:00:50,true,1,,8,,RUE,DU COMMUNAL,62890,MUNCQ-NIEURLET,,,62598,,,,,,,,,,,,,,,,,,,2001-04-12,F,,,,,45.3A,NAF1993,O,2.117532,50.819927,0.94,housenumber,8 Rue du Communal 62890 Muncq-Nieurlet,62598_0004_00008,G,8 RUE DU COMMUNAL,
418890315,00017,41889031500017,O,1997-10-22,NN,,,2019-11-14T14:00:50,true,4,,22,,RUE,DE LA MAIRIE,62890,MUNCQ-NIEURLET,,,62598,,,,,,,,,,,,,,,,,,,2003-06-07,F,,,,,70.2A,NAFRev1,N,2.115354,50.844647,0.94,housenumber,22 Rue de la Mairie 62890 Muncq-Nieurlet,62598_0007_00022,G,22 RUE DE LA MAIRIE,
420704488,00014,42070448800014,O,1998-10-01,NN,,,2019-11-14T14:00:50,true,3,,24,,RUE,DES FERMES,62890,MUNCQ-NIEURLET,,,62598,,,,,,,,,,,,,,,,,,,2006-02-28,F,,,,,01.3Z,NAFRev1,N,2.118851,50.85417,0.94,housenumber,24 Rue des Fermes 62890 Muncq-Nieurlet,62598_0011_00024,G,24 RUE DES FERMES,
422224683,00033,42222468300033,O,2011-02-14,,,4399CZ,2019-11-14T14:00:50,true,3,,13,,RUE,DE LA PETITE HOLLANDE,62890,MUNCQ-NIEURLET,,,62598,,,,,,,,,,,,,,,,,,,2015-12-15,F,,,,,56.10C,NAFRev2,N,2.114836,50.844224,0.94,housenumber,13 Rue de la Petite Hollande 62890 Muncq-Nieurlet,62598_0038_00013,G,13 RUE DE LA PETITE HOLLANDE,
423280403,00027,42328040300027,O,2005-10-12,01,2016,,2019-11-14T14:00:50,true,4,,1,,RUE,DE LA MAIRIE,62890,MUNCQ-NIEURLET,,,62598,,,,,,,,,,,,,,,,,,,2016-09-01,A,,,,,56.30Z,NAFRev2,N,2.113764,50.849273,0.94,housenumber,1 Rue de la Mairie 62890 Muncq-Nieurlet,62598_0007_00001,G,1 RUE DE LA MAIRIE,
424105203,00022,42410520300022,O,2002-07-01,NN,,,2019-11-14T14:00:50,false,3,,13,,RUE,DE LA PETITE HOLLANDE,62890,MUNCQ-NIEURLET,,,62598,,,,,,,,,,,,,,,,,,,2004-12-01,F,,,,,60.2M,NAFRev1,O,2.114836,50.844224,0.94,housenumber,13 Rue de la Petite Hollande 62890 Muncq-Nieurlet,62598_0038_00013,G,13 RUE DE LA PETITE HOLLANDE,
429739485,00010,42973948500010,O,2000-01-29,NN,,,2019-11-14T14:00:50,true,1,,42,,RUE,DE LA PETITE HOLLANDE,62890,MUNCQ-NIEURLET,,,62598,,,,,,,,,,,,,,,,,,,2001-12-01,F,,,,,85.1G,NAF1993,N,2.10806,50.843221,0.94,housenumber,42 Rue de la Petite Hollande 62890 Muncq-Nieurlet,62598_0038_00042,G,42 RUE DE LA PETITE HOLLANDE,
429954381,00019,42995438100019,O,2000-04-02,NN,,,2019-11-14T14:00:50,true,4,,107,,RUE,DE LA PANNE,62890,MUNCQ-NIEURLET,,,62598,,,,,,,,,,,,,,,,,,,2012-11-16,F,,,,,55.20Z,NAFRev2,N,2.102116,50.8245,0.94,housenumber,107 Rue de la Panne 62890 Muncq-Nieurlet,62598_0035_00107,G,107 RUE DE LA PANNE,
429984446,00014,42998444600014,O,2000-04-01,NN,,,2019-11-14T14:00:50,false,4,,42,,CHE,DE LA PAIX,62890,MUNCQ-NIEURLET,,,62598,,,,,,,,,,,,,,,,,,,2018-01-01,F,,,,,64.20Z,NAFRev2,N,2.106741,50.838774,0.73,housenumber,42 Rue de la Paix 62890 Muncq-Nieurlet,62598_0015_00042,G,42 RUE DE LA PAIX,
430749275,00011,43074927500011,O,1994-06-01,NN,,,2019-11-14T14:00:50,false,4,,42,,RUE,DE LA PETITE HOLLANDE,62890,MUNCQ-NIEURLET,,,62598,,,,,,,,,,,,,,,,,,,2001-10-26,F,,,,,85.1G,NAF1993,N,2.10806,50.843221,0.94,housenumber,42 Rue de la Petite Hollande 62890 Muncq-Nieurlet,62598_0038_00042,G,42 RUE DE LA PETITE HOLLANDE,
433202819,00010,43320281900010,O,2000-10-01,NN,,,2019-11-14T14:00:50,true,3,,21,,RUE,BELLEVUE,62890,MUNCQ-NIEURLET,,,62598,,,,,,,,,,,,,,,,,,,2004-03-31,F,,,,,01.3Z,NAFRev1,N,2.113509,50.837369,0.87,housenumber,21 Rue de la Bellevue 62890 Muncq-Nieurlet,62598_0005_00021,G,21 RUE DE LA BELLEVUE,
434080768,00022,43408076800022,O,2010-06-12,00,2017,1813ZB,2019-11-14T14:00:50,false,3,,5,,,ZAE LES 24,62890,MUNCQ-NIEURLET,,,62598,,,,,,,,,,,,,,,,,,,2017-07-24,F,,,,,73.11Z,NAFRev2,O,2.118604,50.849185,0.64,housenumber,5 Rue Zae les Vingt Quatre 62890 Muncq-Nieurlet,62598_0075_00005,G,5 RUE ZAE LES VINGT QUATRE,
434508214,00013,43450821400013,O,2001-01-01,NN,,,2019-11-14T14:00:50,true,3,,,,,FERME NOTRE DAME,62890,MUNCQ-NIEURLET,,,62598,,,,,,,,,,,,,,,,,,,2008-01-01,A,,,,,01.11Z,NAFRev2,N,3.4215654,49.4463981,0.89,poi.farmyard,La Ferme Notre-Dame (Corps de ferme) Laffaux,https://osm.org/way/329945954,G,,
439126327,00030,43912632700030,O,2016-12-26,,,,2019-11-14T14:00:50,true,1,,3,,RUE,DU MEMBRE,62890,MUNCQ-NIEURLET,,,62598,,,,,,,,,,,,,,,,,,,2016-12-26,A,,,,,68.20A,NAFRev2,N,2.092433,50.831117,0.94,housenumber,3 Rue du Membre 62890 Muncq-Nieurlet,62598_0020_00003,G,3 RUE DU MEMBRE,
440574150,00015,44057415000015,O,2001-12-09,,,,2019-11-14T14:00:50,true,3,,,,,MAIRIE,62890,MUNCQ-NIEURLET,,,62598,,,,,,,,,,,,,,,,,,,2008-01-01,A,,,,,90.01Z,NAFRev2,N,2.113764,50.849273,0.91,street,Rue de la Mairie 62890 Muncq-Nieurlet,62598_0007,G,RUE DE LA MAIRIE,
441040938,00017,44104093800017,O,2002-02-22,NN,,,2019-11-14T14:00:50,true,6,,46,,RUE,DE LA PETITE HOLLANDE,62890,MUNCQ-NIEURLET,,,62598,,,,,,,,,,,,,,,,,,,2017-12-05,A,FLEUR PASSION,,,FLEUR PASSION,47.76Z,NAFRev2,N,2.106312,50.842633,0.94,housenumber,46 Rue de la Petite Hollande 62890 Muncq-Nieurlet,62598_0038_00046,G,46 RUE DE LA PETITE HOLLANDE,
442682076,00017,44268207600017,O,2002-07-01,NN,,,2019-11-14T14:00:50,false,2,,52,,RUE,DE LA PETITE HOLLANDE,62890,MUNCQ-NIEURLET,,,62598,,,,,,,,,,,,,,,,,,,2002-12-25,F,,,,,85.1G,NAF1993,N,2.104936,50.84172,0.94,housenumber,52 Rue de la Petite Hollande 62890 Muncq-Nieurlet,62598_0038_00052,G,52 RUE DE LA PETITE HOLLANDE,
447718008,00017,44771800800017,O,2003-01-01,NN,,,2019-11-14T14:00:50,true,3,,24,,RUE,DE LA CHAPELLE,62890,MUNCQ-NIEURLET,,,62598,,,,,,,,,,,,,,,,,,,2008-01-01,A,,,,,01.11Z,NAFRev2,N,2.1031,50.845143,0.83,street,Rue de la Chapelle 62890 Muncq-Nieurlet,62598_0012,G,RUE DE LA CHAPELLE,
448956615,00018,44895661500018,O,2003-06-06,NN,,,2019-11-14T14:00:50,false,5,,9,,RUE,DE LA PETITE HOLLANDE,62890,MUNCQ-NIEURLET,,,62598,,,,,,,,,,,,,,,,,,,2009-05-01,F,,,,,47.89Z,NAFRev2,N,2.115531,50.844352,0.94,housenumber,9 Rue de la Petite Hollande 62890 Muncq-Nieurlet,62598_0038_00009,G,9 RUE DE LA PETITE HOLLANDE,
448956615,00034,44895661500034,O,2011-08-04,NN,,,2019-11-14T14:00:50,true,2,,9,,RUE,DE LA PETITE HOLLANDE,62890,MUNCQ-NIEURLET,,,62598,,,,,,,,,,,,,,,,,,,2011-09-29,F,,,,,47.79Z,NAFRev2,N,2.115531,50.844352,0.94,housenumber,9 Rue de la Petite Hollande 62890 Muncq-Nieurlet,62598_0038_00009,G,9 RUE DE LA PETITE HOLLANDE,
449369750,00038,44936975000038,O,2012-04-01,,,,2019-11-14T14:00:50,false,2,,13,,RUE,DE LA PETITE HOLLANDE,62890,MUNCQ-NIEURLET,,,62598,,,,,,,,,,,,,,,,,,,2012-10-29,F,,,,,47.89Z,NAFRev2,N,2.114836,50.844224,0.94,housenumber,13 Rue de la Petite Hollande 62890 Muncq-Nieurlet,62598_0038_00013,G,13 RUE DE LA PETITE HOLLANDE,
450703749,00017,45070374900017,O,2003-10-01,01,2017,,2019-11-14T14:00:50,true,3,,21,,,BELLE VUE,62890,MUNCQ-NIEURLET,,,62598,,,,,,,,,,,,,,,,,,,2008-01-01,A,,,,,01.50Z,NAFRev2,N,2.113509,50.837369,0.64,housenumber,21 Rue de la Bellevue 62890 Muncq-Nieurlet,62598_0005_00021,G,21 RUE DE LA BELLEVUE,
451150510,00027,45115051000027,O,2012-04-20,,,,2019-11-14T14:00:50,true,1,,27,,RUE,ST GILLES,62890,MUNCQ-NIEURLET,,,62598,,,,,,,,,,,,,,,,,,,2012-04-20,A,,,,,68.20B,NAFRev2,N,2.118688,50.81866,0.83,housenumber,27 Rue Saint Gilles 62890 Muncq-Nieurlet,62598_0013_00027,G,27 RUE SAINT GILLES,
451669378,00031,45166937800031,O,2013-07-01,,,8121ZZ,2019-11-14T14:00:50,true,1,,9,,RUE,DE LA PETITE HOLLANDE,62890,MUNCQ-NIEURLET,,,62598,,,,,,,,,,,,,,,,,,,2013-07-01,A,,,,,47.89Z,NAFRev2,N,2.115531,50.844352,0.94,housenumber,9 Rue de la Petite Hollande 62890 Muncq-Nieurlet,62598_0038_00009,G,9 RUE DE LA PETITE HOLLANDE,
452689474,00016,45268947400016,O,2004-01-01,NN,,,2019-11-14T14:00:50,true,4,,99,,RUE,DE LA PANNE,62890,MUNCQ-NIEURLET,,,62598,,,,,,,,,,,,,,,,,,,2016-01-01,A,,,,,01.49Z,NAFRev2,N,2.105323,50.825483,0.94,housenumber,99 Rue de la Panne 62890 Muncq-Nieurlet,62598_0035_00099,G,99 RUE DE LA PANNE,
478481732,00020,47848173200020,O,2010-12-29,02,2017,4399CZ,2019-11-14T14:00:50,false,2,,7,,,ZAE LES 24,62890,MUNCQ-NIEURLET,,,62598,,,,,,,,,,,,,,,,,,,2018-11-30,F,,,,,41.20A,NAFRev2,O,2.118554,50.849327,0.64,housenumber,7 Rue Zae les Vingt Quatre 62890 Muncq-Nieurlet,62598_0075_00007,G,7 RUE ZAE LES VINGT QUATRE,
478503584,00029,47850358400029,O,2016-06-15,,,,2019-11-14T14:00:50,true,1,,75,,RUE,DU BOURG,62890,MUNCQ-NIEURLET,,,62598,,,,,,,,,,,,,,,,,,,2016-06-15,A,,,,,46.19B,NAFRev2,N,2.117673,50.849876,0.94,housenumber,75 Rue du Bourg 62890 Muncq-Nieurlet,62598_0006_00075,G,75 RUE DU BOURG,
484552419,00018,48455241900018,O,2005-09-01,,,,2019-11-14T14:00:50,true,2,,60,,RUE,DU VINCK,62890,MUNCQ-NIEURLET,,,62598,,,,,,,,,,,,,,,,,,,2008-01-01,A,,,,,01.11Z,NAFRev2,N,2.132724,50.841517,0.94,housenumber,60 Rue du Vinck 62890 Muncq-Nieurlet,62598_p0sek2_00060,G,60 RUE DU VINCK,
485144646,00042,48514464600042,O,2018-04-06,,,4321AB,2019-11-14T14:00:50,true,1,,54,,RUE,DU BOURG,62890,MUNCQ-NIEURLET,,,62598,,,,,,,,,,,,,,,,,,,2018-04-06,A,,,,R.V. RENOV'ELEC,43.21A,NAFRev2,N,2.112047,50.84901,0.94,housenumber,54 Rue du Bourg 62890 Muncq-Nieurlet,62598_0006_00054,G,54 RUE DU BOURG,
489216168,00018,48921616800018,O,2006-03-01,NN,,,2019-11-14T14:00:50,true,2,,24,,RUE,DES FERMES,62890,MUNCQ-NIEURLET,,,62598,,,,,,,,,,,,,,,,,,,2008-01-01,A,,,,,01.50Z,NAFRev2,N,2.118851,50.85417,0.94,housenumber,24 Rue des Fermes 62890 Muncq-Nieurlet,62598_0011_00024,G,24 RUE DES FERMES,
489695528,00013,48969552800013,O,2006-04-24,NN,,,2019-11-14T14:00:50,true,4,,4,,RUE,DU PARADIS,62890,MUNCQ-NIEURLET,,,62598,,,,,,,,,,,,,,,,,,,2009-12-31,A,,,,,70.22Z,NAFRev2,N,2.110073,50.846605,0.94,housenumber,4 Rue du Paradis 62890 Muncq-Nieurlet,62598_0036_00004,G,4 RUE DU PARADIS,
492531512,00019,49253151200019,O,2006-10-02,,,,2019-11-14T14:00:50,true,2,,42,,CHE,DE LA PAIX,62890,MUNCQ-NIEURLET,,,62598,,,,,,,,,,,,,,,,,,,2008-01-01,A,,,,,68.20B,NAFRev2,N,2.106741,50.838774,0.73,housenumber,42 Rue de la Paix 62890 Muncq-Nieurlet,62598_0015_00042,G,42 RUE DE LA PAIX,
492946512,00026,49294651200026,O,2011-03-30,,,,2019-11-14T14:00:50,true,1,,7,,RUE,DE LA PETITE HOLLANDE,62890,MUNCQ-NIEURLET,,,62598,,,,,,,,,,,,,,,,,,,2011-03-30,F,,,,,95.11Z,NAFRev2,N,2.115905,50.84442,0.94,housenumber,7 Rue de la Petite Hollande 62890 Muncq-Nieurlet,62598_0038_00007,G,7 RUE DE LA PETITE HOLLANDE,
493430805,00017,49343080500017,O,2007-01-03,NN,,,2019-11-14T14:00:50,false,4,,1,,RUE,DU VINCK,62890,MUNCQ-NIEURLET,,,62598,,,,,,,,,,,,,,,,,,,2013-01-07,F,,,,,49.41B,NAFRev2,O,2.12365,50.843274,0.94,housenumber,1 Rue du Vinck 62890 Muncq-Nieurlet,62598_p0sek2_00001,G,1 RUE DU VINCK,
494701618,00014,49470161800014,O,2007-03-05,NN,,3312ZB,2019-11-14T14:00:50,true,5,,26,,,CHEMIN VERT,62890,MUNCQ-NIEURLET,,,62598,,,,,,,,,,,,,,,,,,,2013-06-27,A,,,,,43.99C,NAFRev2,N,2.106359,50.845111,0.94,housenumber,26 Chemin Vert 62890 Muncq-Nieurlet,62598_0016_00026,G,26 CHEMIN VERT,
499039782,00010,49903978200010,O,2007-07-03,NN,,4211ZB,2019-11-14T14:00:50,true,2,,22,,RUE,DU COMMUNAL,62890,MUNCQ-NIEURLET,,,62598,,,,,,,,,,,,,,,,,,,2008-01-01,A,GARDEN CONCEPT,,,,81.30Z,NAFRev2,N,2.118125,50.822613,0.94,housenumber,22 Rue du Communal 62890 Muncq-Nieurlet,62598_0004_00022,G,22 RUE DU COMMUNAL,
499295061,00026,49929506100026,O,2013-01-01,,,,2019-11-14T14:00:50,false,2,,9,,,ZAE LES 24,62890,MUNCQ-NIEURLET,,,62598,,,,,,,,,,,,,,,,,,,2014-11-01,F,,,,,85.53Z,NAFRev2,N,2.119793,50.84931,0.67,street,Rue Zae les Vingt Quatre 62890 Muncq-Nieurlet,62598_0075,G,RUE ZAE LES VINGT QUATRE,
500919154,00012,50091915400012,O,2007-11-13,NN,,,2019-11-14T14:00:50,false,4,,13,,RUE,DE LA PETITE HOLLANDE,62890,MUNCQ-NIEURLET,,,62598,,,,,,,,,,,,,,,,,,,2010-12-01,F,VIRGINIE COIFFURE,,,,96.02A,NAFRev2,O,2.114836,50.844224,0.94,housenumber,13 Rue de la Petite Hollande 62890 Muncq-Nieurlet,62598_0038_00013,G,13 RUE DE LA PETITE HOLLANDE,
500919154,00020,50091915400020,O,2010-12-01,02,2017,9602AA,2019-11-14T14:00:50,false,2,,8,,,ZAE LES VINGT QUATRE,62890,MUNCQ-NIEURLET,,,62598,,,,,,,,,,,,,,,,,,,2019-08-01,F,,,,,96.02A,NAFRev2,O,2.118708,50.849351,0.89,housenumber,8 Rue Zae les Vingt Quatre 62890 Muncq-Nieurlet,62598_0075_00008,G,8 RUE ZAE LES VINGT QUATRE,
500919154,00046,50091915400046,O,2019-08-01,,,9602AA,2020-05-27T08:07:16,false,2,,88,B,RUE,DU BOURG,62890,MUNCQ-NIEURLET,,,62598,,,,,,,,,,,,,,,,,,,2020-05-11,F,VIRGINIE COIFFURE,,,VIRGINIE COIFFURE,96.02A,NAFRev2,O,2.112872,50.84916,0.78,housenumber,88 bis Rue du Bourg 62890 Muncq-Nieurlet,62598_0006_00088_bis,G,88 BIS RUE DU BOURG,