siren,nic,siret,statutDiffusionEtablissement,dateCreationEtablissement,trancheEffectifsEtablissement,anneeEffectifsEtablissement,activitePrincipaleRegistreMetiersEtablissement,dateDernierTraitementEtablissement,etablissementSiege,nombrePeriodesEtablissement,complementAdresseEtablissement,numeroVoieEtablissement,indiceRepetitionEtablissement,typeVoieEtablissement,libelleVoieEtablissement,codePostalEtablissement,libelleCommuneEtablissement,libelleCommuneEtrangerEtablissement,distributionSpecialeEtablissement,codeCommuneEtablissement,codeCedexEtablissement,libelleCedexEtablissement,codePaysEtrangerEtablissement,libellePaysEtrangerEtablissement,complementAdresse2Etablissement,numeroVoie2Etablissement,indiceRepetition2Etablissement,typeVoie2Etablissement,libelleVoie2Etablissement,codePostal2Etablissement,libelleCommune2Etablissement,libelleCommuneEtranger2Etablissement,distributionSpeciale2Etablissement,codeCommune2Etablissement,codeCedex2Etablissement,libelleCedex2Etablissement,codePaysEtranger2Etablissement,libellePaysEtranger2Etablissement,dateDebut,etatAdministratifEtablissement,enseigne1Etablissement,enseigne2Etablissement,enseigne3Etablissement,denominationUsuelleEtablissement,activitePrincipaleEtablissement,nomenclatureActivitePrincipaleEtablissement,caractereEmployeurEtablissement,longitude,latitude,geo_score,geo_type,geo_adresse,geo_id,geo_ligne,geo_l4,geo_l5
217302108,00014,21730210800014,O,1983-03-01,03,2017,,2019-06-24T13:12:03,true,4,HOTEL DE VILLE,,,,,73190,PUYGROS,,,73210,,,,,,,,,,,,,,,,,,,2008-01-01,A,MAIRIE,,,,84.11Z,NAFRev2,O,6.02596,45.571307,0.44,locality,Devant le Village 73190 Puygros,73210_b025,D,DEVANT LE VILLAGE,
217302108,00022,21730210800022,O,1983-12-21,01,2017,,2019-06-24T13:12:03,false,4,,,,,CHEF LIEU,73190,PUYGROS,,,73210,,,,,,,,,,,,,,,,,,,2008-01-01,A,ECOLE ELEMENTAIRE PUBLIQUE,,,,85.20Z,NAFRev2,N,6.033362,45.567334,0.93,locality,Chef Lieu 73190 Puygros,73210_b012,G,CHEF LIEU,
217302108,00030,21730210800030,O,1997-01-01,NN,,,2011-07-08T15:45:40,false,4,MAIRIE,,,,,73190,PUYGROS,,,73210,,,,,,,,,,,,,,,,,,,2008-01-01,F,SERVICE EAU ET ASSAINISSEMENT,,,,36.00Z,NAFRev2,N,,,0,,,,,,
217302108,00048,21730210800048,O,1980-01-01,NN,,,2008-01-04T18:41:27,false,3,,,,,,73190,PUYGROS,,,73210,,,,,,,,,,,,,,,,,,,2008-01-01,A,,,,,01.11Z,NAFRev2,N,,,0,,,,,,
267301281,00015,26730128100015,O,1953-02-07,,,,2018-07-26T13:50:37,true,4,,,,,MAIRIE,73190,PUYGROS,,,73210,,,,,,,,,,,,,,,,,,,2017-01-01,F,CCAS,,,,88.99B,NAFRev2,N,3.0709671,50.6304695,0.92,poi.townhall,Hôtel de Ville Lille,https://osm.org/way/40917078,G,,
302954938,00015,30295493800015,O,,,,,,true,1,,,,,,73190,PUYGROS,,,73210,,,,,,,,,,,,,,,,,,,1984-12-25,F,,,,,55.71,NAP,N,,,0,,,,,,
317640472,00013,31764047200013,O,1964-01-01,NN,,,2011-07-03T04:57:16,true,4,,,,LD,ARVEY,73190,PUYGROS,,,73210,,,,,,,,,,,,,,,,,,,2011-06-30,F,,,,,43.32A,NAFRev2,N,6.040368,45.563635,0.91,locality,Arvey Haut 73190 Puygros,73210_b003,G,ARVEY HAUT,
320615263,00037,32061526300037,O,2000-07-25,NN,,,2006-10-27T01:09:54,false,4,FENESTROZ,176,,RUE,FENESTROZ,73190,PUYGROS,,,73210,,,,,,,,,,,,,,,,,,,2005-09-09,F,,,,,92.3A,NAFRev1,N,,,0,,,,,,
330373044,00016,33037304400016,O,,NN,,,,true,1,,,,LD,VILLAGE D ARVEY LA CONDEMI,73190,PUYGROS,,,73210,,,,,,,,,,,,,,,,,,,1994-02-03,F,,,,,45.4A,NAF1993,N,,,0,,,,,,
332331586,00013,33233158600013,O,1985-04-01,NN,,,2016-03-29T04:08:12,true,4,,,,,,73190,PUYGROS,,,73210,,,,,,,,,,,,,,,,,,,2016-02-24,A,,,,,68.20B,NAFRev2,N,,,0,,,,,,
343468955,00020,34346895500020,O,2010-11-15,,,8121ZZ,2019-11-15T16:45:27,true,3,,,,,MARLE,73190,PUYGROS,,,73210,,,,,,,,,,,,,,,,,,,2019-11-18,A,,,,BRICO-SERVICE A 2 ROUES,81.21Z,NAFRev2,N,3.7686735,49.7402398,0.89,poi.school,(École) Marle,https://osm.org/way/203875200,G,,
343538682,00018,34353868200018,O,1985-01-01,NN,,,2014-03-25T13:53:24,true,4,,,,,,73190,PUYGROS,,,73210,,,,,,,,,,,,,,,,,,,2012-03-01,F,,,,,01.41Z,NAFRev2,N,,,0,,,,,,
344708920,00022,34470892000022,O,1992-06-20,NN,,,2008-01-04T22:31:38,true,3,,,,,ARVEY HAUT,73190,PUYGROS,,,73210,,,,,,,,,,,,,,,,,,,2008-01-01,A,,,,,74.30Z,NAFRev2,N,6.040368,45.563635,0.93,locality,Arvey Haut 73190 Puygros,73210_b003,G,ARVEY HAUT,
344753744,00012,34475374400012,O,1988-04-08,NN,,,2014-07-08T00:49:47,true,4,,,,LD,ARVEY,73190,PUYGROS,,,73210,,,,,,,,,,,,,,,,,,,2009-12-25,F,,,,,43.32A,NAFRev2,N,6.040368,45.563635,0.91,locality,Arvey Haut 73190 Puygros,73210_b003,G,ARVEY HAUT,
344753751,00017,34475375100017,O,1988-04-08,NN,,,2014-07-08T00:49:47,true,4,,,,LD,ARVEY,73190,PUYGROS,,,73210,,,,,,,,,,,,,,,,,,,2011-06-30,F,,,,,43.32B,NAFRev2,N,6.040368,45.563635,0.91,locality,Arvey Haut 73190 Puygros,73210_b003,G,ARVEY HAUT,
349641795,00019,34964179500019,O,1975-12-01,NN,,,2008-01-04T23:07:01,true,3,,,,,,73190,PUYGROS,,,73210,,,,,,,,,,,,,,,,,,,2008-01-01,A,,,,,77.31Z,NAFRev2,N,,,0,,,,,,
380847897,00010,38084789700010,O,1991-02-11,NN,,,2011-12-05T09:13:49,true,4,,,,,VILLAGE DU BOIS,73190,PUYGROS,,,73210,,,,,,,,,,,,,,,,,,,2011-12-31,F,,,,,01.42Z,NAFRev2,N,6.02596,45.571307,0.47,locality,Devant le Village 73190 Puygros,73210_b025,G,DEVANT LE VILLAGE,
389425828,00016,38942582800016,O,1993-01-01,00,2017,,2019-06-24T13:16:18,true,4,,,,LD,LE BOIS,73190,PUYGROS,,,73210,,,,,,,,,,,,,,,,,,,2012-12-31,A,,,,,46.23Z,NAFRev2,O,6.02596,45.571307,0.33,locality,Devant le Village 73190 Puygros,73210_b025,G,DEVANT LE VILLAGE,
390627297,00018,39062729700018,O,1992-01-01,NN,,,2007-01-18T09:32:56,true,3,,,,,L'EPINE,73190,PUYGROS,,,73210,,,,,,,,,,,,,,,,,,,1996-05-01,F,,,,,01.2A,NAF1993,N,6.038048,45.569988,0.93,street,L'Épine 73190 Puygros,73210_znyc8f,G,L EPINE,
391798436,00013,39179843600013,O,1900-01-01,NN,,,2011-04-28T00:56:23,false,3,,,,,CHEF LIEU,73190,PUYGROS,,,73210,,,,,,,,,,,,,,,,,,,1993-12-25,F,,,,,85.1C,NAF1993,N,6.033362,45.567334,0.93,locality,Chef Lieu 73190 Puygros,73210_b012,G,CHEF LIEU,
393794128,00016,39379412800016,O,1994-01-29,02,2017,8122ZZ,2019-06-24T13:19:39,true,3,,,,,LE CHENE,73190,PUYGROS,,,73210,,,,,,,,,,,,,,,,,,,2008-01-01,A,,,,,81.21Z,NAFRev2,N,6.04238,45.560382,0.31,locality,Le Grand Vernet 73190 Puygros,73210_b034,G,LE GRAND VERNET,
394197974,00014,39419797400014,O,1993-01-01,NN,,,2006-10-28T02:07:22,true,3,,,,,FENESTROZ,73190,PUYGROS,,,73210,,,,,,,,,,,,,,,,,,,2006-03-06,F,,,,,01.2A,NAFRev1,N,5.7743454,45.8648214,0.71,poi.viewpoint,Point de vue du Fenestrez Culoz,https://osm.org/node/413513802,G,,
397972373,00013,39797237300013,O,1994-08-01,,,,2008-01-04T18:39:22,true,4,CHEZ MR MONGELLAZ RENE,,,,HAMEAU FENESTROZ,73190,PUYGROS,,,73210,,,,,,,,,,,,,,,,,,,2008-01-01,A,,,,,78.30Z,NAFRev2,N,,,0,,,,,,
398236414,00015,39823641400015,O,1994-09-15,NN,,,2018-09-18T04:35:10,true,5,,,,,,73190,PUYGROS,,,73210,,,,,,,,,,,,,,,,,,,2008-01-01,F,,,,,01.42Z,NAFRev2,N,,,0,,,,,,
398589234,00010,39858923400010,O,1994-10-01,NN,,,2008-01-04T18:53:05,true,3,CHEZ M. PAUL GANDIN,,,,ARVEY,73190,PUYGROS,,,73210,,,,,,,,,,,,,,,,,,,2008-01-01,A,,,,,90.01Z,NAFRev2,N,6.040368,45.563635,0.91,locality,Arvey Haut 73190 Puygros,73210_b003,G,ARVEY HAUT,
401707989,00018,40170798900018,O,1995-04-30,NN,,,2007-01-18T09:37:24,true,3,,,,,HAMEAU D'ARVEY,73190,PUYGROS,,,73210,,,,,,,,,,,,,,,,,,,1995-12-25,F,,,,,01.3Z,NAF1993,N,6.040368,45.563635,0.43,locality,Arvey Haut 73190 Puygros,73210_b003,G,ARVEY HAUT,
401753199,00017,40175319900017,O,1995-05-01,NN,,,,true,1,,,,,D'ARVEY,73190,PUYGROS,,,73210,,,,,,,,,,,,,,,,,,,1998-06-30,F,,,,,01.3Z,NAF1993,N,6.040368,45.563635,0.66,locality,Arvey Haut 73190 Puygros,73210_b003,G,ARVEY HAUT,
404304081,00015,40430408100015,O,1995-11-01,NN,,,2006-10-28T03:20:25,true,3,,,,,LE BOIS,73190,PUYGROS,,,73210,,,,,,,,,,,,,,,,,,,2005-04-15,F,,,,,01.2A,NAFRev1,N,6.02596,45.571307,0.33,locality,Devant le Village 73190 Puygros,73210_b025,G,DEVANT LE VILLAGE,
405326737,00013,40532673700013,O,1996-05-01,NN,,,2011-04-23T09:08:24,true,4,,,,,L'EPINE,73190,PUYGROS,,,73210,,,,,,,,,,,,,,,,,,,2010-01-15,A,,,,,68.20B,NAFRev2,N,6.038048,45.569988,0.93,street,L'Épine 73190 Puygros,73210_znyc8f,G,L EPINE,
408670487,00011,40867048700011,O,1980-01-01,NN,,,2008-01-04T21:14:53,true,3,,,,HAM,DE FENESTROZ,73190,PUYGROS,,,73210,,,,,,,,,,,,,,,,,,,2008-01-01,A,,,,,01.42Z,NAFRev2,N,,,0,,,,,,
408670495,00014,40867049500014,O,1981-01-01,NN,,,2007-01-16T14:55:40,true,4,,,,HAM,DE FENETROZ,73190,PUYGROS,,,73210,,,,,,,,,,,,,,,,,,,2006-12-31,F,,,,,01.2A,NAFRev1,N,,,0,,,,,,
408670503,00015,40867050300015,O,1980-01-01,NN,,,2008-01-04T21:14:53,true,3,,,,,ARVEY,73190,PUYGROS,,,73210,,,,,,,,,,,,,,,,,,,2008-01-01,A,,,,,01.11Z,NAFRev2,N,6.040368,45.563635,0.91,locality,Arvey Haut 73190 Puygros,73210_b003,G,ARVEY HAUT,
410988760,00014,41098876000014,O,1987-01-01,NN,,,2008-01-04T21:51:49,true,3,,,,,,73190,PUYGROS,,,73210,,,,,,,,,,,,,,,,,,,2008-01-01,A,,,,,01.42Z,NAFRev2,N,,,0,,,,,,
415257336,00016,41525733600016,O,1997-09-22,NN,,,2016-03-30T05:02:39,true,4,,,,,ARVEY,73190,PUYGROS,,,73210,,,,,,,,,,,,,,,,,,,2015-11-30,F,,,,,82.99Z,NAFRev2,N,6.040368,45.563635,0.91,locality,Arvey Haut 73190 Puygros,73210_b003,G,ARVEY HAUT,
421549080,00016,42154908000016,O,1998-12-10,NN,,,,true,1,,,,,CHEF LIEU,73190,PUYGROS,,,73210,,,,,,,,,,,,,,,,,,,2001-06-30,F,,,,,55.4B,NAF1993,N,6.033362,45.567334,0.93,locality,Chef Lieu 73190 Puygros,73210_b012,G,CHEF LIEU,
423669670,00048,42366967000048,O,2011-10-15,,,,2015-01-28T09:21:06,true,2,,1,,LD,FENESTRAZ,73190,PUYGROS,,,73210,,,,,,,,,,,,,,,,,,,2013-12-20,F,,,,,85.51Z,NAFRev2,N,,,0,,,,,,
423871151,00050,42387115100050,O,2006-06-07,,,,2016-01-18T21:57:35,false,2,LE BILBOQUET,,,,LES COCHES,73190,PUYGROS,,,73210,,,,,,,,,,,,,,,,,,,2006-06-30,F,,,,,70.2A,NAFRev1,N,6.7329675,45.5535955,0.89,poi.gondola,Les Coches (Télécabine) La Plagne-Tarentaise,https://osm.org/way/48058430,G,,
424418937,00027,42441893700027,O,2001-12-26,NN,,,2014-07-08T02:02:23,true,5,,,,,PRE SALOMON FENESTROZ,73190,PUYGROS,,,73210,,,,,,,,,,,,,,,,,,,2009-07-31,F,,,,,43.99C,NAFRev2,O,6.033991,45.572589,0.57,locality,Pre Salomon 73190 Puygros,73210_b052,G,PRE SALOMON,
427449871,00016,42744987100016,O,1989-01-01,NN,,,2008-01-05T01:16:29,true,3,,,,,,73190,PUYGROS,,,73210,,,,,,,,,,,,,,,,,,,2008-01-01,A,,,,,96.09Z,NAFRev2,N,,,0,,,,,,
427450416,00016,42745041600016,O,1972-01-01,NN,,,2012-07-28T15:19:51,true,4,,,,,LE NANT,73190,PUYGROS,,,73210,,,,,,,,,,,,,,,,,,,2011-12-25,F,,,,,01.41Z,NAFRev2,N,6.02596,45.571307,0.55,locality,Devant le Village 73190 Puygros,73210_b025,G,DEVANT LE VILLAGE,
429587553,00026,42958755300026,O,2002-11-20,NN,,,2008-11-08T01:51:38,false,4,,,,,LE VERGER,73190,PUYGROS,,,73210,,,,,,,,,,,,,,,,,,,2006-04-01,F,,,,,45.2K,NAFRev1,N,6.04238,45.560382,0.46,locality,Le Grand Vernet 73190 Puygros,73210_b034,G,LE GRAND VERNET,
431836162,00013,43183616200013,O,2000-05-22,NN,,,2010-04-18T08:43:51,false,4,,2,,,CLOS DU MIRADOU,73190,PUYGROS,,,73210,,,,,,,,,,,,,,,,,,,2009-01-15,F,,,,,49.41A,NAFRev2,O,6.035481,45.565241,0.84,locality,Clos du Miradou 73190 Puygros,73210_a011,G,CLOS DU MIRADOU,
432666816,00017,43266681600017,O,2000-06-14,NN,,,2008-11-08T01:56:45,false,4,,,,,ARVEY,73190,PUYGROS,,,73210,,,,,,,,,,,,,,,,,,,2002-08-01,F,,,,,74.7Z,NAF1993,N,6.040368,45.563635,0.91,locality,Arvey Haut 73190 Puygros,73210_b003,G,ARVEY HAUT,
437637945,00019,43763794500019,O,2001-05-03,,,,,true,1,,,,,ARVEY,73190,PUYGROS,,,73210,,,,,,,,,,,,,,,,,,,2001-11-01,F,,,,,74.8F,NAF1993,N,6.040368,45.563635,0.91,locality,Arvey Haut 73190 Puygros,73210_b003,G,ARVEY HAUT,
444437552,00029,44443755200029,O,2006-06-02,NN,,4322AZ,2015-03-17T01:10:55,true,4,,,,,LIEU DIT MARLE,73190,PUYGROS,,,73210,,,,,,,,,,,,,,,,,,,2010-12-31,A,,,,,43.22A,NAFRev2,N,3.7686735,49.7402398,0.89,poi.school,(École) Marle,https://osm.org/way/203875200,G,,
447829508,00012,44782950800012,O,2003-03-24,NN,,,2009-01-06T20:19:16,false,4,CHEZ M. JACQUIER DENIS,,,,LE FERESTROZ,73190,PUYGROS,,,73210,,,,,,,,,,,,,,,,,,,2009-01-01,F,,,,,64.20Z,NAFRev2,N,,,0,,,,,,
450782347,00014,45078234700014,O,2003-12-01,NN,,,2019-03-09T04:04:19,true,3,,,,,LE CHENE,73190,PUYGROS,,,73210,,,,,,,,,,,,,,,,,,,2008-01-01,A,,,,,68.20B,NAFRev2,N,6.04238,45.560382,0.31,locality,Le Grand Vernet 73190 Puygros,73210_b034,G,LE GRAND VERNET,
452466824,00011,45246682400011,O,1985-01-01,NN,,,2008-01-05T02:44:28,true,3,,,,,VILLAGE DU BOIS,73190,PUYGROS,,,73210,,,,,,,,,,,,,,,,,,,2008-01-01,A,,,,,01.42Z,NAFRev2,N,6.02596,45.571307,0.47,locality,Devant le Village 73190 Puygros,73210_b025,G,DEVANT LE VILLAGE,
480520758,00016,48052075800016,O,2005-01-06,,,,2008-11-08T02:47:38,true,3,FENESTROZ,,,,FENESTROZ,73190,PUYGROS,,,73210,,,,,,,,,,,,,,,,,,,2008-01-01,F,,,,,43.22A,NAFRev2,N,5.7743454,45.8648214,0.71,poi.viewpoint,Point de vue du Fenestrez Culoz,https://osm.org/node/413513802,G,,
482215019,00019,48221501900019,O,2005-04-15,NN,,,2012-05-05T10:27:02,true,2,LE BOIS,,,,,73190,PUYGROS,,,73210,,,,,,,,,,,,,,,,,,,2008-01-01,A,,,,,01.42Z,NAFRev2,N,6.02596,45.571307,0.33,locality,Devant le Village 73190 Puygros,73210_b025,D,DEVANT LE VILLAGE,
482636495,00046,48263649500046,O,2013-06-15,,,,2015-12-02T09:36:58,false,4,,,,,LE VERGER,73190,PUYGROS,,,73210,,,,,,,,,,,,,,,,,,,2016-01-01,F,,,,,86.90D,NAFRev2,N,6.04238,45.560382,0.46,locality,Le Grand Vernet 73190 Puygros,73210_b034,G,LE GRAND VERNET,
487571929,00016,48757192900016,O,2005-11-26,,,,2008-01-05T21:58:17,true,2,CHEMIN DU CHANAY,,,,VILLAGE D'ARVEY,73190,PUYGROS,,,73210,,,,,,,,,,,,,,,,,,,2008-01-01,A,,,,,68.20B,NAFRev2,N,6.040368,45.563635,0.35,locality,Arvey Haut 73190 Puygros,73210_b003,G,ARVEY HAUT,
487636557,00018,48763655700018,O,2006-01-02,,,4321AB,2015-03-17T01:27:36,true,2,,,,,MARLES,73190,PUYGROS,,,73210,,,,,,,,,,,,,,,,,,,2008-01-01,A,M D ELECTRICITE,,,,43.21A,NAFRev2,N,3.6663195,49.6191004,0.89,poi.track,Chemin de Marles Barenton-Bugny,https://osm.org/way/175222148,G,,
490408242,00017,49040824200017,O,2006-03-06,,,,2008-01-05T03:31:02,true,2,FENESTROZ,,,,,73190,PUYGROS,,,73210,,,,,,,,,,,,,,,,,,,2008-01-01,A,,,,,01.50Z,NAFRev2,N,,,0,,,,,,
493627855,00015,49362785500015,O,2006-12-18,,,,2015-11-26T13:46:33,true,4,,,,LD,ARVEY,73190,PUYGROS,,,73210,,,,,,,,,,,,,,,,,,,2014-03-31,F,,,,,77.39Z,NAFRev2,N,6.040368,45.563635,0.91,locality,Arvey Haut 73190 Puygros,73210_b003,G,ARVEY HAUT,
493768444,00025,49376844400025,O,2009-12-17,,,,2011-04-04T13:35:43,true,1,RAMPEAUX,,,,RAMPEAUX,73190,PUYGROS,,,73210,,,,,,,,,,,,,,,,,,,2009-12-17,A,,,,,35.11Z,NAFRev2,N,4.701234,44.1281172,0.88,poi.sports_centre,Tennis Club des Rampeaux (Centre sportif) Codolet,https://osm.org/way/284858039,G,,
499623080,00029,49962308000029,O,2012-11-21,,,4334ZC,2014-06-27T00:50:24,true,1,,,,,LE BOIS,73190,PUYGROS,,,73210,,,,,,,,,,,,,,,,,,,2012-11-21,A,,,,,43.34Z,NAFRev2,N,6.02596,45.571307,0.33,locality,Devant le Village 73190 Puygros,73210_b025,G,DEVANT LE VILLAGE,
502211808,00014,50221180800014,O,2008-02-04,,,4321AB,2015-03-18T00:14:14,true,1,,,,,LE BOIS,73190,PUYGROS,,,73210,,,,,,,,,,,,,,,,,,,2008-02-04,A,,,,,43.21A,NAFRev2,N,6.02596,45.571307,0.33,locality,Devant le Village 73190 Puygros,73210_b025,G,DEVANT LE VILLAGE,
503771073,00015,50377107300015,O,2008-04-14,NN,,,2014-07-10T01:18:11,false,3,,,,,LE FENESTROZ,73190,PUYGROS,,,73210,,,,,,,,,,,,,,,,,,,2012-06-28,F,,,,,41.20A,NAFRev2,O,,,0,,,,,,
504332032,00011,50433203200011,O,2008-05-15,,,,2013-10-22T03:27:28,true,2,,,,,LE VERGER,73190,PUYGROS,,,73210,,,,,,,,,,,,,,,,,,,2013-10-06,F,,,,,70.22Z,NAFRev2,N,6.04238,45.560382,0.46,locality,Le Grand Vernet 73190 Puygros,73210_b034,G,LE GRAND VERNET,
504601626,00014,50460162600014,O,2008-04-14,,,,2020-06-09T11:53:42,true,3,,,,LD,LE FENESTROZ,73190,PUYGROS,,,73210,,,,,,,,,,,,,,,,,,,2019-04-01,A,,,,,68.20A,NAFRev2,N,,,0,,,,,,
504601626,00022,50460162600022,O,2010-06-01,,,4312AZ,2020-06-09T11:52:06,false,4,LE FENESTROZ,,,,LE FENESTROZ,73190,PUYGROS,,,73210,,,,,,,,,,,,,,,,,,,2016-12-31,F,,,,,43.12A,NAFRev2,N,,,0,,,,,,
508803111,00014,50880311100014,O,2008-10-10,,,,2008-10-31T11:13:17,true,1,,,,,LE CHENE,73190,PUYGROS,,,73210,,,,,,,,,,,,,,,,,,,2008-10-10,A,,,,,68.20B,NAFRev2,N,6.04238,45.560382,0.31,locality,Le Grand Vernet 73190 Puygros,73210_b034,G,LE GRAND VERNET,
509470555,00020,50947055500020,O,2019-03-19,,,,2020-05-12T16:08:20,true,2,,,,,LE CHENE,73190,PUYGROS,,,73210,,,,,,,,,,,,,,,,,,,2020-05-12,A,,,,,74.90B,NAFRev2,O,6.04238,45.560382,0.31,locality,Le Grand Vernet 73190 Puygros,73210_b034,G,LE GRAND VERNET,
509536090,00012,50953609000012,O,2008-11-01,,,,2012-01-27T04:07:35,true,2,,,,,CHEF LIEU,73190,PUYGROS,,,73210,,,,,,,,,,,,,,,,,,,2011-12-31,F,,,,,90.03A,NAFRev2,N,6.033362,45.567334,0.93,locality,Chef Lieu 73190 Puygros,73210_b012,G,CHEF LIEU,
509839965,00019,50983996500019,O,2009-01-01,,,,2014-10-24T15:43:56,false,2,LE MIRADOU,,,,CHEF LIEU,73190,PUYGROS,,,73210,,,,,,,,,,,,,,,,,,,2014-09-01,F,A2A CONSULTANT,,,,66.21Z,NAFRev2,N,6.033362,45.567334,0.93,locality,Chef Lieu 73190 Puygros,73210_b012,G,CHEF LIEU,
511121519,00017,51112151900017,O,2009-04-05,,,,2017-04-14T11:27:16,true,3,,,,,LE CHENE,73190,PUYGROS,,,73210,,,,,,,,,,,,,,,,,,,2017-01-01,A,,,,,81.30Z,NAFRev2,N,6.04238,45.560382,0.31,locality,Le Grand Vernet 73190 Puygros,73210_b034,G,LE GRAND VERNET,
511895831,00010,51189583100010,O,2009-01-01,NN,,,2011-04-23T17:55:19,true,2,CHEF LIEU,,,,ECOLE DE PUYGROS,73190,PUYGROS,,,73210,,,,,,,,,,,,,,,,,,,2009-07-12,A,,,,,94.99Z,NAFRev2,O,6.034477,45.567718,0.65,locality,Pre de la Campagne 73190 Puygros,73210_b049,G,PRE DE LA CAMPAGNE,
514449537,00018,51444953700018,O,2009-09-01,,,,2013-02-05T04:40:20,true,2,,,,,FENESTROZ,73190,PUYGROS,,,73210,,,,,,,,,,,,,,,,,,,2013-01-01,F,,,,,47.91A,NAFRev2,N,5.7743454,45.8648214,0.71,poi.viewpoint,Point de vue du Fenestrez Culoz,https://osm.org/node/413513802,G,,
517922860,00013,51792286000013,O,2009-10-29,,,9602BB,2015-03-18T00:26:05,true,2,,,,,LIEU-DIT ARVEY,73190,PUYGROS,,,73210,,,,,,,,,,,,,,,,,,,2011-06-08,A,AU PALAIS DE L'ONGLE,,,,96.02B,NAFRev2,N,6.040368,45.563635,0.91,locality,Arvey Haut 73190 Puygros,73210_b003,G,ARVEY HAUT,
518947916,00020,51894791600020,O,2014-05-19,,,,2014-05-13T11:03:23,true,1,CHEF LIEU,,,,LA CURE,73190,PUYGROS,,,73210,,,,,,,,,,,,,,,,,,,2014-05-19,A,,,,,43.32A,NAFRev2,N,6.034477,45.567718,0.56,locality,Pre de la Campagne 73190 Puygros,73210_b049,G,PRE DE LA CAMPAGNE,
520110339,00014,52011033900014,O,2010-01-21,,,,2019-12-18T03:41:49,true,2,,,,,FENESTROZ,73190,PUYGROS,,,73210,,,,,,,,,,,,,,,,,,,2019-10-30,F,,,,,85.51Z,NAFRev2,N,5.7743454,45.8648214,0.71,poi.viewpoint,Point de vue du Fenestrez Culoz,https://osm.org/node/413513802,G,,
520699604,00010,52069960400010,O,2010-01-15,01,2017,,2019-06-24T13:24:58,true,2,,,,CHE,DE L EPINE,73190,PUYGROS,,,73210,,,,,,,,,,,,,,,,,,,2014-12-31,A,EARL LA FERME CHATELAIN,,,,01.41Z,NAFRev2,O,6.038048,45.569988,0.55,street,L'Épine 73190 Puygros,73210_znyc8f,G,L EPINE,
520749052,00012,52074905200012,O,2010-04-01,,,,2010-03-05T08:58:20,true,1,FENESTROZ,,,,,73190,PUYGROS,,,73210,,,,,,,,,,,,,,,,,,,2010-04-01,A,,,,,01.41Z,NAFRev2,N,,,0,,,,,,
522712009,00011,52271200900011,O,2010-05-03,,,,2013-02-15T04:27:38,true,2,,,,,CHEF LIEU,73190,PUYGROS,,,73210,,,,,,,,,,,,,,,,,,,2011-09-30,F,,,,,41.20A,NAFRev2,N,6.033362,45.567334,0.93,locality,Chef Lieu 73190 Puygros,73210_b012,G,CHEF LIEU,
524938636,00015,52493863600015,O,2010-09-11,,,,2012-11-10T02:29:43,true,2,ARVEY,,,LD,LIEU DIT,73190,PUYGROS,,,73210,,,,,,,,,,,,,,,,,,,2011-08-31,F,,,,,96.02B,NAFRev2,N,6.033362,45.567334,0.5,locality,Chef Lieu 73190 Puygros,73210_b012,G,CHEF LIEU,
525382362,00016,52538236200016,O,2010-03-03,,,,2010-10-06T13:29:17,true,1,,,,,VILLAGE D ARVEY,73190,PUYGROS,,,73210,,,,,,,,,,,,,,,,,,,2010-03-03,A,,,,,94.99Z,NAFRev2,N,6.040368,45.563635,0.35,locality,Arvey Haut 73190 Puygros,73210_b003,G,ARVEY HAUT,
527639017,00013,52763901700013,O,2010-04-28,,,,2010-10-14T16:27:03,true,1,FENESTROZ,,,,,73190,PUYGROS,,,73210,,,,,,,,,,,,,,,,,,,2010-04-28,A,,,,,94.99Z,NAFRev2,N,,,0,,,,,,
527913701,00019,52791370100019,O,1978-07-12,,,,2010-10-26T11:53:04,true,1,,,,,MAIRIE,73190,PUYGROS,,,73210,,,,,,,,,,,,,,,,,,,1978-07-12,A,,,,,94.99Z,NAFRev2,N,3.0709671,50.6304695,0.92,poi.townhall,Hôtel de Ville Lille,https://osm.org/way/40917078,G,,
530154160,00010,53015416000010,O,2011-01-01,,,,2011-02-09T09:25:08,true,1,,,,,FENESTROZ,73190,PUYGROS,,,73210,,,,,,,,,,,,,,,,,,,2011-01-01,A,,,,,35.11Z,NAFRev2,N,5.7743454,45.8648214,0.71,poi.viewpoint,Point de vue du Fenestrez Culoz,https://osm.org/node/413513802,G,,
530167436,00019,53016743600019,O,2011-02-14,,,,2012-11-10T02:54:52,true,1,ARVEY,,,,,73190,PUYGROS,,,73210,,,,,,,,,,,,,,,,,,,2011-02-14,A,,,,,82.99Z,NAFRev2,N,6.040368,45.563635,0.91,locality,Arvey Haut 73190 Puygros,73210_b003,D,ARVEY HAUT,
533089702,00013,53308970200013,O,2011-02-23,,,,2018-09-19T04:41:07,true,2,,,,LD,ARVEY,73190,PUYGROS,,,73210,,,,,,,,,,,,,,,,,,,2015-10-31,F,,,,,68.20B,NAFRev2,N,6.040368,45.563635,0.91,locality,Arvey Haut 73190 Puygros,73210_b003,G,ARVEY HAUT,
534191770,00013,53419177000013,O,2011-04-22,,,,2011-08-22T10:14:39,true,1,,,,,CHEF LIEU,73190,PUYGROS,,,73210,,,,,,,,,,,,,,,,,,,2011-04-22,A,,,,,68.20B,NAFRev2,N,6.033362,45.567334,0.93,locality,Chef Lieu 73190 Puygros,73210_b012,G,CHEF LIEU,
534815261,00019,53481526100019,O,2011-09-01,,,,2011-10-20T19:37:34,true,1,,,,,LE BOIS,73190,PUYGROS,,,73210,,,,,,,,,,,,,,,,,,,2011-09-01,A,,,,,93.12Z,NAFRev2,N,6.02596,45.571307,0.33,locality,Devant le Village 73190 Puygros,73210_b025,G,DEVANT LE VILLAGE,
537787236,00018,53778723600018,O,2012-01-01,,,,2011-11-10T08:43:37,true,1,,,,,LE BOIS,73190,PUYGROS,,,73210,,,,,,,,,,,,,,,,,,,2012-01-01,A,,,,,01.42Z,NAFRev2,N,6.02596,45.571307,0.33,locality,Devant le Village 73190 Puygros,73210_b025,G,DEVANT LE VILLAGE,
745914416,00011,74591441600011,O,1959-01-01,NN,,,2007-01-18T09:45:07,true,4,,,,,LE BOIS,73190,PUYGROS,,,73210,,,,,,,,,,,,,,,,,,,1998-12-25,F,,,,,01.2A,NAF1993,N,6.02596,45.571307,0.33,locality,Devant le Village 73190 Puygros,73210_b025,G,DEVANT LE VILLAGE,
746410174,00013,74641017400013,O,1964-01-01,NN,,,,true,1,,,,,AU BOIS,73190,PUYGROS,,,73210,,,,,,,,,,,,,,,,,,,2002-12-31,F,,,,,01.1G,NAF1993,N,4.7400884,46.3386495,0.89,poi.vineyard,Au Bois (Vignoble) Prissé,https://osm.org/way/50891512,G,,
746711951,00028,74671195100028,O,1900-01-01,NN,,,2016-02-22T08:56:16,true,6,,,,,VILLAGE D ARVEY,73190,PUYGROS,,,73210,,,,,,,,,,,,,,,,,,,2016-01-09,F,,,,,68.20A,NAFRev2,N,6.040368,45.563635,0.35,locality,Arvey Haut 73190 Puygros,73210_b003,G,ARVEY HAUT,
746910330,00016,74691033000016,O,,,,,,true,1,,,,,,73190,PUYGROS,,,73210,,,,,,,,,,,,,,,,,,,1984-12-25,F,,,,,36.10,NAP,N,,,0,,,,,,
747220697,00011,74722069700011,O,,,,,,true,1,,,,,,73190,PUYGROS,,,73210,,,,,,,,,,,,,,,,,,,1984-12-25,F,,,,,,,N,,,0,,,,,,
750174229,00013,75017422900013,O,2012-03-01,,,,2012-03-11T06:19:03,true,1,,,,,VILLAGE DE MARLE,73190,PUYGROS,,,73210,,,,,,,,,,,,,,,,,,,2012-03-01,A,,,,,01.41Z,NAFRev2,N,6.02596,45.571307,0.55,locality,Devant le Village 73190 Puygros,73210_b025,G,DEVANT LE VILLAGE,
752282830,00013,75228283000013,O,2012-07-01,,,,2012-08-07T17:55:55,true,1,,,,,CHEF LIEU,73190,PUYGROS,,,73210,,,,,,,,,,,,,,,,,,,2012-07-01,A,,,,,96.09Z,NAFRev2,N,6.033362,45.567334,0.93,locality,Chef Lieu 73190 Puygros,73210_b012,G,CHEF LIEU,
776489650,00015,77648965000015,O,,,,,,true,1,,,,,,73190,PUYGROS,,,73210,,,,,,,,,,,,,,,,,,,1984-12-25,F,,,,,,,N,,,0,,,,,,
776489668,00017,77648966800017,O,,,,,,true,1,,,,,,73190,PUYGROS,,,73210,,,,,,,,,,,,,,,,,,,1984-12-25,F,,,,,57.05,NAP,N,,,0,,,,,,
776489676,00010,77648967600010,O,1900-01-01,NN,,,,true,4,,,,,,73190,PUYGROS,,,73210,,,,,,,,,,,,,,,,,,,1998-12-31,F,,,,,55.4B,NAF1993,N,,,0,,,,,,
789137072,00011,78913707200011,O,2012-11-01,,,,2016-11-10T05:29:42,true,2,,,,,LIEU DIT ARVEY,73190,PUYGROS,,,73210,,,,,,,,,,,,,,,,,,,2016-08-30,F,,,,,74.90B,NAFRev2,N,6.040368,45.563635,0.91,locality,Arvey Haut 73190 Puygros,73210_b003,G,ARVEY HAUT,
790835821,00014,79083582100014,O,2013-01-23,NN,,,2015-05-14T10:26:29,true,3,,,,,ARVEY,73190,PUYGROS,,,73210,,,,,,,,,,,,,,,,,,,2013-08-01,A,,,,,59.12Z,NAFRev2,N,6.040368,45.563635,0.91,locality,Arvey Haut 73190 Puygros,73210_b003,G,ARVEY HAUT,