siren,nic,siret,statutDiffusionEtablissement,dateCreationEtablissement,trancheEffectifsEtablissement,anneeEffectifsEtablissement,activitePrincipaleRegistreMetiersEtablissement,dateDernierTraitementEtablissement,etablissementSiege,nombrePeriodesEtablissement,complementAdresseEtablissement,numeroVoieEtablissement,indiceRepetitionEtablissement,typeVoieEtablissement,libelleVoieEtablissement,codePostalEtablissement,libelleCommuneEtablissement,libelleCommuneEtrangerEtablissement,distributionSpecialeEtablissement,codeCommuneEtablissement,codeCedexEtablissement,libelleCedexEtablissement,codePaysEtrangerEtablissement,libellePaysEtrangerEtablissement,complementAdresse2Etablissement,numeroVoie2Etablissement,indiceRepetition2Etablissement,typeVoie2Etablissement,libelleVoie2Etablissement,codePostal2Etablissement,libelleCommune2Etablissement,libelleCommuneEtranger2Etablissement,distributionSpeciale2Etablissement,codeCommune2Etablissement,codeCedex2Etablissement,libelleCedex2Etablissement,codePaysEtranger2Etablissement,libellePaysEtranger2Etablissement,dateDebut,etatAdministratifEtablissement,enseigne1Etablissement,enseigne2Etablissement,enseigne3Etablissement,denominationUsuelleEtablissement,activitePrincipaleEtablissement,nomenclatureActivitePrincipaleEtablissement,caractereEmployeurEtablissement,longitude,latitude,geo_score,geo_type,geo_adresse,geo_id,geo_ligne,geo_l4,geo_l5
218802304,00012,21880230400012,O,1983-03-01,01,2017,,2019-06-24T13:12:42,true,3,,,,,GRANDE RUE,88700,HARDANCOURT,,,88230,,,,,,,,,,,,,,,,,,,2008-01-01,A,MAIRIE,,,,84.11Z,NAFRev2,N,6.567597,48.380277,0.92,street,Grande Rue 88700 Hardancourt,88230_0001,G,GRANDE RUE,
218802304,00020,21880230400020,O,1997-01-01,NN,,,2013-10-05T12:17:19,false,4,MAIRIE,,,,GRANDE RUE,88700,HARDANCOURT,,,88230,,,,,,,,,,,,,,,,,,,2012-12-25,F,SERVICE ORDURES MENAGERES,,,,38.11Z,NAFRev2,N,6.567597,48.380277,0.92,street,Grande Rue 88700 Hardancourt,88230_0001,G,GRANDE RUE,
268803111,00015,26880311100015,O,1992-01-01,NN,,,2017-08-06T14:20:10,true,4,,,,,MAIRIE,88700,HARDANCOURT,,,88230,,,,,,,,,,,,,,,,,,,2017-08-01,F,CCAS,,,,88.99B,NAFRev2,N,3.0709671,50.6304695,0.92,poi.townhall,Hôtel de Ville Lille,https://osm.org/way/40917078,G,,
298801119,00017,29880111900017,O,1983-08-10,NN,,,2014-04-16T10:33:41,true,4,MAIRIE,,,,GRANDE RUE,88700,HARDANCOURT,,,88230,,,,,,,,,,,,,,,,,,,2014-01-08,F,,,,,42.99Z,NAFRev2,N,6.567597,48.380277,0.92,street,Grande Rue 88700 Hardancourt,88230_0001,G,GRANDE RUE,
311344824,00017,31134482400017,O,1977-01-01,,,,2008-11-07T00:26:17,true,4,,,,,Z A LES RENNES,88700,HARDANCOURT,,,88230,,,,,,,,,,,,,,,,,,,2004-08-30,F,,,,,02.0B,NAFRev1,N,,,0,,,,,,
329492292,00019,32949229200019,O,1984-01-27,NN,,,2019-02-13T04:14:12,true,4,MR THOMAS GILLES,,,RUE,DES CAVES,88700,HARDANCOURT,,,88230,,,,,,,,,,,,,,,,,,,2012-12-31,A,,,,,01.41Z,NAFRev2,O,6.570892,48.377094,0.92,street,Rue des Caves 88700 Hardancourt,88230_0002,G,RUE DES CAVES,
329492300,00010,32949230000010,O,1984-01-27,01,2017,,2019-06-24T13:25:18,true,5,,1,,RUE,DU PIED MARTIN,88700,HARDANCOURT,,,88230,,,,,,,,,,,,,,,,,,,2012-12-31,A,,,,,01.41Z,NAFRev2,O,6.569138,48.374672,0.92,housenumber,1 Rue du Pied Martin 88700 Hardancourt,88230_eng0k3_00001,G,1 RUE DU PIED MARTIN,
345300610,00010,34530061000010,O,1988-01-01,NN,,,2013-02-02T12:38:53,true,4,LA CHAPELLE-AUX-BOIS,,,,,88700,HARDANCOURT,,,88230,,,,,,,,,,,,,,,,,,,2012-12-25,F,,,,,01.41Z,NAFRev2,N,,,0,,,,,,
383328515,00010,38332851500010,O,,NN,,,,true,1,,,,,ZONE ARTISANALE,88700,HARDANCOURT,,,88230,,,,,,,,,,,,,,,,,,,1995-02-03,F,,,,,20.4Z,NAF1993,N,2.7640352,42.6301915,0.9,poi.retail,Zone Artisanale (Zone commerciale) Thuir,https://osm.org/way/191039530,G,,
391682689,00016,39168268900016,O,1993-07-01,NN,,,,true,1,,5,,,GRANDE RUE,88700,HARDANCOURT,,,88230,,,,,,,,,,,,,,,,,,,1998-06-04,F,,,,,45.4A,NAF1993,N,6.56819,48.379021,0.92,housenumber,5 Grande Rue 88700 Hardancourt,88230_0001_00005,G,5 GRANDE RUE,
407925270,00016,40792527000016,O,1986-01-01,NN,,,2008-01-04T21:01:42,true,3,,4,,GR,RUE,88700,HARDANCOURT,,,88230,,,,,,,,,,,,,,,,,,,2008-01-01,A,,,,,01.41Z,NAFRev2,N,6.568034,48.379241,0.71,housenumber,4 Grande Rue 88700 Hardancourt,88230_0001_00004,G,4 GRANDE RUE,
431635317,00024,43163531700024,O,2001-07-25,NN,,,,true,4,,6,,,GRANDE RUE,88700,HARDANCOURT,,,88230,,,,,,,,,,,,,,,,,,,2003-06-15,F,,,,,60.2L,NAFRev1,N,6.56824,48.378869,0.92,housenumber,6 Grande Rue 88700 Hardancourt,88230_0001_00006,G,6 GRANDE RUE,
452517568,00013,45251756800013,O,2004-01-01,02,2017,4399CZ,2020-02-13T08:35:03,true,5,,13,,,GRANDE RUE,88700,HARDANCOURT,,,88230,,,,,,,,,,,,,,,,,,,2019-12-31,F,,,,SAGARD SEBASTIEN,43.91B,NAFRev2,O,6.567293,48.377532,0.92,housenumber,13 Grande Rue 88700 Hardancourt,88230_0001_00013,G,13 GRANDE RUE,
482863321,00014,48286332100014,O,2004-08-31,01,2017,,2019-06-24T13:18:45,true,4,,,,,ZA LES RENNES,88700,HARDANCOURT,,,88230,,,,,,,,,,,,,,,,,,,2017-04-05,A,,,,,16.10A,NAFRev2,O,,,0,,,,,,
488227471,00031,48822747100031,O,2016-06-16,,,,2016-09-19T08:19:24,true,2,,10,B,,GRANDE RUE,88700,HARDANCOURT,,,88230,,,,,,,,,,,,,,,,,,,2016-09-15,F,,,,,66.19B,NAFRev2,N,6.56858,48.378449,0.74,housenumber,10 bis Grande Rue 88700 Hardancourt,88230_0001_00010_bis,G,10 BIS GRANDE RUE,
789656170,00014,78965617000014,O,2012-11-01,,,,2019-03-16T03:54:25,true,1,,,,RUE,DES CAVES,88700,HARDANCOURT,,,88230,,,,,,,,,,,,,,,,,,,2012-11-01,A,,,,,70.10Z,NAFRev2,N,6.570892,48.377094,0.92,street,Rue des Caves 88700 Hardancourt,88230_0002,G,RUE DES CAVES,
790642060,00012,79064206000012,O,2012-08-02,,,,2013-01-22T09:53:11,true,1,,1,,RUE,DES CAVES,88700,HARDANCOURT,,,88230,,,,,,,,,,,,,,,,,,,2012-08-02,A,,,,,47.99A,NAFRev2,N,6.570892,48.377094,0.92,housenumber,1 Rue des Caves 88700 Hardancourt,88230_0002_00001,G,1 RUE DES CAVES,
844060558,00013,84406055800013,O,2018-11-01,,,,2018-11-23T04:33:31,true,1,,13,,,GRANDE RUE,88700,HARDANCOURT,,,88230,,,,,,,,,,,,,,,,,,,2018-11-01,A,,,,,68.20B,NAFRev2,N,6.567293,48.377532,0.92,housenumber,13 Grande Rue 88700 Hardancourt,88230_0001_00013,G,13 GRANDE RUE,
851426429,00011,85142642900011,O,2019-01-01,,,4312BA,2019-06-07T11:46:10,true,1,,,,RUE,DES CAVES,88700,HARDANCOURT,,,88230,,,,,,,,,,,,,,,,,,,2019-01-01,A,,,,,01.61Z,NAFRev2,N,6.570892,48.377094,0.92,street,Rue des Caves 88700 Hardancourt,88230_0002,G,RUE DES CAVES,
880297981,00016,88029798100016,O,2020-01-01,,,4391AZ,2020-01-30T08:33:39,true,1,,13,,,GRANDE RUE,88700,HARDANCOURT,,,88230,,,,,,,,,,,,,,,,,,,2020-01-01,A,,,,,43.91A,NAFRev2,O,6.567293,48.377532,0.92,housenumber,13 Grande Rue 88700 Hardancourt,88230_0001_00013,G,13 GRANDE RUE,
884167859,00013,88416785900013,O,2020-06-12,,,,2020-06-15T10:38:44,true,1,,1,B,,GRANDE RUE,88700,HARDANCOURT,,,88230,,,,,,,,,,,,,,,,,,,2020-06-12,A,,,,MON COCO,47.78B,NAFRev2,N,6.567977,48.380194,0.75,housenumber,1 bis Grande Rue 88700 Hardancourt,88230_0001_00001_bis,G,1 BIS GRANDE RUE,
