siren,nic,siret,statutDiffusionEtablissement,dateCreationEtablissement,trancheEffectifsEtablissement,anneeEffectifsEtablissement,activitePrincipaleRegistreMetiersEtablissement,dateDernierTraitementEtablissement,etablissementSiege,nombrePeriodesEtablissement,complementAdresseEtablissement,numeroVoieEtablissement,indiceRepetitionEtablissement,typeVoieEtablissement,libelleVoieEtablissement,codePostalEtablissement,libelleCommuneEtablissement,libelleCommuneEtrangerEtablissement,distributionSpecialeEtablissement,codeCommuneEtablissement,codeCedexEtablissement,libelleCedexEtablissement,codePaysEtrangerEtablissement,libellePaysEtrangerEtablissement,complementAdresse2Etablissement,numeroVoie2Etablissement,indiceRepetition2Etablissement,typeVoie2Etablissement,libelleVoie2Etablissement,codePostal2Etablissement,libelleCommune2Etablissement,libelleCommuneEtranger2Etablissement,distributionSpeciale2Etablissement,codeCommune2Etablissement,codeCedex2Etablissement,libelleCedex2Etablissement,codePaysEtranger2Etablissement,libellePaysEtranger2Etablissement,dateDebut,etatAdministratifEtablissement,enseigne1Etablissement,enseigne2Etablissement,enseigne3Etablissement,denominationUsuelleEtablissement,activitePrincipaleEtablissement,nomenclatureActivitePrincipaleEtablissement,caractereEmployeurEtablissement,longitude,latitude,geo_score,geo_type,geo_adresse,geo_id,geo_ligne,geo_l4,geo_l5
130010085,00095,13001008500095,O,2010-01-25,NN,,,2017-05-04T01:10:17,false,2,CENTRE DES FINANCES PUBLIQUES,,,CRS,COLBERT,11230,CHALABRE,,,11091,,,,,,,,,,,,,,,,,,,2017-02-15,F,TRESORERIE  CHALABRE,,,,84.11Z,NAFRev2,N,2.00542,42.982436,0.79,street,Cours Colbert 11230 Chalabre,11091_0070,G,COURS COLBERT,
171102114,00211,17110211400211,O,1983-03-16,,,,2013-04-29T22:35:56,false,4,,,,CRS,COLBERT,11230,CHALABRE,,,11091,,,,,,,,,,,,,,,,,,,2010-01-25,F,TRESORERIE CHALABRE,,,,84.11Z,NAFRev2,N,2.00542,42.982436,0.79,street,Cours Colbert 11230 Chalabre,11091_0070,G,COURS COLBERT,
191108703,00015,19110870300015,O,1983-03-01,11,2017,,2019-06-24T13:07:50,true,4,,1,,ALL,PIERRE LOUIS FABRE,11230,CHALABRE,,,11091,,,,,,,,,,,,,,,,,,,2008-03-18,A,,,,,85.31Z,NAFRev2,O,2.003455,42.987106,0.38,street,La Plaine de Saint Pierre 11230 Chalabre,11091_b065,G,LA PLAINE DE SAINT PIERRE,
200045102,00015,20004510200015,O,2014-01-01,21,2017,,2019-06-24T13:08:41,true,1,,,,,LES HAUTS DE BON ACCUEIL,11230,CHALABRE,,,11091,,,,,,,,,,,,,,,,,,,2014-01-01,A,,,,,87.10A,NAFRev2,O,2.000162,42.980718,0.64,street,Résidence le Clos de Bon Accueil 11230 Chalabre,11091_loa51c,G,RESIDENCE LE CLOS DE BON ACCUEIL,
200045102,00023,20004510200023,O,2014-01-01,11,2017,,2019-12-23T08:34:09,false,2,,7,,CRS,D'AGUESSEAU,11230,CHALABRE,,,11091,,,,,,,,,,,,,,,,,,,2019-12-23,F,SSIAD,,,,86.90D,NAFRev2,O,2.006201,42.983256,0.84,housenumber,7 Cours d'Aguesseau 11230 Chalabre,11091_0015_00007,G,7 COURS D AGUESSEAU,
200045102,00031,20004510200031,O,2019-12-23,,,,2020-01-02T15:55:05,false,1,,,,,LES HAUTS DE BON ACCUEIL,11230,CHALABRE,,,11091,,,,,,,,,,,,,,,,,,,2019-12-23,A,SSIAD,,,,86.90D,NAFRev2,O,2.000162,42.980718,0.64,street,Résidence le Clos de Bon Accueil 11230 Chalabre,11091_loa51c,G,RESIDENCE LE CLOS DE BON ACCUEIL,
211100912,00016,21110091200016,O,1983-03-01,11,2017,,2019-06-24T13:09:22,true,4,HOTEL DE VILLE,,,,,11230,CHALABRE,,,11091,,,,,,,,,,,,,,,,,,,2008-01-01,A,MAIRIE,,,,84.11Z,NAFRev2,O,2.004069,42.982666,0.39,street,Le Village 11230 Chalabre,11091_t7xbrm,D,LE VILLAGE,
211100912,00024,21110091200024,O,1983-12-21,03,2017,,2019-06-24T13:09:22,false,3,,,,PL,SALVADOR ALLENDE,11230,CHALABRE,,,11091,,,,,,,,,,,,,,,,,,,2008-01-01,A,ECOLE PRIMAIRE PUBLIQUE LOUIS PERGAUD,,,,85.20Z,NAFRev2,N,2.005159,42.984439,0.72,street,Place Salvador Aliende 11230 Chalabre,11091_0218,G,PLACE SALVADOR ALIENDE,
211100912,00032,21110091200032,O,1983-12-21,NN,,,2006-10-26T23:40:13,false,3,,,,RUE,DU COMMUNAL,11230,CHALABRE,,,11091,,,,,,,,,,,,,,,,,,,2004-08-31,F,ECOLE MATERNELLE PUBLIQUE,,,,80.1Z,NAFRev1,N,2.005844,42.985201,0.94,street,Rue du Communal 11230 Chalabre,11091_0075,G,RUE DU COMMUNAL,
211100912,00040,21110091200040,O,1993-05-07,NN,,,2008-01-04T18:25:37,false,3,,,,LD,LE CAZAL,11230,CHALABRE,,,11091,,,,,,,,,,,,,,,,,,,2008-01-01,A,CAMPING MUNICIPAL LE CAZAL,,,,55.30Z,NAFRev2,N,2.004615,42.973776,0.94,street,Le Cazal 11230 Chalabre,11091_9x6lkj,G,LE CAZAL,
211100912,00057,21110091200057,O,1994-04-15,NN,,,2008-01-04T18:25:37,false,3,HOTEL DE VILLE,,,,,11230,CHALABRE,,,11091,,,,,,,,,,,,,,,,,,,2008-01-01,A,SERVICE EAU-ASSAINISSEMENT,,,,36.00Z,NAFRev2,N,2.004069,42.982666,0.39,street,Le Village 11230 Chalabre,11091_t7xbrm,D,LE VILLAGE,
211100912,00065,21110091200065,O,2000-12-25,NN,,,2008-01-04T18:25:37,false,3,MAIRIE,,,,HOTEL DE VILLE,11230,CHALABRE,,,11091,,,,,,,,,,,,,,,,,,,2008-01-01,A,SERVICE ORDURES MENAGERES,,,,38.11Z,NAFRev2,N,2.004069,42.982666,0.39,street,Le Village 11230 Chalabre,11091_t7xbrm,G,LE VILLAGE,
241100056,00019,24110005600019,O,,,,,,true,1,,,,,HOTEL DE VILLE,11230,CHALABRE,,,11091,,,,,,,,,,,,,,,,,,,1992-10-13,F,,,,,75.1A,NAF1993,N,2.004069,42.982666,0.39,street,Le Village 11230 Chalabre,11091_t7xbrm,G,LE VILLAGE,
241100312,00016,24110031200016,O,1992-10-13,NN,,,2015-05-14T03:43:01,true,5,,,,CRS,SULLY,11230,CHALABRE,,,11091,,,,,,,,,,,,,,,,,,,2014-01-01,F,,,,,84.11Z,NAFRev2,O,2.006766,42.982146,0.75,street,Cours Sully 11230 Chalabre,11091_0220,G,COURS SULLY,
241100312,00057,24110031200057,O,2007-11-28,NN,,,2015-05-14T03:43:01,false,3,,,,CRS,SULLY,11230,CHALABRE,,,11091,,,,,,,,,,,,,,,,,,,2014-01-01,F,SERVICE D'AIDE A DOMICILE,,,,88.10A,NAFRev2,O,2.006766,42.982146,0.75,street,Cours Sully 11230 Chalabre,11091_0220,G,COURS SULLY,
251100269,00017,25110026900017,O,1983-03-01,NN,,,2012-05-05T00:35:11,true,7,,,,,HOTEL DE VILLE,11230,CHALABRE,,,11091,,,,,,,,,,,,,,,,,,,2010-12-31,F,,,,,84.13Z,NAFRev2,O,2.004069,42.982666,0.39,street,Le Village 11230 Chalabre,11091_t7xbrm,G,LE VILLAGE,
251100277,00010,25110027700010,O,,NN,,,,true,1,,,,,HOTEL DE VILLE,11230,CHALABRE,,,11091,,,,,,,,,,,,,,,,,,,1995-06-21,F,,,,,41.0Z,NAF1993,N,2.004069,42.982666,0.39,street,Le Village 11230 Chalabre,11091_t7xbrm,G,LE VILLAGE,
261100044,00013,26110004400013,O,1983-03-01,NN,,,2015-05-14T03:48:40,true,6,,,,,LES HAUTS DE BON ACCUEIL,11230,CHALABRE,,,11091,,,,,,,,,,,,,,,,,,,2014-01-01,F,EHPAD,,,,86.10Z,NAFRev2,O,2.000162,42.980718,0.64,street,Résidence le Clos de Bon Accueil 11230 Chalabre,11091_loa51c,G,RESIDENCE LE CLOS DE BON ACCUEIL,
261100044,00021,26110004400021,O,1984-11-08,NN,,,2015-05-14T03:48:40,false,5,,,,,LES HAUTS DE BON ACCUEIL,11230,CHALABRE,,,11091,,,,,,,,,,,,,,,,,,,2014-01-01,F,CENTRE DE LONG SEJOUR,,,,86.10Z,NAFRev2,O,2.000162,42.980718,0.64,street,Résidence le Clos de Bon Accueil 11230 Chalabre,11091_loa51c,G,RESIDENCE LE CLOS DE BON ACCUEIL,
261100044,00039,26110004400039,O,1995-01-01,NN,,,2011-04-23T04:20:50,false,4,,,,CRS,SULLY,11230,CHALABRE,,,11091,,,,,,,,,,,,,,,,,,,2009-09-22,F,SSIAD,,,,86.90D,NAFRev2,O,2.006766,42.982146,0.75,street,Cours Sully 11230 Chalabre,11091_0220,G,COURS SULLY,
261100044,00047,26110004400047,O,2009-09-22,NN,,,2015-05-14T03:48:40,false,3,,2,,RUE,SAINT FRANCOIS,11230,CHALABRE,,,11091,,,,,,,,,,,,,,,,,,,2014-01-01,F,SSIAD,,,,86.90D,NAFRev2,O,2.006642,42.982407,0.94,housenumber,2 Rue Saint François 11230 Chalabre,11091_0205_00002,G,2 RUE SAINT FRANCOIS,
261100341,00013,26110034100013,O,1983-03-01,NN,,,2010-06-26T03:04:24,true,3,,,,,HOTEL DE VILLE,11230,CHALABRE,,,11091,,,,,,,,,,,,,,,,,,,2008-01-01,A,CCAS,,,,88.99B,NAFRev2,N,2.004069,42.982666,0.39,street,Le Village 11230 Chalabre,11091_t7xbrm,G,LE VILLAGE,
291102184,00012,29110218400012,O,1986-07-28,NN,,,2011-02-02T09:48:48,true,4,,,,,MAIRIE,11230,CHALABRE,,,11091,,,,,,,,,,,,,,,,,,,2011-01-31,F,,,,,42.99Z,NAFRev2,N,2.00656,42.982332,0.91,street,Rue de la Mairie 11230 Chalabre,11091_0125,G,RUE DE LA MAIRIE,
300287976,00017,30028797600017,O,,NN,,,,true,1,,,,,,11230,CHALABRE,,,11091,,,,,,,,,,,,,,,,,,,1986-12-25,F,,,,,55.71,NAP,N,,,0,,,,,,
300328804,00012,30032880400012,O,,NN,,,,true,1,,7,,,,11230,CHALABRE,,,11091,,,,,,,,,,,,,,,,,,,,F,,,,,62.11,NAP,N,,,0,,,,,,
302702485,00012,30270248500012,O,,NN,,,2013-10-21T16:53:18,true,1,,,,RUE,SAINTE URSULE,11230,CHALABRE,,,11091,,,,,,,,,,,,,,,,,,,,F,,,,,64.11,NAP,N,2.006993,42.98281,0.8,street,Rue Saint Ursule 11230 Chalabre,11091_0215,G,RUE SAINT URSULE,
303380505,00014,30338050500014,O,,,,,,true,1,,,,CRS,D'AQUISSEAU,11230,CHALABRE,,,11091,,,,,,,,,,,,,,,,,,,1989-02-23,F,,,,,69.22,NAP,N,2.006,42.98328,0.54,street,Cours d'Aguesseau 11230 Chalabre,11091_0015,G,COURS D AGUESSEAU,
303744478,00015,30374447800015,O,,,,,,true,1,,,,,,11230,CHALABRE,,,11091,,,,,,,,,,,,,,,,,,,,F,,,,,46.01,NAP,N,,,0,,,,,,
303776173,00039,30377617300039,O,2015-06-06,,,,2017-06-13T08:34:27,true,2,,2,,RUE,D' EN PLUMET,11230,CHALABRE,,,11091,,,,,,,,,,,,,,,,,,,2017-06-10,F,,,,,70.22Z,NAFRev2,N,2.008083,42.984337,0.94,housenumber,2 Rue d'En Plumet 11230 Chalabre,11091_0085_00002,G,2 RUE D EN PLUMET,
307650663,00015,30765066300015,O,,,,,,true,1,,,,,LE CAZAL,11230,CHALABRE,,,11091,,,,,,,,,,,,,,,,,,,,F,,,,,46.01,NAP,N,2.004615,42.973776,0.94,street,Le Cazal 11230 Chalabre,11091_9x6lkj,G,LE CAZAL,
307669457,00011,30766945700011,O,1976-01-01,NN,,,,true,1,,,,CRS,COLBERT,11230,CHALABRE,,,11091,,,,,,,,,,,,,,,,,,,2000-10-09,F,,,,,52.3A,NAF1993,O,2.00542,42.982436,0.79,street,Cours Colbert 11230 Chalabre,11091_0070,G,COURS COLBERT,
307669465,00022,30766946500022,O,,NN,,,2006-11-25T09:22:29,true,1,,,,PL,ESPERANCE FOLCHET,11230,CHALABRE,,,11091,,,,,,,,,,,,,,,,,,,1996-07-01,F,,,,,52.3A,NAF1993,N,2.006598,42.982786,0.85,street,Place Esperance Folchet 11230 Chalabre,11091_0090,G,PLACE ESPERANCE FOLCHET,
308632348,00022,30863234800022,O,,NN,,,,true,1,,,,,AGUESSEAU,11230,CHALABRE,,,11091,,,,,,,,,,,,,,,,,,,1994-12-31,F,,,,,52.2L,NAF1993,N,2.006,42.98328,0.92,street,Cours d'Aguesseau 11230 Chalabre,11091_0015,G,COURS D AGUESSEAU,
310209242,00026,31020924200026,O,1980-10-01,NN,,,,true,4,,,,AV,DE VERDUN,11230,CHALABRE,,,11091,,,,,,,,,,,,,,,,,,,1996-12-25,F,,,,,52.1C,NAF1993,O,2.005187,42.981898,0.79,street,Avenue de Verdun 11230 Chalabre,11091_qp1ray,G,AVENUE DE VERDUN,
310727144,00084,31072714400084,O,2001-06-25,01,2017,,2019-06-24T13:17:15,false,4,,,,CHE,DE LA CIGALIERE,11230,CHALABRE,,,11091,,,,,,,,,,,,,,,,,,,2008-01-01,A,,,,,47.76Z,NAFRev2,N,2.009513,42.98579,0.85,street,Chemin de la Cigaliere 11230 Chalabre,11091_zlujxt,G,CHEMIN DE LA CIGALIERE,
310851803,00026,31085180300026,O,,NN,,,,true,1,,,,,C D'AGUESSEAU,11230,CHALABRE,,,11091,,,,,,,,,,,,,,,,,,,,F,,,,,64.24,NAP,N,2.006,42.98328,0.8,street,Cours d'Aguesseau 11230 Chalabre,11091_0015,G,COURS D AGUESSEAU,
312307747,00013,31230774700013,O,,NN,,,,true,1,,,,RUE,DES BAINS,11230,CHALABRE,,,11091,,,,,,,,,,,,,,,,,,,1992-12-25,F,,,,,52.6E,NAF1993,N,2.00572,42.981339,0.94,street,Rue des Bains 11230 Chalabre,11091_0025,G,RUE DES BAINS,
312755275,00012,31275527500012,O,1978-01-01,NN,,,2008-01-04T20:17:33,true,6,,,,RUE,STE URSULE,11230,CHALABRE,,,11091,,,,,,,,,,,,,,,,,,,2008-01-01,A,,,,,68.20B,NAFRev2,N,2.006993,42.98281,0.69,street,Rue Saint Ursule 11230 Chalabre,11091_0215,G,RUE SAINT URSULE,
312988264,00015,31298826400015,O,,,,,,true,1,,,,,,11230,CHALABRE,,,11091,,,,,,,,,,,,,,,,,,,1985-12-25,F,,,,,84.11,NAP,N,,,0,,,,,,
312988298,00013,31298829800013,O,,NN,,,,true,1,,,,,LE MENECHAL,11230,CHALABRE,,,11091,,,,,,,,,,,,,,,,,,,,F,,,,,78.02,NAP,N,2.005075,42.995991,0.94,street,Le Menechal 11230 Chalabre,11091_8smbc3,G,LE MENECHAL,
314890328,00029,31489032800029,O,2000-01-01,NN,,,2008-11-07T00:30:17,true,4,,,,,LA PLAINE ST PIERRE,11230,CHALABRE,,,11091,,,,,,,,,,,,,,,,,,,2003-12-31,F,,,,,45.2V,NAFRev1,O,2.003455,42.987106,0.84,street,La Plaine de Saint Pierre 11230 Chalabre,11091_b065,G,LA PLAINE DE SAINT PIERRE,
315381251,00026,31538125100026,O,,NN,,,,true,1,,,,CHE,DU PAPE,11230,CHALABRE,,,11091,,,,,,,,,,,,,,,,,,,1990-03-31,F,,,,,55.40,NAP,N,2.010136,42.986532,0.78,street,Chemin du Pape 11230 Chalabre,11091_0148,G,CHEMIN DU PAPE,
315552653,00026,31555265300026,O,2000-01-01,,,,2008-11-07T00:31:00,true,3,LA PLAINE SAINT PIERRE,,,,,11230,CHALABRE,,,11091,,,,,,,,,,,,,,,,,,,2003-06-30,F,,,,,45.2V,NAFRev1,N,2.003455,42.987106,0.93,street,La Plaine de Saint Pierre 11230 Chalabre,11091_b065,D,LA PLAINE DE SAINT PIERRE,
315555714,00015,31555571400015,O,1979-01-01,NN,,,2008-11-07T00:31:00,false,4,,,,RUE,COTE DU CHATEAU,11230,CHALABRE,,,11091,,,,,,,,,,,,,,,,,,,2000-01-01,F,,,,,45.2V,NAF1993,N,2.007561,42.983105,0.94,street,Rue Cote du Chateau 11230 Chalabre,11091_on4vc2,G,RUE COTE DU CHATEAU,
315555714,00023,31555571400023,O,2000-01-01,01,2017,4399CZ,2019-06-24T13:18:52,true,5,,,,,LA PLAINE SAINT PIERRE,11230,CHALABRE,,,11091,,,,,,,,,,,,,,,,,,,2018-12-31,F,,,,,43.99C,NAFRev2,O,2.003455,42.987106,0.93,street,La Plaine de Saint Pierre 11230 Chalabre,11091_b065,G,LA PLAINE DE SAINT PIERRE,
315861278,00010,31586127800010,O,1963-01-01,NN,,,2008-11-07T00:31:23,false,4,,,,,,11230,CHALABRE,,,11091,,,,,,,,,,,,,,,,,,,2008-01-02,F,,,,,96.02A,NAFRev2,N,,,0,,,,,,
315861278,00028,31586127800028,O,2008-01-02,,,9602AA,2016-12-15T03:34:07,true,2,,4,,RTE,DE LAVELANET,11230,CHALABRE,,,11091,,,,,,,,,,,,,,,,,,,2016-12-31,F,,,,,96.02A,NAFRev2,N,2.005388,42.981202,0.84,housenumber,4 Route de Lavelanet 11230 Chalabre,11091_k58707_00004,G,4 ROUTE DE LAVELANET,
317836393,00015,31783639300015,O,,NN,,,,true,1,,,,,C COLBERT,11230,CHALABRE,,,11091,,,,,,,,,,,,,,,,,,,,F,,,,,86.07,NAP,N,2.00542,42.982436,0.75,street,Cours Colbert 11230 Chalabre,11091_0070,G,COURS COLBERT,
318004256,00042,31800425600042,O,1998-05-06,NN,,4332AA,2018-07-27T03:49:06,true,8,,,,RTE,DE MIREPOIX,11230,CHALABRE,,,11091,,,,,,,,,,,,,,,,,,,2018-06-30,F,,,,,43.32A,NAFRev2,N,2.004071,42.987,0.83,street,Route de Mirepoix 11230 Chalabre,11091_hk8gui,G,ROUTE DE MIREPOIX,
318025921,00020,31802592100020,O,,NN,,,,true,1,,,,RUE,ST FRANCOIS,11230,CHALABRE,,,11091,,,,,,,,,,,,,,,,,,,1996-07-31,F,,,,,55.3A,NAF1993,N,2.006637,42.982497,0.82,street,Rue Saint François 11230 Chalabre,11091_0205,G,RUE SAINT FRANCOIS,
318417938,00012,31841793800012,O,1966-01-01,NN,,9602AA,2017-04-30T04:30:21,true,4,,,,CRS,COLBERT,11230,CHALABRE,,,11091,,,,,,,,,,,,,,,,,,,2017-04-28,F,,,,,96.02A,NAFRev2,N,2.00542,42.982436,0.79,street,Cours Colbert 11230 Chalabre,11091_0070,G,COURS COLBERT,
318773249,00012,31877324900012,O,1980-01-01,NN,,,2008-01-04T21:03:06,true,3,,,,AV,RHIN ET DANUBE,11230,CHALABRE,,,11091,,,,,,,,,,,,,,,,,,,2008-01-01,A,,,,,68.20A,NAFRev2,N,2.006658,42.985058,0.84,street,Avenue Rhin et Danube 11230 Chalabre,11091_0188,G,AVENUE RHIN ET DANUBE,
319075479,00018,31907547900018,O,1980-05-01,,,,2008-11-07T00:34:56,true,3,,,,RUE,DES BOULANGERS,11230,CHALABRE,,,11091,,,,,,,,,,,,,,,,,,,1992-12-25,F,,,,,21.2B,NAF1993,N,2.006513,42.983585,0.94,street,Rue des Boulangers 11230 Chalabre,11091_0040,G,RUE DES BOULANGERS,
319309340,00010,31930934000010,O,,NN,,,2013-10-17T03:18:00,true,1,,,,DOM,DE LA MOUILLERE,11230,CHALABRE,,,11091,,,,,,,,,,,,,,,,,,,,F,,,,,01.57,NAP,N,2.026012,42.971255,0.65,street,La Mouillère 11230 Chalabre,11091_5ywdqm,G,LA MOUILLERE,
320053341,00030,32005334100030,O,2011-02-01,,,,2018-08-11T03:45:57,false,2,,,,PL,ESPERANCE FOLCHET,11230,CHALABRE,,,11091,,,,,,,,,,,,,,,,,,,2018-06-01,F,AUTO ECOLE ROUCH,,,,85.53Z,NAFRev2,N,2.006598,42.982786,0.85,street,Place Esperance Folchet 11230 Chalabre,11091_0090,G,PLACE ESPERANCE FOLCHET,
320126824,00038,32012682400038,O,1995-08-16,NN,,8690AZ,2015-03-18T01:41:56,true,1,,,,RUE,SAINTE URSULE,11230,CHALABRE,,,11091,,,,,,,,,,,,,,,,,,,1999-03-31,F,,,,,52.4Z,NAF1993,N,2.006993,42.98281,0.8,street,Rue Saint Ursule 11230 Chalabre,11091_0215,G,RUE SAINT URSULE,
320519564,00019,32051956400019,O,,,,,,true,1,,,,RUE,COLBERT,11230,CHALABRE,,,11091,,,,,,,,,,,,,,,,,,,1984-12-25,F,,,,,82.06,NAP,N,2.005594,42.983226,0.94,street,Rue Colbert 11230 Chalabre,11091_0071,G,RUE COLBERT,
320776297,00014,32077629700014,O,1981-01-01,NN,,,2008-11-07T00:36:49,true,3,ZONE ARTIS LE CAZALS,,,RTE,DE LAVELANET,11230,CHALABRE,,,11091,,,,,,,,,,,,,,,,,,,2004-11-30,F,,,,,70.2C,NAFRev1,N,2.004954,42.981289,0.83,street,Route de Lavelanet 11230 Chalabre,11091_k58707,G,ROUTE DE LAVELANET,
320891591,00010,32089159100010,O,,,,,,true,1,,,,,C D AGUSSEAU,11230,CHALABRE,,,11091,,,,,,,,,,,,,,,,,,,1984-12-25,F,,,,,65.02,NAP,N,2.006,42.98328,0.66,street,Cours d'Aguesseau 11230 Chalabre,11091_0015,G,COURS D AGUESSEAU,
321228587,00010,32122858700010,O,,NN,,,,true,1,,,,,,11230,CHALABRE,,,11091,,,,,,,,,,,,,,,,,,,,F,,,,,87.03,NAP,N,,,0,,,,,,
321293870,00010,32129387000010,O,1981-02-17,NN,,,2007-10-27T09:05:42,false,4,,,,,ESPERANCE FOLCHET,11230,CHALABRE,,,11091,,,,,,,,,,,,,,,,,,,2006-10-10,F,,,,,85.1C,NAFRev1,O,2.006598,42.982786,0.93,street,Place Esperance Folchet 11230 Chalabre,11091_0090,G,PLACE ESPERANCE FOLCHET,
321293870,00028,32129387000028,O,2006-10-10,00,2017,,2019-06-24T13:21:06,true,4,,10,B,,COURS DR JOSEPH RAYNAUD,11230,CHALABRE,,,11091,,,,,,,,,,,,,,,,,,,2018-10-01,F,,,,,86.21Z,NAFRev2,N,2.006855,42.982271,0.86,street,Cours Docteur Joseph Raynaud 11230 Chalabre,11091_0080,G,COURS DOCTEUR JOSEPH RAYNAUD,
321898454,00012,32189845400012,O,1981-05-18,NN,,,2018-10-15T08:34:59,true,4,,,,CRS,COLBERT,11230,CHALABRE,,,11091,,,,,,,,,,,,,,,,,,,2018-12-31,F,,,,,86.23Z,NAFRev2,N,2.00542,42.982436,0.79,street,Cours Colbert 11230 Chalabre,11091_0070,G,COURS COLBERT,
322166539,00013,32216653900013,O,,,,,,true,1,,,,,,11230,CHALABRE,,,11091,,,,,,,,,,,,,,,,,,,1984-12-25,F,,,,,21.01,NAP,N,,,0,,,,,,
322567736,00036,32256773600036,O,,NN,,,,true,1,,,,RTE,DE PUITVERT,11230,CHALABRE,,,11091,,,,,,,,,,,,,,,,,,,1991-11-14,F,,,,,60.2E,NAF1993,N,2.020609,42.975654,0.65,street,Route de Puivert 11230 Chalabre,11091_lcptnq,G,ROUTE DE PUIVERT,
323158485,00017,32315848500017,O,1981-10-23,NN,,,2016-04-26T02:38:46,true,5,,,,RUE,DU CAPITAINE DANJOU,11230,CHALABRE,,,11091,,,,,,,,,,,,,,,,,,,2014-09-30,A,,,,,94.99Z,NAFRev2,N,2.007461,42.982513,0.84,street,Rue Capitaine Danjou 11230 Chalabre,11091_0045,G,RUE CAPITAINE DANJOU,
323550244,00012,32355024400012,O,1982-01-01,02,2017,4399DC,2019-06-24T13:22:13,true,3,,,,RUE,D EMPLUMET,11230,CHALABRE,,,11091,,,,,,,,,,,,,,,,,,,2008-01-01,A,,,,,43.99D,NAFRev2,O,2.008216,42.98431,0.76,street,Rue d'En Plumet 11230 Chalabre,11091_0085,G,RUE D EN PLUMET,
323550244,00038,32355024400038,O,1997-09-01,NN,,,2008-01-04T18:47:20,false,3,,,,RUE,COLBERT,11230,CHALABRE,,,11091,,,,,,,,,,,,,,,,,,,2008-01-01,A,FLORALIES,,,,47.76Z,NAFRev2,N,2.005594,42.983226,0.94,street,Rue Colbert 11230 Chalabre,11091_0071,G,RUE COLBERT,
323603431,00038,32360343100038,O,,NN,,,,true,1,,,,CRS,D'AGUESSEAU,11230,CHALABRE,,,11091,,,,,,,,,,,,,,,,,,,1990-12-31,F,,,,,67.08,NAP,N,2.006,42.98328,0.83,street,Cours d'Aguesseau 11230 Chalabre,11091_0015,G,COURS D AGUESSEAU,
324253657,00021,32425365700021,O,1900-01-01,NN,,,2011-04-28T00:21:03,false,2,,,,,C COLBERT,11230,CHALABRE,,,11091,,,,,,,,,,,,,,,,,,,1983-12-25,F,,,,,87.06,NAP,N,2.00542,42.982436,0.75,street,Cours Colbert 11230 Chalabre,11091_0070,G,COURS COLBERT,
324458397,00019,32445839700019,O,,,,,,true,1,,,,,C D AGUESSEAU,11230,CHALABRE,,,11091,,,,,,,,,,,,,,,,,,,1984-12-25,F,,,,,65.02,NAP,N,2.006,42.98328,0.8,street,Cours d'Aguesseau 11230 Chalabre,11091_0015,G,COURS D AGUESSEAU,
326546850,00024,32654685000024,O,2002-03-02,NN,,,2009-07-20T20:22:31,true,4,,,,CRS,JOSEPH RAYNAUD,11230,CHALABRE,,,11091,,,,,,,,,,,,,,,,,,,2009-08-03,F,,,,,47.71Z,NAFRev2,N,2.006855,42.982271,0.79,street,Cours Docteur Joseph Raynaud 11230 Chalabre,11091_0080,G,COURS DOCTEUR JOSEPH RAYNAUD,
326640497,00052,32664049700052,O,2003-05-29,NN,,,2006-11-25T10:02:53,false,3,,7,,PL,ESPERANCE FOLCHET,11230,CHALABRE,,,11091,,,,,,,,,,,,,,,,,,,2004-12-06,F,,,,,85.1C,NAFRev1,N,2.006294,42.982537,0.86,housenumber,7 Place Esperance Folchet 11230 Chalabre,11091_0090_00007,G,7 PLACE ESPERANCE FOLCHET,
326640497,00060,32664049700060,O,2004-12-06,NN,,,2008-04-23T17:01:58,false,3,,10,,RUE,ST ANTOINE,11230,CHALABRE,,,11091,,,,,,,,,,,,,,,,,,,2005-12-31,F,,,,,85.1C,NAFRev1,N,2.005893,42.983006,0.84,housenumber,10 Rue Saint Antoine 11230 Chalabre,11091_0195_00010,G,10 RUE SAINT ANTOINE,
326640497,00094,32664049700094,O,2017-01-01,,,,2016-12-21T15:15:00,true,1,,6,,RUE,DU PRESBYTERE,11230,CHALABRE,,,11091,,,,,,,,,,,,,,,,,,,2017-01-01,A,,,,,86.21Z,NAFRev2,N,2.005089,42.982805,0.94,housenumber,6 Rue du Presbytère 11230 Chalabre,11091_0185_00006,G,6 RUE DU PRESBYTERE,
327489217,00015,32748921700015,O,1983-01-01,NN,,,2008-01-04T19:28:24,true,3,,,,,SIVOM COURS SULLY,11230,CHALABRE,,,11091,,,,,,,,,,,,,,,,,,,2008-01-01,A,,,,,79.11Z,NAFRev2,N,2.006766,42.982146,0.67,street,Cours Sully 11230 Chalabre,11091_0220,G,COURS SULLY,
327875118,00041,32787511800041,O,2014-03-29,,,,2018-03-02T04:12:29,true,2,,4,,,QUARTIER DU MOULIN,11230,CHALABRE,,,11091,,,,,,,,,,,,,,,,,,,2018-03-31,F,,,,,81.30Z,NAFRev2,N,2.004729,42.98138,0.94,housenumber,4 Quartier du Moulin 11230 Chalabre,11091_tj8jxp_00004,G,4 QUARTIER DU MOULIN,
328143151,00020,32814315100020,O,,NN,,,2006-11-25T10:07:08,true,1,,,,PL,ESPERANCE FOLCHET,11230,CHALABRE,,,11091,,,,,,,,,,,,,,,,,,,1996-07-01,F,,,,,52.3A,NAF1993,N,2.006598,42.982786,0.85,street,Place Esperance Folchet 11230 Chalabre,11091_0090,G,PLACE ESPERANCE FOLCHET,
328265533,00013,32826553300013,O,,NN,,,,true,1,,,,PL,DU MARCHE,11230,CHALABRE,,,11091,,,,,,,,,,,,,,,,,,,1996-03-05,F,,,,,52.3A,NAF1993,O,2.006575,42.985112,0.38,street,Avenue du 19 Mars 1962 11230 Chalabre,11091_jils7i,G,AVENUE DU 19 MARS 1962,
329153548,00030,32915354800030,O,2014-08-01,,,4399CZ,2016-09-06T04:38:52,true,2,LA NORIA N18,,,,LE BOURDIL,11230,CHALABRE,,,11091,,,,,,,,,,,,,,,,,,,2016-08-31,F,,,,TECHNIBAT,43.99C,NAFRev2,N,1.999515,42.986374,0.94,street,Le Bourdil 11230 Chalabre,11091_y4petg,G,LE BOURDIL,
329201859,00025,32920185900025,O,1991-08-01,NN,,,,true,1,,,,CRS,JOSEPH RAYNAUD,11230,CHALABRE,,,11091,,,,,,,,,,,,,,,,,,,2001-12-31,F,,,,,52.4C,NAF1993,N,2.006855,42.982271,0.79,street,Cours Docteur Joseph Raynaud 11230 Chalabre,11091_0080,G,COURS DOCTEUR JOSEPH RAYNAUD,
329807762,00011,32980776200011,O,1984-05-28,,,,2008-11-07T00:48:04,false,3,,3,,QUAI,DE L ABATTOIR,11230,CHALABRE,,,11091,,,,,,,,,,,,,,,,,,,1997-06-30,F,,,,,45.4J,NAF1993,N,2.002926,42.98306,0.86,street,Quai de l'Abattoir 11230 Chalabre,11091_0005,G,QUAI DE L ABATTOIR,
329807762,00037,32980776200037,O,2001-07-02,NN,,4334ZB,2017-09-08T04:23:41,true,4,,,,,LE BOURDIL,11230,CHALABRE,,,11091,,,,,,,,,,,,,,,,,,,2017-09-01,F,,,,,43.34Z,NAFRev2,N,1.999515,42.986374,0.94,street,Le Bourdil 11230 Chalabre,11091_y4petg,G,LE BOURDIL,
330525130,00010,33052513000010,O,,NN,,,,true,1,,,,AV,RHIN ET DANUBE,11230,CHALABRE,,,11091,,,,,,,,,,,,,,,,,,,1988-09-30,F,,,,,55.60,NAP,N,2.006658,42.985058,0.84,street,Avenue Rhin et Danube 11230 Chalabre,11091_0188,G,AVENUE RHIN ET DANUBE,
330756370,00046,33075637000046,O,2013-12-31,,,,2014-02-09T04:45:12,true,1,,4,,PL,ESPERANCE FOLCHET,11230,CHALABRE,,,11091,,,,,,,,,,,,,,,,,,,2013-12-31,A,,,,,47.89Z,NAFRev2,N,2.006585,42.982574,0.86,housenumber,4 Place Esperance Folchet 11230 Chalabre,11091_0090_00004,G,4 PLACE ESPERANCE FOLCHET,
330813254,00019,33081325400019,O,1984-07-01,,,,2008-11-07T00:49:22,true,4,,,,AV,DE VERDUN,11230,CHALABRE,,,11091,,,,,,,,,,,,,,,,,,,1992-12-25,F,,,,,55.60,NAP,N,2.005187,42.981898,0.79,street,Avenue de Verdun 11230 Chalabre,11091_qp1ray,G,AVENUE DE VERDUN,
331446831,00017,33144683100017,O,1985-01-01,NN,,,2018-02-14T11:41:53,true,5,4-6,4,,RUE,ST ANTOINE,11230,CHALABRE,,,11091,,,,,,,,,,,,,,,,,,,2018-02-09,A,,,,,47.21Z,NAFRev2,N,2.005893,42.983006,0.83,housenumber,4 Rue Saint Antoine 11230 Chalabre,11091_0195_00004,G,4 RUE SAINT ANTOINE,
332427228,00017,33242722800017,O,1985-03-18,NN,,,2006-11-25T10:19:37,false,4,LES CEDRES,,,RUE,DU CAPITAINE D ANJOU,11230,CHALABRE,,,11091,,,,,,,,,,,,,,,,,,,1998-11-23,F,,,,,85.3G,NAF1993,O,2.007461,42.982513,0.73,street,Rue Capitaine Danjou 11230 Chalabre,11091_0045,G,RUE CAPITAINE DANJOU,