siren,nic,siret,statutDiffusionEtablissement,dateCreationEtablissement,trancheEffectifsEtablissement,anneeEffectifsEtablissement,activitePrincipaleRegistreMetiersEtablissement,dateDernierTraitementEtablissement,etablissementSiege,nombrePeriodesEtablissement,complementAdresseEtablissement,numeroVoieEtablissement,indiceRepetitionEtablissement,typeVoieEtablissement,libelleVoieEtablissement,codePostalEtablissement,libelleCommuneEtablissement,libelleCommuneEtrangerEtablissement,distributionSpecialeEtablissement,codeCommuneEtablissement,codeCedexEtablissement,libelleCedexEtablissement,codePaysEtrangerEtablissement,libellePaysEtrangerEtablissement,complementAdresse2Etablissement,numeroVoie2Etablissement,indiceRepetition2Etablissement,typeVoie2Etablissement,libelleVoie2Etablissement,codePostal2Etablissement,libelleCommune2Etablissement,libelleCommuneEtranger2Etablissement,distributionSpeciale2Etablissement,codeCommune2Etablissement,codeCedex2Etablissement,libelleCedex2Etablissement,codePaysEtranger2Etablissement,libellePaysEtranger2Etablissement,dateDebut,etatAdministratifEtablissement,enseigne1Etablissement,enseigne2Etablissement,enseigne3Etablissement,denominationUsuelleEtablissement,activitePrincipaleEtablissement,nomenclatureActivitePrincipaleEtablissement,caractereEmployeurEtablissement,longitude,latitude,geo_score,geo_type,geo_adresse,geo_id,geo_ligne,geo_l4,geo_l5
216103317,00014,21610331700014,O,1983-03-01,01,2017,,2019-06-24T13:11:26,true,3,,,,,LE BOURG,61170,LE PLANTIS,,,61331,,,,,,,,,,,,,,,,,,,2008-01-01,A,MAIRIE,,,,84.11Z,NAFRev2,N,0.381473,48.600619,0.93,street,Le Bourg 61170 Le Plantis,61331_qo0vcx,G,LE BOURG,
266101351,00010,26610135100010,O,1994-07-25,NN,,,2010-06-26T03:13:03,true,3,MAIRIE,,,,LE BOURG,61170,LE PLANTIS,,,61331,,,,,,,,,,,,,,,,,,,2008-01-01,A,CCAS,,,,88.99B,NAFRev2,N,0.381473,48.600619,0.93,street,Le Bourg 61170 Le Plantis,61331_qo0vcx,G,LE BOURG,
296100688,00013,29610068800013,O,1984-08-16,NN,,,2006-11-25T09:10:53,true,3,MAIRIE,,,,LE BOURG,61170,LE PLANTIS,,,61331,,,,,,,,,,,,,,,,,,,2003-10-02,F,,,,,70.1C,NAFRev1,N,0.381473,48.600619,0.93,street,Le Bourg 61170 Le Plantis,61331_qo0vcx,G,LE BOURG,
306085770,00056,30608577000056,O,1985-01-01,,,,2018-10-03T20:01:03,false,4,,,,,RANCE,61170,LE PLANTIS,,,61331,,,,,,,,,,,,,,,,,,,2008-01-01,A,,,,,01.11Z,NAFRev2,N,0.404486,48.603692,0.93,street,Rance 61170 Le Plantis,61331_jsasqp,G,RANCE,
314566118,00019,31456611800019,O,,,,,,true,1,,,,,LA HAUTE FOLIE,61170,LE PLANTIS,,,61331,,,,,,,,,,,,,,,,,,,1995-12-28,F,,,,,01.3Z,NAF1993,N,0.39613,48.598391,0.93,street,La Haute Folie 61170 Le Plantis,61331_b122,G,LA HAUTE FOLIE,
316023621,00014,31602362100014,O,,NN,,,,true,1,,,,LD,LES CAILLOUX,61170,LE PLANTIS,,,61331,,,,,,,,,,,,,,,,,,,1988-06-01,F,,,,,55.71,NAP,N,0.3871,48.602669,0.93,street,Les Cailloux 61170 Le Plantis,61331_1aao86,G,LES CAILLOUX,
317039451,00016,31703945100016,O,,NN,,,,true,1,,,,,LE BOURG,61170,LE PLANTIS,,,61331,,,,,,,,,,,,,,,,,,,1989-02-15,F,,,,,62.11,NAP,N,0.381473,48.600619,0.93,street,Le Bourg 61170 Le Plantis,61331_qo0vcx,G,LE BOURG,
317672020,00011,31767202000011,O,,,,,,true,1,,,,,LE PONT FRIQUET,61170,LE PLANTIS,,,61331,,,,,,,,,,,,,,,,,,,1984-12-25,F,,,,,78.02,NAP,N,0.399866,48.60158,0.93,street,Le Pont Friquet 61170 Le Plantis,61331_b202,G,LE PONT FRIQUET,
319678090,00014,31967809000014,O,,,,,,true,1,,,,,LE BOURG,61170,LE PLANTIS,,,61331,,,,,,,,,,,,,,,,,,,1984-12-25,F,,,,,55.73,NAP,N,0.381473,48.600619,0.93,street,Le Bourg 61170 Le Plantis,61331_qo0vcx,G,LE BOURG,
322126111,00028,32212611100028,O,1992-04-01,,,,,true,1,,,,,LA TOMBELINE,61170,LE PLANTIS,,,61331,,,,,,,,,,,,,,,,,,,2001-07-02,F,,,,,01.2C,NAF1993,N,0.404509,48.606686,0.74,street,Tombeline 61170 Le Plantis,61331_13sx7o,G,TOMBELINE,
322265182,00012,32226518200012,O,,,,,,true,1,,,,,BOURG,61170,LE PLANTIS,,,61331,,,,,,,,,,,,,,,,,,,1984-12-25,F,,,,,64.25,NAP,N,0.381473,48.600619,0.91,street,Le Bourg 61170 Le Plantis,61331_qo0vcx,G,LE BOURG,
326918133,00058,32691813300058,O,,,,,,true,1,,,,,LE CAILLOU,61170,LE PLANTIS,,,61331,,,,,,,,,,,,,,,,,,,1995-12-11,F,,,,,28.7P,NAF1993,N,0.3871,48.602669,0.75,street,Les Cailloux 61170 Le Plantis,61331_1aao86,G,LES CAILLOUX,
343859427,00019,34385942700019,O,1900-01-01,NN,,4332BB,2016-11-24T04:48:45,true,6,,,,,JOUET,61170,LE PLANTIS,,,61331,,,,,,,,,,,,,,,,,,,2016-11-22,F,ENTREPRISE PERRET,,,,33.20A,NAFRev2,N,0.418704,48.606265,0.9,street,Lieu Dit Jouet 61170 Le Plantis,61331_emh059,G,LIEU DIT JOUET,
347854556,00011,34785455600011,O,,NN,,,,true,1,,,,,LE JOUETS,61170,LE PLANTIS,,,61331,,,,,,,,,,,,,,,,,,,1988-10-31,F,,,,,62.41,NAP,N,0.418704,48.606265,0.64,street,Lieu Dit Jouet 61170 Le Plantis,61331_emh059,G,LIEU DIT JOUET,
349244145,00026,34924414500026,O,2015-05-17,,,,2018-12-08T03:46:34,true,2,,,,,LA TASSELIERE,61170,LE PLANTIS,,,61331,,,,,,,,,,,,,,,,,,,2018-12-01,F,,,,,01.49Z,NAFRev2,N,0.380958,48.60826,0.73,street,Lieu Dit Tasseliere 61170 Le Plantis,61331_gwto9n,G,LIEU DIT TASSELIERE,
352535389,00014,35253538900014,O,1977-10-05,NN,,,,true,1,,,,,,61170,LE PLANTIS,,,61331,,,,,,,,,,,,,,,,,,,1996-10-07,F,,,,,01.3Z,NAF1993,N,,,0,,,,,,
353285299,00015,35328529900015,O,,NN,,,,true,1,,,,,LE BOURG,61170,LE PLANTIS,,,61331,,,,,,,,,,,,,,,,,,,1992-11-23,F,,,,,52.1B,NAF1993,N,0.381473,48.600619,0.93,street,Le Bourg 61170 Le Plantis,61331_qo0vcx,G,LE BOURG,
353991532,00014,35399153200014,O,1990-01-01,NN,,,2013-07-04T16:12:09,true,3,,,,,,61170,LE PLANTIS,,,61331,,,,,,,,,,,,,,,,,,,2008-01-01,A,,,,,01.43Z,NAFRev2,N,,,0,,,,,,
380415893,00029,38041589300029,O,2013-01-01,,,,2014-02-25T15:21:17,false,1,LA TASELLIERE,,,,,61170,LE PLANTIS,,,61331,,,,,,,,,,,,,,,,,,,2013-01-01,A,,,,,68.31Z,NAFRev2,N,0.382501,48.609162,0.93,street,La Taselliere 61170 Le Plantis,61331_gwto9n,D,LA TASELLIERE,
390021723,00015,39002172300015,O,1993-01-01,NN,,,,true,4,,,,,LE FRICHES,61170,LE PLANTIS,,,61331,,,,,,,,,,,,,,,,,,,2003-01-11,F,,,,,01.1A,NAFRev1,N,0.393518,48.596709,0.83,street,Les Friches 61170 Le Plantis,61331_ijod62,G,LES FRICHES,
391032307,00012,39103230700012,O,1992-01-01,NN,,,,true,1,,,,,LE PARC D'ECUEIL,61170,LE PLANTIS,,,61331,,,,,,,,,,,,,,,,,,,2000-07-14,F,,,,,01.1A,NAF1993,N,0.370579,48.603793,0.74,street,Parc d'Ecuenne 61170 Le Plantis,61331_b159,G,PARC D ECUENNE,
391942398,00010,39194239800010,O,1993-06-12,NN,,,,true,4,,,,,LE BOURG,61170,LE PLANTIS,,,61331,,,,,,,,,,,,,,,,,,,2000-06-26,F,,,,,52.1B,NAF1993,N,0.381473,48.600619,0.93,street,Le Bourg 61170 Le Plantis,61331_qo0vcx,G,LE BOURG,
399482991,00011,39948299100011,O,1994-12-12,NN,,,2020-03-11T03:46:44,true,3,,,,,GUERNE,61170,LE PLANTIS,,,61331,,,,,,,,,,,,,,,,,,,2008-01-01,A,,,,,68.20A,NAFRev2,N,0.397043,48.603056,0.9,street,Lieu Dit Guerne 61170 Le Plantis,61331_d2msop,G,LIEU DIT GUERNE,
402663165,00015,40266316500015,O,1995-07-24,,,,,true,1,,,,,GLATIGNY,61170,LE PLANTIS,,,61331,,,,,,,,,,,,,,,,,,,2000-07-24,F,,,,,01.4B,NAF1993,N,0.391803,48.602043,0.91,street,Lieu Dit Glatigny 61170 Le Plantis,61331_1t2aug,G,LIEU DIT GLATIGNY,
407790252,00016,40779025200016,O,1995-01-01,NN,,,2016-01-12T00:17:31,true,6,,,,,LA MAISON AUX FEVRES,61170,LE PLANTIS,,,61331,,,,,,,,,,,,,,,,,,,2008-01-01,A,,,,,01.50Z,NAFRev2,N,0.416273,48.607964,0.93,street,La Maison aux Fevres 61170 Le Plantis,61331_b134,G,LA MAISON AUX FEVRES,
407790252,00024,40779025200024,O,1999-05-15,NN,,,2007-01-11T10:35:41,false,3,,,,,LES CARLIERES,61170,LE PLANTIS,,,61331,,,,,,,,,,,,,,,,,,,2007-01-01,F,,,,,01.3Z,NAFRev1,N,0.411713,48.611325,0.93,street,Les Carlieres 61170 Le Plantis,61331_00ovic,G,LES CARLIERES,
407833557,00017,40783355700017,O,1995-01-01,NN,,,,true,1,,,,,FERME DU COUDRAY,61170,LE PLANTIS,,,61331,,,,,,,,,,,,,,,,,,,2000-12-31,F,,,,,01.3Z,NAF1993,N,,,0,,,,,,
413328204,00016,41332820400016,O,1985-12-31,NN,,,2018-12-22T04:23:41,true,3,,,,,LA BROSSE,61170,LE PLANTIS,,,61331,,,,,,,,,,,,,,,,,,,2008-01-01,A,,,,,01.42Z,NAFRev2,N,0.366922,48.601675,0.93,street,La Brosse 61170 Le Plantis,61331_0i0sxz,G,LA BROSSE,
413328212,00019,41332821200019,O,1986-01-01,NN,,,,true,1,,,,,LA TARAUDEREE,61170,LE PLANTIS,,,61331,,,,,,,,,,,,,,,,,,,2001-12-31,F,,,,,01.1A,NAF1993,N,0.382501,48.609162,0.4,street,La Taselliere 61170 Le Plantis,61331_gwto9n,G,LA TASELLIERE,
413328220,00012,41332822000012,O,1984-12-31,NN,,,2008-01-04T22:31:57,true,3,,,,,LE BUISSON,61170,LE PLANTIS,,,61331,,,,,,,,,,,,,,,,,,,2007-08-28,F,,,,,01.1A,NAFRev1,N,0.392572,48.607606,0.69,street,Le Bisson 61170 Le Plantis,61331_np5wp7,G,LE BISSON,
415033109,00018,41503310900018,O,1987-12-31,,,,,true,1,,,,,MAISON AUX FEVES,61170,LE PLANTIS,,,61331,,,,,,,,,,,,,,,,,,,2000-01-25,F,,,,,01.1A,NAF1993,N,0.416273,48.607964,0.82,street,La Maison aux Fevres 61170 Le Plantis,61331_b134,G,LA MAISON AUX FEVRES,
419520663,00016,41952066300016,O,1998-07-13,NN,,,,true,1,,,,,LE MOULIN DU GIROUARD,61170,LE PLANTIS,,,61331,,,,,,,,,,,,,,,,,,,2001-07-23,F,,,,,70.2C,NAF1993,N,0.420339,48.602242,0.52,street,Le Girouard 61170 Le Plantis,61331_i08g8y,G,LE GIROUARD,
419614631,00010,41961463100010,O,1998-07-04,NN,,,2019-08-29T03:59:48,false,4,,,,LD,LA TARAUDERIE,61170,LE PLANTIS,,,61331,,,,,,,,,,,,,,,,,,,2018-05-06,F,,,,,68.20B,NAFRev2,N,0.391627,48.606125,0.4,street,La Moiserie 61170 Le Plantis,61331_jpxuzz,G,LA MOISERIE,
421515057,00014,42151505700014,O,1993-12-31,NN,,,,false,4,,,,,ANCIENNE ECOLE,61170,LE PLANTIS,,,61331,,,,,,,,,,,,,,,,,,,2003-08-01,F,,,,,01.2A,NAFRev1,N,6.6236527,44.6706214,0.91,poi.school,Ancienne École Mont-Dauphin,https://osm.org/way/125820753,G,,
421515057,00030,42151505700030,O,2004-06-01,,,,2020-06-27T03:44:01,true,1,,,,,LA CROIX,61170,LE PLANTIS,,,61331,,,,,,,,,,,,,,,,,,,2004-06-01,A,,,,,01.41Z,NAFRev2,N,0.379558,48.601902,0.93,street,La Croix 61170 Le Plantis,61331_q581mj,G,LA CROIX,
422672725,00013,42267272500013,O,1999-05-03,,,,,true,1,,,,,GLATIGNY,61170,LE PLANTIS,,,61331,,,,,,,,,,,,,,,,,,,1999-10-25,F,,,,,20.1B,NAF1993,N,0.391803,48.602043,0.91,street,Lieu Dit Glatigny 61170 Le Plantis,61331_1t2aug,G,LIEU DIT GLATIGNY,
428066849,00012,42806684900012,O,1968-01-01,NN,,,2012-07-28T14:18:39,true,4,,,,,LE PARC DECUENE,61170,LE PLANTIS,,,61331,,,,,,,,,,,,,,,,,,,2010-12-25,F,,,,,01.50Z,NAFRev2,N,0.370579,48.603793,0.73,street,Parc d'Ecuenne 61170 Le Plantis,61331_b159,G,PARC D ECUENNE,
429768328,00016,42976832800016,O,2000-01-26,NN,,,2007-01-23T04:57:04,true,3,,,,,MAISON AUX FEVES,61170,LE PLANTIS,,,61331,,,,,,,,,,,,,,,,,,,2006-12-31,F,,,,,01.3Z,NAFRev1,N,0.416273,48.607964,0.82,street,La Maison aux Fevres 61170 Le Plantis,61331_b134,G,LA MAISON AUX FEVRES,
431424597,00018,43142459700018,O,1969-01-01,NN,,,2016-01-12T00:22:33,true,3,,,,,LE BOURG,61170,LE PLANTIS,,,61331,,,,,,,,,,,,,,,,,,,2008-01-01,A,,,,,01.50Z,NAFRev2,N,0.381473,48.600619,0.93,street,Le Bourg 61170 Le Plantis,61331_qo0vcx,G,LE BOURG,
431913896,00012,43191389600012,O,2000-07-15,NN,,,2007-02-28T06:40:29,true,3,,,,,LE PARC D'ECUENNE,61170,LE PLANTIS,,,61331,,,,,,,,,,,,,,,,,,,2006-10-31,F,,,,,01.2A,NAFRev1,N,0.370579,48.603793,0.89,street,Parc d'Ecuenne 61170 Le Plantis,61331_b159,G,PARC D ECUENNE,
433880598,00019,43388059800019,O,2001-01-01,NN,,,2009-03-08T05:49:41,true,3,,,,,LE GRAND COUDRAY,61170,LE PLANTIS,,,61331,,,,,,,,,,,,,,,,,,,2008-01-01,A,,,,,01.42Z,NAFRev2,N,0.374612,48.606505,0.77,street,Le Grand Coudrey 61170 Le Plantis,61331_b254,G,LE GRAND COUDREY,
438328700,00010,43832870000010,O,2001-07-02,NN,,,2014-06-14T02:11:26,true,4,,,,,TOMBELINE,61170,LE PLANTIS,,,61331,,,,,,,,,,,,,,,,,,,2012-07-02,F,,,,,01.45Z,NAFRev2,N,0.404509,48.606686,0.93,street,Tombeline 61170 Le Plantis,61331_13sx7o,G,TOMBELINE,
445066814,00010,44506681400010,O,2003-02-03,NN,,,2008-11-08T02:22:07,true,3,,,,,LHOMAS,61170,LE PLANTIS,,,61331,,,,,,,,,,,,,,,,,,,2006-03-31,F,,,,,93.0D,NAFRev1,N,0.372969,48.602126,0.93,street,Lhomas 61170 Le Plantis,61331_1jd945,G,LHOMAS,
453027211,00011,45302721100011,O,2004-04-08,NN,,,2015-01-22T03:20:00,true,4,,,,,LE BISSON,61170,LE PLANTIS,,,61331,,,,,,,,,,,,,,,,,,,2011-12-05,F,,,,,43.99C,NAFRev2,O,0.392572,48.607606,0.93,street,Le Bisson 61170 Le Plantis,61331_np5wp7,G,LE BISSON,
480135243,00024,48013524300024,O,2004-11-22,NN,,,2013-06-17T02:34:05,false,4,,,,,LES FRICHES,61170,LE PLANTIS,,,61331,,,,,,,,,,,,,,,,,,,2008-01-01,A,,,,,01.43Z,NAFRev2,O,0.393518,48.596709,0.93,street,Les Friches 61170 Le Plantis,61331_ijod62,G,LES FRICHES,
490309226,00010,49030922600010,O,2006-05-01,NN,,,2015-05-14T08:01:52,true,2,,,,,LES FRICHES,61170,LE PLANTIS,,,61331,,,,,,,,,,,,,,,,,,,2008-01-01,A,SB GREEN HILL RANCH QH,,,,01.11Z,NAFRev2,N,0.393518,48.596709,0.93,street,Les Friches 61170 Le Plantis,61331_ijod62,G,LES FRICHES,
502039035,00014,50203903500014,O,2008-01-01,,,,2008-03-25T16:16:46,true,1,,,,,SOUS LE BOIS,61170,LE PLANTIS,,,61331,,,,,,,,,,,,,,,,,,,2008-01-01,A,,,,,01.19Z,NAFRev2,N,0.40167,48.603643,0.93,street,Sous le Bois 61170 Le Plantis,61331_3m82er,G,SOUS LE BOIS,
502110752,00032,50211075200032,O,2011-12-01,,,4322AZ,2018-03-14T04:10:53,true,2,,,,,GLATIGNY,61170,LE PLANTIS,,,61331,,,,,,,,,,,,,,,,,,,2017-11-30,F,,,,,43.22A,NAFRev2,N,0.391803,48.602043,0.91,street,Lieu Dit Glatigny 61170 Le Plantis,61331_1t2aug,G,LIEU DIT GLATIGNY,
524915170,00020,52491517000020,O,2012-01-01,,,,2013-09-26T10:35:00,false,2,,,,,HAMEAU DE CLAIREFEUILLE,61170,LE PLANTIS,,,61331,,,,,,,,,,,,,,,,,,,2013-05-18,F,,,,,90.01Z,NAFRev2,N,0.418948,48.601917,0.59,street,Clairefeuille 61170 Le Plantis,61331_gnxw5n,G,CLAIREFEUILLE,
529789935,00010,52978993500010,O,2011-02-01,,,,2011-06-15T10:49:15,true,1,,,,,LES NOES GOBES,61170,LE PLANTIS,,,61331,,,,,,,,,,,,,,,,,,,2011-02-01,A,ECURIE DES NOES,,,ECURIE DES NOES,01.62Z,NAFRev2,N,0.389244,48.598604,0.93,street,Les Noes Gobes 61170 Le Plantis,61331_b149,G,LES NOES GOBES,
533628830,00010,53362883000010,O,2009-08-20,,,,2011-07-19T06:01:00,true,1,,,,,LA TASSELIERE,61170,LE PLANTIS,,,61331,,,,,,,,,,,,,,,,,,,2009-08-20,A,,,,,01.49Z,NAFRev2,N,0.380958,48.60826,0.73,street,Lieu Dit Tasseliere 61170 Le Plantis,61331_gwto9n,G,LIEU DIT TASSELIERE,
539513333,00010,53951333300010,O,2012-01-01,,,,2012-02-13T02:41:42,true,1,,,,,LES CAILLOUX,61170,LE PLANTIS,,,61331,,,,,,,,,,,,,,,,,,,2012-01-01,A,,,,,01.43Z,NAFRev2,N,0.3871,48.602669,0.93,street,Les Cailloux 61170 Le Plantis,61331_1aao86,G,LES CAILLOUX,
752564823,00017,75256482300017,O,2012-07-02,01,2017,,2019-06-24T13:42:27,true,1,,,,,TOMBELINE,61170,LE PLANTIS,,,61331,,,,,,,,,,,,,,,,,,,2012-07-02,A,LES BIQUETTES DU PLANTIS,,,,01.45Z,NAFRev2,N,0.404509,48.606686,0.93,street,Tombeline 61170 Le Plantis,61331_13sx7o,G,TOMBELINE,
753438902,00011,75343890200011,O,2012-09-15,,,,2012-08-24T09:37:01,true,1,,,,,GLATIGNY,61170,LE PLANTIS,,,61331,,,,,,,,,,,,,,,,,,,2012-09-15,A,,,,,96.09Z,NAFRev2,N,0.391803,48.602043,0.91,street,Lieu Dit Glatigny 61170 Le Plantis,61331_1t2aug,G,LIEU DIT GLATIGNY,
753917731,00014,75391773100014,O,2012-08-01,,,,2012-09-21T09:52:41,true,1,,,,,L'HOMAS,61170,LE PLANTIS,,,61331,,,,,,,,,,,,,,,,,,,2012-08-01,A,,,,,68.20B,NAFRev2,N,0.373893,48.60149,0.93,street,L'Homas 61170 Le Plantis,61331_p8ck4d,G,L HOMAS,
790061899,00015,79006189900015,O,2012-12-18,,,,2013-10-09T03:45:10,true,2,,,,,L HOMAS,61170,LE PLANTIS,,,61331,,,,,,,,,,,,,,,,,,,2013-08-31,F,,,,,47.59B,NAFRev2,N,0.373893,48.60149,0.93,street,L'Homas 61170 Le Plantis,61331_p8ck4d,G,L HOMAS,
790972558,00015,79097255800015,O,2012-10-01,,,,2020-06-17T04:05:02,true,2,,,,,L ETANG,61170,LE PLANTIS,,,61331,,,,,,,,,,,,,,,,,,,2019-12-31,F,,,,,85.59A,NAFRev2,N,0.37815,48.602402,0.57,street,Les Etangs 61170 Le Plantis,61331_58x42z,G,LES ETANGS,
791179005,00016,79117900500016,O,2013-02-20,,,,2013-02-14T12:19:28,true,1,,,,,LE BOURG,61170,LE PLANTIS,,,61331,,,,,,,,,,,,,,,,,,,2013-02-20,A,,,,,90.02Z,NAFRev2,N,0.381473,48.600619,0.93,street,Le Bourg 61170 Le Plantis,61331_qo0vcx,G,LE BOURG,
792014987,00012,79201498700012,O,2013-03-01,,,3109BA,2015-03-18T00:53:58,true,1,,,,,LA ROUILLEE,61170,LE PLANTIS,,,61331,,,,,,,,,,,,,,,,,,,2013-03-01,A,,,,ATELIER PARCHEMIN,31.09B,NAFRev2,N,0.415047,48.614869,0.69,street,Lieu Dit Rouillee 61170 Le Plantis,61331_un0i35,G,LIEU DIT ROUILLEE,
807977178,00019,80797717800019,O,2014-12-01,,,,2020-03-20T03:34:19,true,2,,,,,GLATIGNY,61170,LE PLANTIS,,,61331,,,,,,,,,,,,,,,,,,,2019-01-31,F,,,,,47.91A,NAFRev2,N,0.391803,48.602043,0.91,street,Lieu Dit Glatigny 61170 Le Plantis,61331_1t2aug,G,LIEU DIT GLATIGNY,
824692198,00016,82469219800016,O,2017-01-03,,,,2019-06-04T04:22:57,true,2,,,,,LHOMAS,61170,LE PLANTIS,,,61331,,,,,,,,,,,,,,,,,,,2019-06-30,F,,,,OBA ELAG',81.30Z,NAFRev2,N,0.372969,48.602126,0.93,street,Lhomas 61170 Le Plantis,61331_1jd945,G,LHOMAS,
830722013,00018,83072201300018,O,2014-05-23,,,,2017-07-06T09:59:57,true,1,,,,,LIEU DIT LES NOES GOBES,61170,LE PLANTIS,,,61331,,,,,,,,,,,,,,,,,,,2014-05-23,A,,,,,94.99Z,NAFRev2,N,0.389244,48.598604,0.93,street,Les Noes Gobes 61170 Le Plantis,61331_b149,G,LES NOES GOBES,
832426225,00013,83242622500013,O,2017-09-25,,,4399CZ,2017-10-05T14:30:03,true,1,,,,,LE BOURG,61170,LE PLANTIS,,,61331,,,,,,,,,,,,,,,,,,,2017-09-25,A,,,,,43.99C,NAFRev2,N,0.381473,48.600619,0.93,street,Le Bourg 61170 Le Plantis,61331_qo0vcx,G,LE BOURG,
832738827,00019,83273882700019,O,2017-10-12,,,,2020-02-27T03:56:34,true,4,,,,,LIEU-DIT JOUET,61170,LE PLANTIS,,,61331,,,,,,,,,,,,,,,,,,,2019-03-18,F,,,,,43.31Z,NAFRev2,N,0.418704,48.606265,0.9,street,Lieu Dit Jouet 61170 Le Plantis,61331_emh059,G,LIEU DIT JOUET,
841510910,00018,84151091000018,O,2018-07-20,,,,2018-08-03T11:12:47,true,1,,,,,L'HOMAS,61170,LE PLANTIS,,,61331,,,,,,,,,,,,,,,,,,,2018-07-20,A,,,,,66.30Z,NAFRev2,N,0.373893,48.60149,0.93,street,L'Homas 61170 Le Plantis,61331_p8ck4d,G,L HOMAS,
878605377,00018,87860537700018,O,2015-03-24,,,,2019-10-31T20:00:37,true,1,,,,,LHOMAS,61170,LE PLANTIS,,,61331,,,,,,,,,,,,,,,,,,,2015-03-24,A,,,,,94.99Z,NAFRev2,N,0.372969,48.602126,0.93,street,Lhomas 61170 Le Plantis,61331_1jd945,G,LHOMAS,
885323451,00017,88532345100017,O,2020-07-15,,,,2020-07-21T12:05:00,true,1,LE PARC BIGOT,,,,LA MAISON AUX FEVES,61170,LE PLANTIS,,,61331,,,,,,,,,,,,,,,,,,,2020-07-15,A,,,,,47.99B,NAFRev2,N,0.416273,48.607964,0.84,street,La Maison aux Fevres 61170 Le Plantis,61331_b134,G,LA MAISON AUX FEVRES,
