siren,nic,siret,statutDiffusionEtablissement,dateCreationEtablissement,trancheEffectifsEtablissement,anneeEffectifsEtablissement,activitePrincipaleRegistreMetiersEtablissement,dateDernierTraitementEtablissement,etablissementSiege,nombrePeriodesEtablissement,complementAdresseEtablissement,numeroVoieEtablissement,indiceRepetitionEtablissement,typeVoieEtablissement,libelleVoieEtablissement,codePostalEtablissement,libelleCommuneEtablissement,libelleCommuneEtrangerEtablissement,distributionSpecialeEtablissement,codeCommuneEtablissement,codeCedexEtablissement,libelleCedexEtablissement,codePaysEtrangerEtablissement,libellePaysEtrangerEtablissement,complementAdresse2Etablissement,numeroVoie2Etablissement,indiceRepetition2Etablissement,typeVoie2Etablissement,libelleVoie2Etablissement,codePostal2Etablissement,libelleCommune2Etablissement,libelleCommuneEtranger2Etablissement,distributionSpeciale2Etablissement,codeCommune2Etablissement,codeCedex2Etablissement,libelleCedex2Etablissement,codePaysEtranger2Etablissement,libellePaysEtranger2Etablissement,dateDebut,etatAdministratifEtablissement,enseigne1Etablissement,enseigne2Etablissement,enseigne3Etablissement,denominationUsuelleEtablissement,activitePrincipaleEtablissement,nomenclatureActivitePrincipaleEtablissement,caractereEmployeurEtablissement,longitude,latitude,geo_score,geo_type,geo_adresse,geo_id,geo_ligne,geo_l4,geo_l5
210201802,00019,21020180200019,O,1983-03-01,03,2018,,2020-08-25T10:15:27,true,4,,17,,RUE,DU PETIT VERSAILLES,02260,CLAIRFONTAINE,,,02197,,,,,,,,,,,,,,,,,,,2008-01-01,A,MAIRIE,,,,84.11Z,NAFRev2,O,3.99034,49.982858,0.94,housenumber,17 Rue du Petit Versailles 02260 Clairfontaine,02197_0051_00017,G,17 RUE DU PETIT VERSAILLES,
210201802,00027,21020180200027,O,1983-12-21,NN,,,2006-10-26T23:40:05,false,3,,13,,RUE,DU PETIT VERSAILLES,02260,CLAIRFONTAINE,,,02197,,,,,,,,,,,,,,,,,,,2004-08-31,F,ECOLE PRIMAIRE PUBLIQUE,,,,80.1Z,NAFRev1,N,3.99034,49.982858,0.94,housenumber,13 Rue du Petit Versailles 02260 Clairfontaine,02197_0051_00013,G,13 RUE DU PETIT VERSAILLES,
250200649,00011,25020064900011,O,1983-03-01,NN,,,2007-05-19T08:22:59,true,3,MAIRIE,17,,RUE,DU PETIT VERSAILLES,02260,CLAIRFONTAINE,,,02197,,,,,,,,,,,,,,,,,,,2006-06-22,F,,,,,75.1C,NAFRev1,N,3.99034,49.982858,0.94,housenumber,17 Rue du Petit Versailles 02260 Clairfontaine,02197_0051_00017,G,17 RUE DU PETIT VERSAILLES,
260201959,00012,26020195900012,O,1983-03-01,NN,,,2019-03-15T15:21:36,true,4,MAIRIE,17,,RUE,DU PETIT VERSAILLES,02260,CLAIRFONTAINE,,,02197,,,,,,,,,,,,,,,,,,,2016-02-23,F,CCAS,,,,88.99B,NAFRev2,N,3.99034,49.982858,0.94,housenumber,17 Rue du Petit Versailles 02260 Clairfontaine,02197_0051_00017,G,17 RUE DU PETIT VERSAILLES,
300336930,00015,30033693000015,O,,,,,,true,1,,,,RUE,DES CENDREUX,02260,CLAIRFONTAINE,,,02197,,,,,,,,,,,,,,,,,,,1984-12-25,F,,,,,55.72,NAP,N,3.988903,49.971654,0.94,street,Rue des Cendreux 02260 Clairfontaine,02197_0014,G,RUE DES CENDREUX,
302727797,00011,30272779700011,O,1900-01-01,12,2018,,2020-08-25T10:22:24,true,4,,,,HAM,BEAUREGARD,02260,CLAIRFONTAINE,,,02197,,,,,,,,,,,,,,,,,,,2008-01-01,A,,,,,85.59B,NAFRev2,O,3.972225,49.958705,0.91,street,Chemin de Beauregard 02260 Clairfontaine,02197_0002,G,CHEMIN DE BEAUREGARD,
303589733,00029,30358973300029,O,,NN,,,,true,1,,,,PL,DU PETIT VERSAILLES,02260,CLAIRFONTAINE,,,02197,,,,,,,,,,,,,,,,,,,,F,,,,,69.11,NAP,N,3.991332,49.983466,0.81,street,Rue du Petit Versailles 02260 Clairfontaine,02197_0051,G,RUE DU PETIT VERSAILLES,
305068199,00010,30506819900010,O,,NN,,,,true,1,,,,RUE,DE PARIS,02260,CLAIRFONTAINE,,,02197,,,,,,,,,,,,,,,,,,,1993-12-31,F,,,,,55.3A,NAF1993,N,3.973089,49.965512,0.94,street,Rue de Paris 02260 Clairfontaine,02197_0049,G,RUE DE PARIS,
306332586,00024,30633258600024,O,1900-01-01,NN,,,,false,3,,,,,,02260,CLAIRFONTAINE,,,02197,,,,,,,,,,,,,,,,,,,1995-07-01,F,,,,,85.1G,NAF1993,N,,,0,,,,,,
318358215,00016,31835821500016,O,1980-01-01,NN,,,2008-11-07T00:34:04,true,3,,,,RUE,DU DR MAHY,02260,CLAIRFONTAINE,,,02197,,,,,,,,,,,,,,,,,,,2004-12-31,F,,,,,45.2V,NAFRev1,N,3.986262,49.981131,0.81,street,Rue du Docteur Mahy 02260 Clairfontaine,02197_0023,G,RUE DU DOCTEUR MAHY,
320508518,00018,32050851800018,O,1979-11-30,NN,,,2006-10-27T01:09:27,true,3,,,,,CHEZ MR ROLAND CLIN,02260,CLAIRFONTAINE,,,02197,,,,,,,,,,,,,,,,,,,2005-12-31,F,,,,,74.8K,NAFRev1,N,,,0,,,,,,
321992869,00016,32199286900016,O,1979-12-13,NN,,,2015-07-10T11:43:16,true,3,,,,,,02260,CLAIRFONTAINE,,,02197,,,,,,,,,,,,,,,,,,,2008-01-01,A,,,,,01.61Z,NAFRev2,N,,,0,,,,,,
323149815,00017,32314981500017,O,,NN,,,,true,1,,,,PL,DE LA MAIRIE,02260,CLAIRFONTAINE,,,02197,,,,,,,,,,,,,,,,,,,1992-03-31,F,,,,,55.4B,NAF1993,N,4.002865,49.974068,0.59,street,Rue de la Prairie 02260 Clairfontaine,02197_0055,G,RUE DE LA PRAIRIE,
325592673,00033,32559267300033,O,1986-03-31,NN,,,2006-11-25T10:00:05,true,4,,,,RUE,NUL S Y FROTTE,02260,CLAIRFONTAINE,,,02197,,,,,,,,,,,,,,,,,,,2004-12-31,F,,,,,01.1A,NAFRev1,N,3.980552,49.97673,0.94,street,Rue Nul S'Y Frotte 02260 Clairfontaine,02197_0046,G,RUE NUL S Y FROTTE,
325762367,00010,32576236700010,O,1982-06-01,NN,,,2008-04-10T05:32:31,true,3,,,,RUE,DU DOCTEUR MAHY,02260,CLAIRFONTAINE,,,02197,,,,,,,,,,,,,,,,,,,2008-01-01,A,,,,,01.41Z,NAFRev2,N,3.986262,49.981131,0.94,street,Rue du Docteur Mahy 02260 Clairfontaine,02197_0023,G,RUE DU DOCTEUR MAHY,
328909106,00010,32890910600010,O,1984-01-01,NN,,,,true,4,,,,,,02260,CLAIRFONTAINE,,,02197,,,,,,,,,,,,,,,,,,,2003-12-31,F,,,,,01.3Z,NAFRev1,N,,,0,,,,,,
329179592,00012,32917959200012,O,,NN,,,,true,1,,,,RUE,DE PARIS,02260,CLAIRFONTAINE,,,02197,,,,,,,,,,,,,,,,,,,1990-02-27,F,,,,,62.46,NAP,N,3.973089,49.965512,0.94,street,Rue de Paris 02260 Clairfontaine,02197_0049,G,RUE DE PARIS,
329266688,00012,32926668800012,O,,,,,,true,1,,,,RUE,DES CENDREUX,02260,CLAIRFONTAINE,,,02197,,,,,,,,,,,,,,,,,,,1985-12-25,F,,,,,55.72,NAP,N,3.988903,49.971654,0.94,street,Rue des Cendreux 02260 Clairfontaine,02197_0014,G,RUE DES CENDREUX,
331321950,00015,33132195000015,O,1984-01-31,NN,,,,true,1,,3,,RUE,DES NOURRIS,02260,CLAIRFONTAINE,,,02197,,,,,,,,,,,,,,,,,,,1999-08-31,F,,,,,01.2A,NAF1993,N,4.008248,49.984952,0.94,housenumber,3 Rue des Nourris 02260 Clairfontaine,02197_0044_00003,G,3 RUE DES NOURRIS,
331694273,00011,33169427300011,O,1985-01-01,NN,,,2007-01-18T09:19:52,true,4,,,,,MOULIN D ECOUTE S IL PLEUT,02260,CLAIRFONTAINE,,,02197,,,,,,,,,,,,,,,,,,,1992-12-25,F,,,,,01.2A,NAF1993,N,3.972968,49.954106,0.79,street,Rue du Moul d'Ecoute S Il Pleut 02260 Clairfontaine,02197_0039,G,RUE DU MOUL D ECOUTE S IL PLEUT,
334983780,00027,33498378000027,O,1991-02-25,NN,,,,true,1,,,,RUE,NUL S'Y FROTTE,02260,CLAIRFONTAINE,,,02197,,,,,,,,,,,,,,,,,,,1994-02-18,F,,,,,01.4A,NAF1993,N,3.980552,49.97673,0.94,street,Rue Nul S'Y Frotte 02260 Clairfontaine,02197_0046,G,RUE NUL S Y FROTTE,
339519530,00028,33951953000028,O,,NN,,,,true,1,,,,RUE,ROGER,02260,CLAIRFONTAINE,,,02197,,,,,,,,,,,,,,,,,,,1995-09-26,F,,,,,02.0B,NAF1993,N,4.004466,49.988946,0.94,street,Rue Roger 02260 Clairfontaine,02197_b055,G,RUE ROGER,
340690940,00036,34069094000036,O,1997-01-01,NN,,,2008-01-04T21:44:47,false,3,,,,,LE CHAMP BOUVIER,02260,CLAIRFONTAINE,,,02197,,,,,,,,,,,,,,,,,,,2008-01-01,A,,,,,71.11Z,NAFRev2,N,3.964134,49.950776,0.79,street,Champ Bouvier 02260 Clairfontaine,02197_b009,G,CHAMP BOUVIER,
340824697,00015,34082469700015,O,1985-11-28,NN,,,,true,1,,,,,,02260,CLAIRFONTAINE,,,02197,,,,,,,,,,,,,,,,,,,1998-12-31,F,,,,,55.1A,NAF1993,N,,,0,,,,,,
340839455,00011,34083945500011,O,1987-01-01,NN,,,2008-01-04T21:46:25,true,3,,,,HAM,DE BEAUREGARD,02260,CLAIRFONTAINE,,,02197,,,,,,,,,,,,,,,,,,,2008-01-01,A,,,,,01.50Z,NAFRev2,N,3.972225,49.958705,0.92,street,Chemin de Beauregard 02260 Clairfontaine,02197_0002,G,CHEMIN DE BEAUREGARD,
340933050,00015,34093305000015,O,1974-01-01,NN,,,2008-01-04T21:47:27,true,3,,,,RUE,DES CENDREUX,02260,CLAIRFONTAINE,,,02197,,,,,,,,,,,,,,,,,,,2008-01-01,A,,,,,01.41Z,NAFRev2,N,3.988903,49.971654,0.94,street,Rue des Cendreux 02260 Clairfontaine,02197_0014,G,RUE DES CENDREUX,
341799401,00011,34179940100011,O,1987-05-20,NN,,,2010-03-21T05:40:23,true,4,,,,,,02260,CLAIRFONTAINE,,,02197,,,,,,,,,,,,,,,,,,,2008-01-01,A,,,,,01.11Z,NAFRev2,N,,,0,,,,,,
341799401,00037,34179940100037,O,2010-02-01,,,,2010-02-04T13:51:50,false,1,,,,,,02260,CLAIRFONTAINE,,,02197,,,,,,,,,,,,,,,,,,,2010-02-01,A,,,,,01.11Z,NAFRev2,N,,,0,,,,,,
344038690,00014,34403869000014,O,,,,,,true,1,,,,RUE,DES CENDREUX,02260,CLAIRFONTAINE,,,02197,,,,,,,,,,,,,,,,,,,1996-01-16,F,,,,,01.4A,NAF1993,N,3.988903,49.971654,0.94,street,Rue des Cendreux 02260 Clairfontaine,02197_0014,G,RUE DES CENDREUX,
347437683,00019,34743768300019,O,1988-07-12,NN,,,2015-05-14T07:37:49,false,5,,16,,RUE,DU PETIT VERSAILLES,02260,CLAIRFONTAINE,,,02197,,,,,,,,,,,,,,,,,,,2013-12-31,F,,,,,01.11Z,NAFRev2,O,3.987282,49.98176,0.94,housenumber,16 Rue du Petit Versailles 02260 Clairfontaine,02197_0051_00016,G,16 RUE DU PETIT VERSAILLES,
347437683,00027,34743768300027,O,2013-12-31,01,2018,,2020-08-25T10:42:46,true,2,,4,,RUE,PIERRE CARON,02260,CLAIRFONTAINE,,,02197,,,,,,,,,,,,,,,,,,,2014-12-31,A,,,,,01.50Z,NAFRev2,O,3.985892,49.981573,0.94,housenumber,4 Rue Pierre Caron 02260 Clairfontaine,02197_b045_00004,G,4 RUE PIERRE CARON,
348130212,00031,34813021200031,O,1998-01-01,01,2018,4391BZ,2020-08-25T10:43:13,true,4,,1,,RUE,HUBERT BERNARD FAYET,02260,CLAIRFONTAINE,,,02197,,,,,,,,,,,,,,,,,,,2015-11-01,A,,,,,43.91B,NAFRev2,O,3.991954,49.975943,0.86,housenumber,1 Rue Hubert et Bernard Fayt 02260 Clairfontaine,02197_0031_00001,G,1 RUE HUBERT ET BERNARD FAYT,
348130352,00035,34813035200035,O,1998-01-01,NN,,4399CZ,2015-10-13T04:08:23,true,4,,1,,RUE,HUBERT BERNARD FAYET,02260,CLAIRFONTAINE,,,02197,,,,,,,,,,,,,,,,,,,2015-10-31,F,,,,,43.91B,NAFRev2,N,3.991954,49.975943,0.86,housenumber,1 Rue Hubert et Bernard Fayt 02260 Clairfontaine,02197_0031_00001,G,1 RUE HUBERT ET BERNARD FAYT,
348130501,00037,34813050100037,O,1998-01-01,NN,,,2017-05-04T05:52:50,true,4,,1,,RUE,HUBERT BERNARD FAYET,02260,CLAIRFONTAINE,,,02197,,,,,,,,,,,,,,,,,,,2015-10-31,F,,,,,43.91B,NAFRev2,O,3.991954,49.975943,0.86,housenumber,1 Rue Hubert et Bernard Fayt 02260 Clairfontaine,02197_0031_00001,G,1 RUE HUBERT ET BERNARD FAYT,
349364109,00018,34936410900018,O,,NN,,,,true,1,,,,,,02260,CLAIRFONTAINE,,,02197,,,,,,,,,,,,,,,,,,,1993-12-31,F,,,,,01.2A,NAF1993,N,,,0,,,,,,
352124168,00019,35212416800019,O,1989-10-01,12,2018,,2020-08-25T10:12:20,true,5,,2,,RUE,DE PARIS,02260,CLAIRFONTAINE,,,02197,,,,,,,,,,,,,,,,,,,2008-01-01,A,,,,,46.61Z,NAFRev2,O,3.986691,49.963741,0.94,housenumber,2 Rue de Paris 02260 Clairfontaine,02197_0049_00002,G,2 RUE DE PARIS,
356000224,01513,35600022401513,O,1991-01-01,NN,,,2006-11-29T15:31:34,false,3,,1,,RUE,DE LA POSTE,02260,CLAIRFONTAINE,,,02197,,,,,,,,,,,,,,,,,,,2006-11-13,F,BUREAU DE POSTE,,,,64.1A,NAFRev1,O,3.972312,49.965383,0.94,housenumber,1 Rue de la Poste 02260 Clairfontaine,02197_0054_00001,G,1 RUE DE LA POSTE,
377872726,00015,37787272600015,O,1990-05-03,NN,,,2008-01-04T21:09:05,true,3,,,,,LE PETIT VERSAILLE,02260,CLAIRFONTAINE,,,02197,,,,,,,,,,,,,,,,,,,2008-01-01,A,,,,,68.20B,NAFRev2,N,3.991332,49.983466,0.78,street,Rue du Petit Versailles 02260 Clairfontaine,02197_0051,G,RUE DU PETIT VERSAILLES,
379055411,00019,37905541100019,O,1990-05-01,01,2017,,2019-06-24T13:09:13,true,4,,2,,,LE PETIT VERSAILLES,02260,CLAIRFONTAINE,,,02197,,,,,,,,,,,,,,,,,,,2008-01-01,A,,,,,01.41Z,NAFRev2,O,3.990957,49.983348,0.77,housenumber,2 Rue du Petit Versailles 02260 Clairfontaine,02197_0051_00002,G,2 RUE DU PETIT VERSAILLES,
380859645,00018,38085964500018,O,1991-01-01,NN,,,2020-01-04T03:52:06,true,4,,,,RUE,DU CHEMIN NOIR,02260,CLAIRFONTAINE,,,02197,,,,,,,,,,,,,,,,,,,2018-12-31,F,,,,,01.42Z,NAFRev2,N,3.967401,49.969735,0.94,street,Rue du Chemin Noir 02260 Clairfontaine,02197_0041,G,RUE DU CHEMIN NOIR,
380860445,00010,38086044500010,O,,NN,,,,true,1,,,,,,02260,CLAIRFONTAINE,,,02197,,,,,,,,,,,,,,,,,,,1995-06-01,F,,,,,01.2A,NAF1993,N,,,0,,,,,,
381175488,00018,38117548800018,O,,NN,,,,true,1,,2,,CITE,MOVIN,02260,CLAIRFONTAINE,,,02197,,,,,,,,,,,,,,,,,,,1991-06-06,F,,,,,80.08,NAP,N,3.970698,49.966494,0.72,housenumber,2 Cité Morin 02260 Clairfontaine,02197_x050_00002,G,2 CITE MORIN,
384145595,00011,38414559500011,O,1992-01-01,NN,,,,true,1,,10,,RUE,DU CHAMP BOUVIER,02260,CLAIRFONTAINE,,,02197,,,,,,,,,,,,,,,,,,,1998-12-15,F,,,,,52.6D,NAF1993,N,3.963009,49.948474,0.84,street,Rue du Champ Bouvier 02260 Clairfontaine,02197_0015,G,RUE DU CHAMP BOUVIER,
384249496,00017,38424949600017,O,,NN,,,,true,1,,,,,,02260,CLAIRFONTAINE,,,02197,,,,,,,,,,,,,,,,,,,1995-12-31,F,,,,,01.2A,NAF1993,N,,,0,,,,,,
384571980,00018,38457198000018,O,1992-03-02,NN,,4399CZ,2018-09-29T12:13:38,false,5,,,,LD,LES MUTERNES,02260,CLAIRFONTAINE,,,02197,,,,,,,,,,,,,,,,,,,2017-03-31,F,,,,,43.99C,NAFRev2,O,,,0,,,,,,
384571980,00026,38457198000026,O,2018-05-07,,,8121ZZ,2019-02-09T04:04:48,true,2,LIEUDIT LES MUTERNES,2,,RUE,DU MOULIN,02260,CLAIRFONTAINE,,,02197,,,,,,,,,,,,,,,,,,,2018-12-30,F,,,,ALBA ANGEL,81.21Z,NAFRev2,N,4.020374,49.975776,0.94,housenumber,2 Rue du Moulin 02260 Clairfontaine,02197_0038_00002,G,2 RUE DU MOULIN,
388490161,00022,38849016100022,O,1996-11-26,NN,,,2011-04-28T00:52:57,false,4,,,,RUE,DE PARIS,02260,CLAIRFONTAINE,,,02197,,,,,,,,,,,,,,,,,,,2002-06-30,F,,,,,55.3A,NAF1993,N,3.973089,49.965512,0.94,street,Rue de Paris 02260 Clairfontaine,02197_0049,G,RUE DE PARIS,
388784654,00013,38878465400013,O,,NN,,,,true,1,,,,,MOULIN D ECOUTE S IL PLEUT,02260,CLAIRFONTAINE,,,02197,,,,,,,,,,,,,,,,,,,1995-12-31,F,,,,,01.2A,NAF1993,N,3.972968,49.954106,0.79,street,Rue du Moul d'Ecoute S Il Pleut 02260 Clairfontaine,02197_0039,G,RUE DU MOUL D ECOUTE S IL PLEUT,
389600081,00019,38960008100019,O,,NN,,,,true,1,,,,,LE CHAMP BOUVIERS,02260,CLAIRFONTAINE,,,02197,,,,,,,,,,,,,,,,,,,1996-12-31,F,,,,,01.2A,NAF1993,N,3.964134,49.950776,0.71,street,Champ Bouvier 02260 Clairfontaine,02197_b009,G,CHAMP BOUVIER,
389993981,00015,38999398100015,O,,,,,,true,1,,,,RUE,DES CENDREUX,02260,CLAIRFONTAINE,,,02197,,,,,,,,,,,,,,,,,,,1997-03-31,F,,,,,01.2A,NAF1993,N,3.988903,49.971654,0.94,street,Rue des Cendreux 02260 Clairfontaine,02197_0014,G,RUE DES CENDREUX,
390593085,00017,39059308500017,O,,NN,,,,true,1,,,,RUE,DU DOCTEUR MAHY,02260,CLAIRFONTAINE,,,02197,,,,,,,,,,,,,,,,,,,1994-06-30,F,,,,,72.5Z,NAF1993,N,3.986262,49.981131,0.94,street,Rue du Docteur Mahy 02260 Clairfontaine,02197_0023,G,RUE DU DOCTEUR MAHY,
391451614,00013,39145161400013,O,1993-06-01,NN,,,2008-11-08T00:54:22,true,3,,3,,RUE,DES CENDREUX,02260,CLAIRFONTAINE,,,02197,,,,,,,,,,,,,,,,,,,2005-06-30,F,,,,,50.1Z,NAFRev1,N,3.990054,49.971882,0.94,housenumber,3 Rue des Cendreux 02260 Clairfontaine,02197_0014_00003,G,3 RUE DES CENDREUX,
391648946,00013,39164894600013,O,1970-01-01,NN,,,2008-01-04T23:55:15,true,5,,,,,HAMEAU DE BRAY,02260,CLAIRFONTAINE,,,02197,,,,,,,,,,,,,,,,,,,2008-01-01,A,,,,,68.20B,NAFRev2,N,3.966717,49.961586,0.94,street,Hameau de Bray 02260 Clairfontaine,02197_b021,G,HAMEAU DE BRAY,
391649704,00015,39164970400015,O,,NN,,,,true,1,,,,,,02260,CLAIRFONTAINE,,,02197,,,,,,,,,,,,,,,,,,,1995-12-31,F,,,,,01.2A,NAF1993,N,,,0,,,,,,
391651403,00019,39165140300019,O,1993-01-01,NN,,,,true,1,,4,,RUE,TORTUE,02260,CLAIRFONTAINE,,,02197,,,,,,,,,,,,,,,,,,,1999-08-15,F,,,,,01.2A,NAF1993,N,3.959787,49.953182,0.94,housenumber,4 Rue Tortue 02260 Clairfontaine,02197_0061_00004,G,4 RUE TORTUE,
391652765,00010,39165276500010,O,,,,,,true,1,,,,RUE,DE PARIS,02260,CLAIRFONTAINE,,,02197,,,,,,,,,,,,,,,,,,,1994-04-01,F,,,,,01.2A,NAF1993,N,3.973089,49.965512,0.94,street,Rue de Paris 02260 Clairfontaine,02197_0049,G,RUE DE PARIS,
393463617,00018,39346361700018,O,1994-01-01,NN,,,2009-06-27T07:16:57,true,3,,4,,RUE,DES NOURRIS,02260,CLAIRFONTAINE,,,02197,,,,,,,,,,,,,,,,,,,2008-01-01,A,,,,,01.41Z,NAFRev2,N,4.003936,49.981246,0.94,housenumber,4 Rue des Nourris 02260 Clairfontaine,02197_0044_00004,G,4 RUE DES NOURRIS,
393733936,00016,39373393600016,O,1994-01-01,NN,,,,true,1,,,,RUE,DE PARIS,02260,CLAIRFONTAINE,,,02197,,,,,,,,,,,,,,,,,,,1996-05-07,F,,,,,55.3A,NAF1993,N,3.973089,49.965512,0.94,street,Rue de Paris 02260 Clairfontaine,02197_0049,G,RUE DE PARIS,
393761184,00018,39376118400018,O,1994-01-24,NN,,,2011-06-08T09:28:59,false,4,,8,,RUE,DE BRAY,02260,CLAIRFONTAINE,,,02197,,,,,,,,,,,,,,,,,,,2011-06-01,F,,,,,01.41Z,NAFRev2,N,3.970039,49.963819,0.94,housenumber,8 Rue de Bray 02260 Clairfontaine,02197_0011_00008,G,8 RUE DE BRAY,
393761184,00026,39376118400026,O,2011-06-01,01,2018,,2020-08-25T10:28:30,true,1,,9,,RUE,DE BRAY,02260,CLAIRFONTAINE,,,02197,,,,,,,,,,,,,,,,,,,2011-06-01,A,,,,,01.41Z,NAFRev2,N,3.969848,49.963675,0.94,housenumber,9 Rue de Bray 02260 Clairfontaine,02197_0011_00009,G,9 RUE DE BRAY,
394269971,00013,39426997100013,O,1993-01-01,NN,,,2006-10-28T02:08:09,true,3,,42,,RUE,DE PARIS,02260,CLAIRFONTAINE,,,02197,,,,,,,,,,,,,,,,,,,2004-03-31,F,,,,,01.2A,NAFRev1,N,3.961812,49.967247,0.94,housenumber,42 Rue de Paris 02260 Clairfontaine,02197_0049_00042,G,42 RUE DE PARIS,
395127392,00011,39512739200011,O,,NN,,,,true,1,,,,RUE,DE PARIS,02260,CLAIRFONTAINE,,,02197,,,,,,,,,,,,,,,,,,,1994-04-01,F,,,,,01.2A,NAF1993,N,3.973089,49.965512,0.94,street,Rue de Paris 02260 Clairfontaine,02197_0049,G,RUE DE PARIS,
400972006,00029,40097200600029,O,1997-06-11,,,,,true,1,,1,,RUE,DU MOULIN,02260,CLAIRFONTAINE,,,02197,,,,,,,,,,,,,,,,,,,2000-06-01,F,,,,,01.2A,NAF1993,N,4.009462,49.983423,0.94,housenumber,1 Rue du Moulin 02260 Clairfontaine,02197_0038_00001,G,1 RUE DU MOULIN,
401532015,00013,40153201500013,O,1995-06-01,NN,,,2016-06-23T11:40:29,true,4,,6,,RUE,DE BRAYE,02260,CLAIRFONTAINE,,,02197,,,,,,,,,,,,,,,,,,,2015-12-31,F,,,,,01.41Z,NAFRev2,N,3.970516,49.964149,0.82,housenumber,6 Rue de Bray 02260 Clairfontaine,02197_0011_00006,G,6 RUE DE BRAY,
402096267,00248,40209626700248,O,2007-11-01,12,2018,,2020-08-25T10:34:21,false,4,,1,,RUE,DE PARIS,02260,CLAIRFONTAINE,,,02197,,,,,,,,,,,,,,,,,,,2009-06-01,A,AISNE - CLAIREFONTAINE,,,,42.11Z,NAFRev2,O,3.973089,49.965512,0.94,housenumber,1 Rue de Paris 02260 Clairfontaine,02197_0049_00001,G,1 RUE DE PARIS,
403085145,00015,40308514500015,O,1996-01-01,NN,,,2007-01-18T13:27:01,true,3,,,,,MOULIN D ECOUTE S IL PLEUT,02260,CLAIRFONTAINE,,,02197,,,,,,,,,,,,,,,,,,,2006-12-31,F,,,,,01.2A,NAFRev1,N,3.972968,49.954106,0.79,street,Rue du Moul d'Ecoute S Il Pleut 02260 Clairfontaine,02197_0039,G,RUE DU MOUL D ECOUTE S IL PLEUT,
403353683,00010,40335368300010,O,1974-06-21,,,,2008-03-06T08:45:57,true,3,,,,RUE,NUL S'Y FROTTE,02260,CLAIRFONTAINE,,,02197,,,,,,,,,,,,,,,,,,,2008-01-01,A,,,,,01.41Z,NAFRev2,N,3.980552,49.97673,0.94,street,Rue Nul S'Y Frotte 02260 Clairfontaine,02197_0046,G,RUE NUL S Y FROTTE,
403484975,00012,40348497500012,O,1995-12-31,,,,2011-08-17T05:14:36,true,4,,10,,RUE,DES NOURRIS,02260,CLAIRFONTAINE,,,02197,,,,,,,,,,,,,,,,,,,2011-06-01,F,,,,,01.41Z,NAFRev2,N,4.01764,49.982946,0.94,housenumber,10 Rue des Nourris 02260 Clairfontaine,02197_0044_00010,G,10 RUE DES NOURRIS,
403580285,00019,40358028500019,O,,NN,,,,true,1,,,,,,02260,CLAIRFONTAINE,,,02197,,,,,,,,,,,,,,,,,,,1996-01-31,F,,,,,01.2A,NAF1993,N,,,0,,,,,,
404081267,00019,40408126700019,O,1996-02-01,01,2018,,2020-08-25T10:35:58,true,3,,6,,RUE,DES FONTAINES,02260,CLAIRFONTAINE,,,02197,,,,,,,,,,,,,,,,,,,2008-01-01,A,,,,,01.41Z,NAFRev2,N,3.992411,49.97363,0.94,housenumber,6 Rue des Fontaines 02260 Clairfontaine,02197_0025_00006,G,6 RUE DES FONTAINES,
404992331,00029,40499233100029,O,2007-12-30,,,,2012-09-18T04:51:04,true,2,,1,,RTE,DE WIGNEHIES,02260,CLAIRFONTAINE,,,02197,,,,,,,,,,,,,,,,,,,2012-09-12,F,,,,,01.42Z,NAFRev2,N,3.993583,49.995264,0.84,housenumber,1 Route de Wignehies 02260 Clairfontaine,02197_0067_00001,G,1 ROUTE DE WIGNEHIES,
408868404,00018,40886840400018,O,1991-01-01,NN,,,,true,1,,3,,RUE,DES NOURRIS,02260,CLAIRFONTAINE,,,02197,,,,,,,,,,,,,,,,,,,1999-08-31,F,,,,,01.2A,NAF1993,N,4.008248,49.984952,0.94,housenumber,3 Rue des Nourris 02260 Clairfontaine,02197_0044_00003,G,3 RUE DES NOURRIS,
411636186,00016,41163618600016,O,1965-01-01,NN,,,2006-10-28T03:58:01,true,3,,,,,LA PETITE RUE,02260,CLAIRFONTAINE,,,02197,,,,,,,,,,,,,,,,,,,2004-06-30,F,,,,,01.1A,NAFRev1,N,3.998935,49.99259,0.76,street,Petite Rue 02260 Clairfontaine,02197_0050,G,PETITE RUE,
411636194,00010,41163619400010,O,1979-01-01,NN,,,2006-10-28T03:58:01,true,3,,,,RUE,ROGER,02260,CLAIRFONTAINE,,,02197,,,,,,,,,,,,,,,,,,,2004-07-12,F,,,,,01.2A,NAFRev1,N,4.004466,49.988946,0.94,street,Rue Roger 02260 Clairfontaine,02197_b055,G,RUE ROGER,
411883234,00014,41188323400014,O,1997-04-01,NN,,,2008-01-04T22:06:15,true,3,,1,,RUE,DES CENDREUX,02260,CLAIRFONTAINE,,,02197,,,,,,,,,,,,,,,,,,,2008-01-01,A,,,,,01.41Z,NAFRev2,N,3.988903,49.971654,0.94,housenumber,1 Rue des Cendreux 02260 Clairfontaine,02197_0014_00001,G,1 RUE DES CENDREUX,
411883234,00022,41188323400022,O,2004-07-01,NN,,,2010-04-18T07:31:19,false,3,,1,,RUE,DES CENDREUX,02260,CLAIRFONTAINE,,,02197,,,,,,,,,,,,,,,,,,,2008-01-01,A,,,,,01.61Z,NAFRev2,N,3.988903,49.971654,0.94,housenumber,1 Rue des Cendreux 02260 Clairfontaine,02197_0014_00001,G,1 RUE DES CENDREUX,
413686403,00010,41368640300010,O,1996-12-31,NN,,,,true,4,,1,,RUE,DU CHAMP BOUVIER,02260,CLAIRFONTAINE,,,02197,,,,,,,,,,,,,,,,,,,2001-12-30,F,,,,,01.2A,NAF1993,N,3.963009,49.948474,0.87,street,Rue du Champ Bouvier 02260 Clairfontaine,02197_0015,G,RUE DU CHAMP BOUVIER,
422190603,00015,42219060300015,O,1997-10-01,NN,,,2011-04-23T10:13:49,true,3,,21,,RUE,DU PETIT VERSAILLES,02260,CLAIRFONTAINE,,,02197,,,,,,,,,,,,,,,,,,,2008-01-01,A,,,,,93.19Z,NAFRev2,N,3.988224,49.981929,0.94,housenumber,21 Rue du Petit Versailles 02260 Clairfontaine,02197_0051_00021,G,21 RUE DU PETIT VERSAILLES,
423414366,00017,42341436600017,O,1999-05-01,NN,,,2008-01-05T00:37:02,true,5,,40,,RTE,DE PARIS,02260,CLAIRFONTAINE,,,02197,,,,,,,,,,,,,,,,,,,2008-01-01,A,,,,,01.41Z,NAFRev2,N,3.96245,49.967156,0.77,housenumber,40 Rue de Paris 02260 Clairfontaine,02197_0049_00040,G,40 RUE DE PARIS,
424168938,00019,42416893800019,O,1999-09-07,NN,,,,true,1,,3,,,PETITE RUE,02260,CLAIRFONTAINE,,,02197,,,,,,,,,,,,,,,,,,,2001-12-18,F,,,,,45.4C,NAF1993,N,4.002887,49.993623,0.94,housenumber,3 Petite Rue 02260 Clairfontaine,02197_0050_00003,G,3 PETITE RUE,
424858462,00015,42485846200015,O,1999-09-01,NN,,,2008-01-05T01:06:10,true,3,,3,,RUE,DES NOURRIS,02260,CLAIRFONTAINE,,,02197,,,,,,,,,,,,,,,,,,,2008-01-01,A,,,,,01.41Z,NAFRev2,N,4.008248,49.984952,0.94,housenumber,3 Rue des Nourris 02260 Clairfontaine,02197_0044_00003,G,3 RUE DES NOURRIS,
425357753,00010,42535775300010,O,1968-01-01,NN,,,2008-01-05T01:15:21,true,3,,,,,,02260,CLAIRFONTAINE,,,02197,,,,,,,,,,,,,,,,,,,2008-01-01,A,,,,,01.42Z,NAFRev2,N,,,0,,,,,,
425357761,00013,42535776100013,O,1975-01-01,NN,,,2011-11-30T09:24:59,false,3,,,,,,02260,CLAIRFONTAINE,,,02197,,,,,,,,,,,,,,,,,,,2000-12-31,F,,,,,01.3Z,NAF1993,N,,,0,,,,,,
430093393,00014,43009339300014,O,2000-04-03,NN,,4399CZ,2019-08-31T03:40:56,true,4,,5,,RUE,DE BRAY,02260,CLAIRFONTAINE,,,02197,,,,,,,,,,,,,,,,,,,2019-09-30,F,,,,,43.99C,NAFRev2,N,3.970717,49.964309,0.94,housenumber,5 Rue de Bray 02260 Clairfontaine,02197_0011_00005,G,5 RUE DE BRAY,
430449702,00017,43044970200017,O,2000-04-01,,,,,true,1,,16,,RUE,DU PETIT VERSAILLES,02260,CLAIRFONTAINE,,,02197,,,,,,,,,,,,,,,,,,,2000-04-01,F,,,,,01.3Z,NAF1993,N,3.987282,49.98176,0.94,housenumber,16 Rue du Petit Versailles 02260 Clairfontaine,02197_0051_00016,G,16 RUE DU PETIT VERSAILLES,
430753806,00016,43075380600016,O,1985-01-01,NN,,,2008-01-05T01:55:59,true,4,,,,LD,LE CHEMIN NOIR,02260,CLAIRFONTAINE,,,02197,,,,,,,,,,,,,,,,,,,2008-01-01,A,,,,,01.41Z,NAFRev2,N,3.967407,49.969734,0.94,street,Le Chemin Noir 02260 Clairfontaine,02197_b013,G,LE CHEMIN NOIR,
431734573,00014,43173457300014,O,2000-06-01,NN,,,2016-01-12T00:22:38,true,3,,1,,RUE,DU MOULIN,02260,CLAIRFONTAINE,,,02197,,,,,,,,,,,,,,,,,,,2008-01-01,A,,,,,01.41Z,NAFRev2,N,4.009462,49.983423,0.94,housenumber,1 Rue du Moulin 02260 Clairfontaine,02197_0038_00001,G,1 RUE DU MOULIN,