siren,nic,siret,statutDiffusionEtablissement,dateCreationEtablissement,trancheEffectifsEtablissement,anneeEffectifsEtablissement,activitePrincipaleRegistreMetiersEtablissement,dateDernierTraitementEtablissement,etablissementSiege,nombrePeriodesEtablissement,complementAdresseEtablissement,numeroVoieEtablissement,indiceRepetitionEtablissement,typeVoieEtablissement,libelleVoieEtablissement,codePostalEtablissement,libelleCommuneEtablissement,libelleCommuneEtrangerEtablissement,distributionSpecialeEtablissement,codeCommuneEtablissement,codeCedexEtablissement,libelleCedexEtablissement,codePaysEtrangerEtablissement,libellePaysEtrangerEtablissement,complementAdresse2Etablissement,numeroVoie2Etablissement,indiceRepetition2Etablissement,typeVoie2Etablissement,libelleVoie2Etablissement,codePostal2Etablissement,libelleCommune2Etablissement,libelleCommuneEtranger2Etablissement,distributionSpeciale2Etablissement,codeCommune2Etablissement,codeCedex2Etablissement,libelleCedex2Etablissement,codePaysEtranger2Etablissement,libellePaysEtranger2Etablissement,dateDebut,etatAdministratifEtablissement,enseigne1Etablissement,enseigne2Etablissement,enseigne3Etablissement,denominationUsuelleEtablissement,activitePrincipaleEtablissement,nomenclatureActivitePrincipaleEtablissement,caractereEmployeurEtablissement,longitude,latitude,geo_score,geo_type,geo_adresse,geo_id,geo_ligne,geo_l4,geo_l5
210701082,00013,21070108200013,O,1983-03-01,02,2018,,2020-08-25T10:15:37,true,3,HOTEL DE VILLE,,,,,07160,JAUNAC,,,07108,,,,,,,,,,,,,,,,,,,2008-01-01,A,MAIRIE,,,,84.11Z,NAFRev2,N,4.399536,44.91951,0.32,street,Route De-la Chapelle 07160 Jaunac,07108_0039,D,ROUTE DE LA CHAPELLE,
210701082,00039,21070108200039,O,1992-01-01,NN,,,2008-01-04T18:24:32,false,3,MAIRIE,,,,,07160,JAUNAC,,,07108,,,,,,,,,,,,,,,,,,,2008-01-01,A,ZONE D ACTIVITE,,,,42.99Z,NAFRev2,N,4.399866,44.92011,0.9,street,Route de la Mairie 07160 Jaunac,07108_0047,D,ROUTE DE LA MAIRIE,
260702220,00013,26070222000013,O,1992-01-01,NN,,,2016-11-20T14:09:02,true,4,,,,,MAIRIE,07160,JAUNAC,,,07108,,,,,,,,,,,,,,,,,,,2016-01-01,F,CCAS,,,,88.99B,NAFRev2,N,4.399866,44.92011,0.9,street,Route de la Mairie 07160 Jaunac,07108_0047,G,ROUTE DE LA MAIRIE,
303576995,00011,30357699500011,O,1975-01-01,NN,,,,true,4,,,,,GUIGNEBERT MALAFOSSE,07160,JAUNAC,,,07108,,,,,,,,,,,,,,,,,,,2003-08-21,F,,,,,52.5Z,NAFRev1,N,4.396668,44.927099,0.49,street,Route de Guignebert 07160 Jaunac,07108_0044,G,ROUTE DE GUIGNEBERT,
307069245,00016,30706924500016,O,,NN,,,,true,1,,,,LD,GUIGNEBERT,07160,JAUNAC,,,07108,,,,,,,,,,,,,,,,,,,1989-06-30,F,,,,,55.60,NAP,N,4.396668,44.927099,0.91,street,Route de Guignebert 07160 Jaunac,07108_0044,G,ROUTE DE GUIGNEBERT,
336410105,00017,33641010500017,O,,,,,,true,1,,,,,,07160,JAUNAC,,,07108,,,,,,,,,,,,,,,,,,,1984-12-25,F,,,,,67.07,NAP,N,,,0,,,,,,
343727277,00018,34372727700018,O,1988-01-01,NN,,,2013-05-13T08:02:58,true,4,,,,,LE POIVRE,07160,JAUNAC,,,07108,,,,,,,,,,,,,,,,,,,2012-08-11,F,,,,,01.21Z,NAFRev2,N,4.405233,44.915881,0.64,street,Route du Poivre 07160 Jaunac,07108_0050,G,ROUTE DU POIVRE,
352315683,00073,35231568300073,O,2012-10-01,,,,2014-01-22T05:36:38,true,2,,,,,LE VILLAGE,07160,JAUNAC,,,07108,,,,,,,,,,,,,,,,,,,2013-12-15,F,,,,,46.19B,NAFRev2,N,4.400278,44.919656,0.67,street,Place-du Village 07160 Jaunac,07108_0051,G,PLACE DU VILLAGE,
352879894,00017,35287989400017,O,,NN,,,,true,1,,,,,LA GRANGE,07160,JAUNAC,,,07108,,,,,,,,,,,,,,,,,,,1991-09-30,F,,,,,01.57,NAP,N,4.399686,44.918763,0.91,street,Route de la Grange 07160 Jaunac,07108_0043,G,ROUTE DE LA GRANGE,
353811904,00039,35381190400039,O,1991-04-01,,,,,true,4,,,,,GUIGNEBERT,07160,JAUNAC,,,07108,,,,,,,,,,,,,,,,,,,1997-02-21,F,,,,,45.2A,NAF1993,N,4.396668,44.927099,0.91,street,Route de Guignebert 07160 Jaunac,07108_0044,G,ROUTE DE GUIGNEBERT,
379432123,00022,37943212300022,O,1998-08-01,01,2018,4399CZ,2020-08-25T10:16:20,true,8,,,,,PETIT LIEU,07160,JAUNAC,,,07108,,,,,,,,,,,,,,,,,,,2015-06-30,A,,,,,43.99C,NAFRev2,N,4.399017,44.919588,0.93,locality,Petit Lieu 07160 Jaunac,07108_b013,G,PETIT LIEU,
385236518,00010,38523651800010,O,1991-10-01,NN,,,2019-02-13T14:56:04,true,4,,,,,LA GRANGE,07160,JAUNAC,,,07108,,,,,,,,,,,,,,,,,,,2019-02-13,A,,,,,01.45Z,NAFRev2,N,4.399686,44.918763,0.91,street,Route de la Grange 07160 Jaunac,07108_0043,G,ROUTE DE LA GRANGE,
407734375,00014,40773437500014,O,1980-01-01,NN,,,,true,4,,,,,ESTOURLINCHE,07160,JAUNAC,,,07108,,,,,,,,,,,,,,,,,,,2002-09-30,F,,,,,01.1A,NAF1993,N,,,0,,,,,,
407734383,00018,40773438300018,O,1992-07-01,NN,,,2008-01-04T20:59:00,true,4,,,,,LA BORNE,07160,JAUNAC,,,07108,,,,,,,,,,,,,,,,,,,2008-01-01,A,,,,,01.11Z,NAFRev2,N,3.8892283,45.0499926,0.89,poi.river,La Borne (Rivière) Aiguilhe,https://osm.org/relation/4425295,G,,
407734391,00011,40773439100011,O,1996-01-01,NN,,,,true,4,,,,,BRION,07160,JAUNAC,,,07108,,,,,,,,,,,,,,,,,,,2001-04-27,F,,,,,01.1A,NAF1993,N,4.390401,44.916667,0.9,street,Route de Brion 07160 Jaunac,07108_0038,G,ROUTE DE BRION,
410876841,00017,41087684100017,O,1981-01-01,00,2018,,2020-08-25T10:39:11,true,3,,,,,LE BOUCHET RAVAUX,07160,JAUNAC,,,07108,,,,,,,,,,,,,,,,,,,2008-01-01,A,,,,,01.45Z,NAFRev2,N,4.389416,44.927775,0.82,street,Route de Bouchet-ravaux 07160 Jaunac,07108_0037,G,ROUTE DE BOUCHET RAVAUX,
434571329,00011,43457132900011,O,2000-01-01,01,2018,,2020-08-25T10:23:07,true,4,,,,,,07160,JAUNAC,,,07108,,,,,,,,,,,,,,,,,,,2008-01-01,A,,,,,78.30Z,NAFRev2,O,,,0,,,,,,
438614174,00029,43861417400029,O,2011-03-23,,,,2012-01-10T04:55:31,true,2,,,,,BRION,07160,JAUNAC,,,07108,,,,,,,,,,,,,,,,,,,2011-12-31,F,,,,,01.13Z,NAFRev2,N,4.390401,44.916667,0.9,street,Route de Brion 07160 Jaunac,07108_0038,G,ROUTE DE BRION,
442198115,00010,44219811500010,O,2002-01-26,NN,,,2008-01-04T21:36:58,true,3,CHEZ M. ROUX JEAN-BERNARD,,,,LE VILLAGE,07160,JAUNAC,,,07108,,,,,,,,,,,,,,,,,,,2008-01-01,A,,,,,90.01Z,NAFRev2,N,4.400278,44.919656,0.67,street,Place-du Village 07160 Jaunac,07108_0051,G,PLACE DU VILLAGE,
443588264,00012,44358826400012,O,2002-10-01,NN,,,2008-01-04T22:06:39,true,3,,,,,ESTOURLINCHE,07160,JAUNAC,,,07108,,,,,,,,,,,,,,,,,,,2008-01-01,A,,,,,01.41Z,NAFRev2,N,,,0,,,,,,
490054483,00022,49005448300022,O,2016-11-01,,,4334ZC,2016-11-16T05:41:47,false,1,,40,,RTE,DE MALAFOSSE,07160,JAUNAC,,,07108,,,,,,,,,,,,,,,,,,,2016-11-01,A,,,,,43.31Z,NAFRev2,N,4.398383,44.923943,0.84,housenumber,40 Route de Malafosse 07160 Jaunac,07108_0048_00040,G,40 ROUTE DE MALAFOSSE,
510756539,00019,51075653900019,O,2009-03-01,,,,2012-11-10T00:33:44,true,3,,,,,GUIGNEBERT,07160,JAUNAC,,,07108,,,,,,,,,,,,,,,,,,,2011-02-28,A,,,,,96.09Z,NAFRev2,N,4.396668,44.927099,0.91,street,Route de Guignebert 07160 Jaunac,07108_0044,G,ROUTE DE GUIGNEBERT,
513209379,00017,51320937900017,O,2009-05-06,,,1039BP,2017-09-22T19:24:33,true,2,,,,,LA GRANGE,07160,JAUNAC,,,07108,,,,,,,,,,,,,,,,,,,2016-12-31,F,,,,,46.39B,NAFRev2,N,4.399686,44.918763,0.91,street,Route de la Grange 07160 Jaunac,07108_0043,G,ROUTE DE LA GRANGE,
513578153,00019,51357815300019,O,2009-07-06,,,,2019-09-17T15:47:03,false,3,GUIGNEBERT,1405,,RTE,DE SAINT MARTIN,07160,JAUNAC,,,07108,,,,,,,,,,,,,,,,,,,2019-08-22,A,,,,,82.19Z,NAFRev2,N,4.396542,44.92769,0.85,housenumber,1405 Route de Saint Martin de Valamas 07160 Jaunac,07108_hyb01d_01405,G,1405 RTE DE ST MARTIN DE VALAMAS,
520804568,00019,52080456800019,O,2010-03-01,01,2018,4399CZ,2020-08-25T10:35:02,true,1,,,,,LE GRAND LIEU,07160,JAUNAC,,,07108,,,,,,,,,,,,,,,,,,,2010-03-01,A,,,,,43.99C,NAFRev2,N,4.401097,44.921828,0.93,locality,Le Grand Lieu 07160 Jaunac,07108_b010,G,LE GRAND LIEU,
529415606,00019,52941560600019,O,2011-01-01,,,,2016-08-14T03:32:55,true,1,,,,,GUIGNEBERT,07160,JAUNAC,,,07108,,,,,,,,,,,,,,,,,,,2011-01-01,F,,,,,68.31Z,NAFRev2,N,4.396668,44.927099,0.91,street,Route de Guignebert 07160 Jaunac,07108_0044,G,ROUTE DE GUIGNEBERT,
776245839,00019,77624583900019,O,,NN,,,,true,1,,,,LD,GUIGNEBERT,07160,JAUNAC,,,07108,,,,,,,,,,,,,,,,,,,1988-12-31,F,,,,,55.71,NAP,N,4.396668,44.927099,0.91,street,Route de Guignebert 07160 Jaunac,07108_0044,G,ROUTE DE GUIGNEBERT,
789222965,00038,78922296500038,O,2014-03-07,,,,2016-12-02T08:43:46,true,2,,,,ALL,LE GRAND LIEU,07160,JAUNAC,,,07108,,,,,,,,,,,,,,,,,,,2014-09-07,F,,,,,47.99A,NAFRev2,N,4.401097,44.921828,0.75,locality,Le Grand Lieu 07160 Jaunac,07108_b010,G,LE GRAND LIEU,
791730005,00018,79173000500018,O,2013-03-11,,,,2013-08-09T08:27:29,true,2,,,,,LOTISSEMENT LE COTEAU,07160,JAUNAC,,,07108,,,,,,,,,,,,,,,,,,,2013-07-23,F,,,,,62.01Z,NAFRev2,N,-1.7680102,46.6990799,0.89,poi.residential,Lotissement Le Coteau (Zone résidentielle) Coëx,https://osm.org/way/577421952,G,,
792940306,00014,79294030600014,O,2013-05-02,,,,2013-05-13T08:02:58,true,1,,,,,LE POIVRE ET LE VILLAGE JAUNAC,07160,JAUNAC,,,07108,,,,,,,,,,,,,,,,,,,2013-05-02,A,,,,,01.24Z,NAFRev2,N,4.405233,44.915881,0.47,street,Route du Poivre 07160 Jaunac,07108_0050,G,ROUTE DU POIVRE,
804018521,00018,80401852100018,O,2014-08-10,,,,2015-10-09T03:53:57,true,2,,,,RTE,DE MALAFOSSE,07160,JAUNAC,,,07108,,,,,,,,,,,,,,,,,,,2015-08-22,F,,,,,43.39Z,NAFRev2,N,4.398383,44.923943,0.82,street,Route de Malafosse 07160 Jaunac,07108_0048,G,ROUTE DE MALAFOSSE,
805170917,00019,80517091700019,O,2014-10-06,,,,2014-10-15T13:58:52,true,1,,,,,BRION,07160,JAUNAC,,,07108,,,,,,,,,,,,,,,,,,,2014-10-06,A,,,,,68.20B,NAFRev2,N,4.390401,44.916667,0.9,street,Route de Brion 07160 Jaunac,07108_0038,G,ROUTE DE BRION,
809102122,00011,80910212200011,O,2015-01-14,,,,2018-08-03T16:24:07,true,1,,3110,,RTE,DE BRION,07160,JAUNAC,,,07108,,,,,,,,,,,,,,,,,,,2015-01-14,A,,,,,55.20Z,NAFRev2,N,4.386046,44.913447,0.83,housenumber,3110 Route de Brion 07160 Jaunac,07108_0038_03110,G,3110 ROUTE DE BRION,
820055671,00011,82005567100011,O,2016-03-06,,,,2016-05-03T03:59:44,true,1,LE PETIT LIEU,30,,RUE,HENRIETTE ROCHE,07160,JAUNAC,,,07108,,,,,,,,,,,,,,,,,,,2016-03-06,A,,,,,86.90D,NAFRev2,N,4.399155,44.91958,0.77,housenumber,30 Place Henriette Roche 07160 Jaunac,07108_0045_00030,G,30 PLACE HENRIETTE ROCHE,
848389706,00013,84838970600013,O,2019-02-01,,,8211ZP,2019-02-20T09:15:13,true,1,,40,,RTE,MALAFOSSE,07160,JAUNAC,,,07108,,,,,,,,,,,,,,,,,,,2019-02-01,A,,,,,82.11Z,NAFRev2,N,4.398383,44.923943,0.82,housenumber,40 Route de Malafosse 07160 Jaunac,07108_0048_00040,G,40 ROUTE DE MALAFOSSE,
879841765,00016,87984176500016,O,2020-01-01,,,,2020-01-17T03:57:33,true,1,,275,,RTE,DE LA MAIRIE,07160,JAUNAC,,,07108,,,,,,,,,,,,,,,,,,,2020-01-01,A,,,,,47.91A,NAFRev2,N,4.4002,44.922195,0.84,housenumber,275 Route de la Mairie 07160 Jaunac,07108_0047_00275,G,275 ROUTE DE LA MAIRIE,
884228602,00014,88422860200014,O,2020-06-11,,,,2020-08-05T10:33:34,true,1,,105,,RTE,DU PETIT LIEU,07160,JAUNAC,,,07108,,,,,,,,,,,,,,,,,,,2020-06-11,A,,,,NV2E,71.12B,NAFRev2,N,4.399238,44.918456,0.85,housenumber,105 Route du Petit Lieu 07160 Jaunac,07108_0049_00105,G,105 ROUTE DU PETIT LIEU,
887921807,00012,88792180700012,O,2020-07-22,,,,2020-08-10T09:05:51,true,1,,205,,RTE,DU PETIT LIEU,07160,JAUNAC,,,07108,,,,,,,,,,,,,,,,,,,2020-07-22,A,,,,,68.20B,NAFRev2,N,4.398597,44.919487,0.85,housenumber,205 Route du Petit Lieu 07160 Jaunac,07108_0049_00205,G,205 ROUTE DU PETIT LIEU,
