siren,nic,siret,statutDiffusionEtablissement,dateCreationEtablissement,trancheEffectifsEtablissement,anneeEffectifsEtablissement,activitePrincipaleRegistreMetiersEtablissement,dateDernierTraitementEtablissement,etablissementSiege,nombrePeriodesEtablissement,complementAdresseEtablissement,numeroVoieEtablissement,indiceRepetitionEtablissement,typeVoieEtablissement,libelleVoieEtablissement,codePostalEtablissement,libelleCommuneEtablissement,libelleCommuneEtrangerEtablissement,distributionSpecialeEtablissement,codeCommuneEtablissement,codeCedexEtablissement,libelleCedexEtablissement,codePaysEtrangerEtablissement,libellePaysEtrangerEtablissement,complementAdresse2Etablissement,numeroVoie2Etablissement,indiceRepetition2Etablissement,typeVoie2Etablissement,libelleVoie2Etablissement,codePostal2Etablissement,libelleCommune2Etablissement,libelleCommuneEtranger2Etablissement,distributionSpeciale2Etablissement,codeCommune2Etablissement,codeCedex2Etablissement,libelleCedex2Etablissement,codePaysEtranger2Etablissement,libellePaysEtranger2Etablissement,dateDebut,etatAdministratifEtablissement,enseigne1Etablissement,enseigne2Etablissement,enseigne3Etablissement,denominationUsuelleEtablissement,activitePrincipaleEtablissement,nomenclatureActivitePrincipaleEtablissement,caractereEmployeurEtablissement,longitude,latitude,geo_score,geo_type,geo_adresse,geo_id,geo_ligne,geo_l4,geo_l5
210702742,00011,21070274200011,O,1983-03-01,02,2018,,2020-08-25T10:15:38,true,3,,,,,ALLIANDRE,07190,SAINT-MAURICE-EN-CHALENCON,,,07274,,,,,,,,,,,,,,,,,,,2008-01-01,A,MAIRIE,,,,84.11Z,NAFRev2,O,4.589219,44.858499,0.56,street,Alyandre 07190 Saint-Maurice-en-Chalencon,07274_pdrk9y,G,ALYANDRE,
210702742,00045,21070274200045,O,1997-01-01,NN,,,2019-11-14T14:00:15,false,4,MAIRIE,,,,,07190,SAINT-MAURICE-EN-CHALENCON,,,07274,,,,,,,,,,,,,,,,,,,2008-01-01,F,SERVICE DE L'EAU,,,,36.00Z,NAFRev2,N,,,0,,,,,,
260702089,00012,26070208900012,O,1992-01-01,NN,,,2019-11-14T14:00:15,true,5,MAIRIE,,,,ALLIANDRE,07190,SAINT-MAURICE-EN-CHALENCON,,,07274,,,,,,,,,,,,,,,,,,,2016-05-12,F,,,,,88.99B,NAFRev2,N,4.589219,44.858499,0.56,street,Alyandre 07190 Saint-Maurice-en-Chalencon,07274_pdrk9y,G,ALYANDRE,
324661974,00042,32466197400042,O,2019-04-01,,,,2019-11-14T14:00:15,true,1,,,,,LE BUIS,07190,SAINT-MAURICE-EN-CHALENCON,,,07274,,,,,,,,,,,,,,,,,,,2019-04-01,A,,,,,47.81Z,NAFRev2,N,4.587878,44.846704,0.57,locality,La Plaine du Buis 07190 Saint-Maurice-en-Chalencon,07274_b064,G,LA PLAINE DU BUIS,
333687226,00048,33368722600048,O,2006-04-01,,,,2019-11-14T14:00:15,true,3,ALYANDRE,,,CHE,DES ALYSEES,07190,SAINT-MAURICE-EN-CHALENCON,,,07274,,,,,,,,,,,,,,,,,,,2008-03-31,F,,,,,45.20A,NAFRev2,N,4.589219,44.858499,0.47,street,Alyandre 07190 Saint-Maurice-en-Chalencon,07274_pdrk9y,D,ALYANDRE,
334786183,00023,33478618300023,O,2010-04-01,,,,2019-11-14T14:00:15,true,2,TROUILLER,,,,,07190,SAINT-MAURICE-EN-CHALENCON,,,07274,,,,,,,,,,,,,,,,,,,2010-09-25,F,,,,,47.81Z,NAFRev2,N,,,0,,,,,,
336710223,00015,33671022300015,O,,NN,,,2019-11-14T14:00:15,true,1,,,,,,07190,SAINT-MAURICE-EN-CHALENCON,,,07274,,,,,,,,,,,,,,,,,,,,F,,,,,64.48,NAP,N,,,0,,,,,,
338261191,00013,33826119100013,O,,NN,,,2019-11-14T14:00:15,true,1,,,,,CEILLERON,07190,SAINT-MAURICE-EN-CHALENCON,,,07274,,,,,,,,,,,,,,,,,,,1987-09-30,F,,,,,62.46,NAP,N,,,0,,,,,,
340645894,00023,34064589400023,O,1987-03-01,NN,,,2019-11-14T14:00:15,true,3,,,,,,07190,SAINT-MAURICE-EN-CHALENCON,,,07274,,,,,,,,,,,,,,,,,,,2008-01-01,A,,,,,01.43Z,NAFRev2,N,,,0,,,,,,
349167015,00016,34916701500016,O,,NN,,,2019-11-14T14:00:15,true,1,,,,,CEILLERON,07190,SAINT-MAURICE-EN-CHALENCON,,,07274,,,,,,,,,,,,,,,,,,,1989-04-17,F,,,,,62.46,NAP,N,,,0,,,,,,
380627042,00019,38062704200019,O,1991-01-11,NN,,,2019-11-14T14:00:15,true,4,,,,,LE BUIS,07190,SAINT-MAURICE-EN-CHALENCON,,,07274,,,,,,,,,,,,,,,,,,,1995-12-25,F,,,,,45.3A,NAF1993,N,4.587878,44.846704,0.57,locality,La Plaine du Buis 07190 Saint-Maurice-en-Chalencon,07274_b064,G,LA PLAINE DU BUIS,
390441038,00044,39044103800044,O,2013-04-01,,,,2019-11-14T14:00:15,true,1,,,,,LIEU-DIT LE SERRE,07190,SAINT-MAURICE-EN-CHALENCON,,,07274,,,,,,,,,,,,,,,,,,,2013-04-01,A,,,,,62.02A,NAFRev2,N,4.5748,44.840756,0.6,locality,Serre Chaud 07190 Saint-Maurice-en-Chalencon,07274_b078,G,SERRE CHAUD,
391136900,00019,39113690000019,O,1979-01-01,NN,,,2019-11-14T14:00:15,true,4,,,,,PALIX,07190,SAINT-MAURICE-EN-CHALENCON,,,07274,,,,,,,,,,,,,,,,,,,2014-09-30,F,,,,,01.24Z,NAFRev2,N,,,0,,,,,,
400111845,00030,40011184500030,O,2002-02-01,NN,,,2019-11-14T14:00:15,false,5,,,,,ROUILLER,07190,SAINT-MAURICE-EN-CHALENCON,,,07274,,,,,,,,,,,,,,,,,,,2009-01-01,F,,,,,43.91A,NAFRev2,O,3.1344749,45.4465184,0.89,poi.stream,Ruisseau de Rouiller Saint-Hérent,https://osm.org/way/393273051,G,,
400314670,00011,40031467000011,O,,NN,,,2019-11-14T14:00:15,true,1,,,,,LA SERRE,07190,SAINT-MAURICE-EN-CHALENCON,,,07274,,,,,,,,,,,,,,,,,,,1996-02-13,F,,,,,29.5N,NAF1993,N,4.5748,44.840756,0.6,locality,Serre Chaud 07190 Saint-Maurice-en-Chalencon,07274_b078,G,SERRE CHAUD,
403613821,00046,40361382100046,O,2018-10-01,,,,2019-11-14T14:00:15,true,1,,,,,LE BUIS,07190,SAINT-MAURICE-EN-CHALENCON,,,07274,,,,,,,,,,,,,,,,,,,2018-10-01,A,,,,,68.20B,NAFRev2,N,4.587878,44.846704,0.57,locality,La Plaine du Buis 07190 Saint-Maurice-en-Chalencon,07274_b064,G,LA PLAINE DU BUIS,
407742998,00013,40774299800013,O,1980-01-01,NN,,,2019-11-14T14:00:15,true,1,,,,,,07190,SAINT-MAURICE-EN-CHALENCON,,,07274,,,,,,,,,,,,,,,,,,,2000-02-29,F,,,,,01.1A,NAF1993,N,,,0,,,,,,
407743004,00019,40774300400019,O,1980-01-01,NN,,,2019-11-14T14:00:15,true,1,,,,,,07190,SAINT-MAURICE-EN-CHALENCON,,,07274,,,,,,,,,,,,,,,,,,,2001-09-30,F,,,,,01.3Z,NAF1993,N,,,0,,,,,,
407743012,00012,40774301200012,O,1980-05-01,NN,,,2019-11-14T14:00:15,true,3,,,,,LA NOVE,07190,SAINT-MAURICE-EN-CHALENCON,,,07274,,,,,,,,,,,,,,,,,,,2008-01-01,A,,,,,01.24Z,NAFRev2,N,4.587878,44.846704,0.33,locality,La Plaine du Buis 07190 Saint-Maurice-en-Chalencon,07274_b064,G,LA PLAINE DU BUIS,
407743020,00015,40774302000015,O,1984-05-03,NN,,,2019-11-14T14:00:15,false,5,TROUILLER,,,,,07190,SAINT-MAURICE-EN-CHALENCON,,,07274,,,,,,,,,,,,,,,,,,,2018-06-11,F,,,,,01.43Z,NAFRev2,N,,,0,,,,,,
407743020,00023,40774302000023,O,2015-05-11,,,,2019-11-14T14:00:15,false,1,TROUILLER,,,,,07190,SAINT-MAURICE-EN-CHALENCON,,,07274,,,,,,,,,,,,,,,,,,,2015-05-11,A,,,,,47.19B,NAFRev2,N,,,0,,,,,,
407743038,00017,40774303800017,O,1986-09-01,NN,,,2019-11-14T14:00:15,true,4,DOMAINE DU SERRE,,,,,07190,SAINT-MAURICE-EN-CHALENCON,,,07274,,,,,,,,,,,,,,,,,,,2017-11-04,F,,,,,01.43Z,NAFRev2,N,4.5748,44.840756,0.39,locality,Serre Chaud 07190 Saint-Maurice-en-Chalencon,07274_b078,D,SERRE CHAUD,
407743046,00010,40774304600010,O,1982-01-01,NN,,,2019-11-14T14:00:15,true,3,VILLAGE,,,,,07190,SAINT-MAURICE-EN-CHALENCON,,,07274,,,,,,,,,,,,,,,,,,,2008-01-01,A,,,,,01.50Z,NAFRev2,N,,,0,,,,,,
407757228,00017,40775722800017,O,1980-12-31,NN,,,2019-11-14T14:00:15,true,3,,,,,,07190,SAINT-MAURICE-EN-CHALENCON,,,07274,,,,,,,,,,,,,,,,,,,2008-01-01,A,,,,,01.11Z,NAFRev2,N,,,0,,,,,,
411823198,00014,41182319800014,O,1996-01-01,NN,,,2019-11-14T14:00:15,true,3,,,,,MONTEL,07190,SAINT-MAURICE-EN-CHALENCON,,,07274,,,,,,,,,,,,,,,,,,,2008-01-01,A,,,,,01.24Z,NAFRev2,N,4.8015748,45.7733885,0.9,poi.park,Parc Montel Lyon,https://osm.org/way/155061929,G,,
412204547,00019,41220454700019,O,1980-01-01,NN,,,2019-11-14T14:00:15,true,5,,,,,SERRE,07190,SAINT-MAURICE-EN-CHALENCON,,,07274,,,,,,,,,,,,,,,,,,,2019-01-04,F,,,,,01.11Z,NAFRev2,N,4.5748,44.840756,0.91,locality,Serre Chaud 07190 Saint-Maurice-en-Chalencon,07274_b078,G,SERRE CHAUD,
412647240,00016,41264724000016,O,,NN,,,2019-11-14T14:00:15,true,1,,,,,DOULET,07190,SAINT-MAURICE-EN-CHALENCON,,,07274,,,,,,,,,,,,,,,,,,,1996-06-30,F,,,,,01.1G,NAF1993,N,4.6405202,44.8356466,0.88,poi.stream,Ruisseau de Doulet Saint-Michel-de-Chabrillanoux,https://osm.org/way/445491347,G,,
417494580,00018,41749458000018,O,1998-02-02,NN,,,2019-11-14T14:00:15,true,4,,,,,TROUILLER,07190,SAINT-MAURICE-EN-CHALENCON,,,07274,,,,,,,,,,,,,,,,,,,2014-10-01,F,,,,,82.99Z,NAFRev2,N,4.399048,45.2311993,0.88,poi.pitch,Jean Trouiller (Terrain de sport) Riotord,https://osm.org/way/235212168,G,,
417650892,00017,41765089200017,O,1998-01-01,NN,,,2019-11-14T14:00:15,true,3,,,,,TROUILLER,07190,SAINT-MAURICE-EN-CHALENCON,,,07274,,,,,,,,,,,,,,,,,,,2008-01-01,A,,,,,68.32A,NAFRev2,N,4.399048,45.2311993,0.88,poi.pitch,Jean Trouiller (Terrain de sport) Riotord,https://osm.org/way/235212168,G,,
418514642,00044,41851464200044,O,2015-10-23,,,4332AA,2020-01-13T03:38:54,true,5,,,,HAM,LE CHASTELARD,07190,SAINT-MAURICE-EN-CHALENCON,,,07274,,,,,,,,,,,,,,,,,,,2020-01-06,A,,,,MD10,43.32A,NAFRev2,O,6.136144,45.685669,0.77,poi.post_office,Le Châtelard (Bureau de poste) Le Châtelard,https://osm.org/way/180895563,G,,
419126214,00016,41912621400016,O,1996-10-01,NN,,,2019-11-14T14:00:15,true,3,,,,,LE PETIT RIAS,07190,SAINT-MAURICE-EN-CHALENCON,,,07274,,,,,,,,,,,,,,,,,,,2007-06-15,F,,,,,01.1A,NAFRev1,N,4.5913,44.869137,0.75,locality,Petit Rias 07190 Saint-Maurice-en-Chalencon,07274_b059,G,PETIT RIAS,
422628701,00027,42262870100027,O,2004-07-01,,,,2019-11-14T14:00:15,true,4,,,,,CELLERON,07190,SAINT-MAURICE-EN-CHALENCON,,,07274,,,,,,,,,,,,,,,,,,,2006-12-31,F,,,,,74.2C,NAFRev1,N,,,0,,,,,,
427537402,00013,42753740200013,O,1982-01-01,NN,,,2019-11-14T14:00:15,true,4,,,,,,07190,SAINT-MAURICE-EN-CHALENCON,,,07274,,,,,,,,,,,,,,,,,,,2008-01-01,F,,,,,01.21Z,NAFRev2,N,,,0,,,,,,
429025034,00027,42902503400027,O,2014-01-01,,,,2019-11-14T14:00:15,true,1,,,,,QUARTIER ALYANDRE,07190,SAINT-MAURICE-EN-CHALENCON,,,07274,,,,,,,,,,,,,,,,,,,2014-01-01,A,,,,,43.21A,NAFRev2,N,4.589503,44.858571,0.93,street,Quartier Alyandre 07190 Saint-Maurice-en-Chalencon,07274_eqq8es,G,QUARTIER ALYANDRE,
430088823,00017,43008882300017,O,2000-02-24,NN,,,2019-11-14T14:00:15,true,3,LA C0L0MBE,,,,,07190,SAINT-MAURICE-EN-CHALENCON,,,07274,,,,,,,,,,,,,,,,,,,2005-12-31,F,,,,,01.3Z,NAFRev1,N,,,0,,,,,,
439192782,00019,43919278200019,O,2001-10-01,NN,,,2019-11-14T14:00:15,true,3,,,,,VAL,07190,SAINT-MAURICE-EN-CHALENCON,,,07274,,,,,,,,,,,,,,,,,,,2006-12-31,F,,,,,01.3Z,NAFRev1,N,6.0055,43.1403365,0.88,poi.hotel,Val'Hôtel La Valette-du-Var,https://osm.org/way/147693336,G,,
439814666,00020,43981466600020,O,2012-01-02,00,2018,4312AZ,2020-08-25T10:26:44,true,4,,,,,LE BUIS,07190,SAINT-MAURICE-EN-CHALENCON,,,07274,,,,,,,,,,,,,,,,,,,2018-10-31,F,,,,,43.12A,NAFRev2,N,4.587878,44.846704,0.57,locality,La Plaine du Buis 07190 Saint-Maurice-en-Chalencon,07274_b064,G,LA PLAINE DU BUIS,
440619658,00014,44061965800014,O,2002-01-02,01,2018,4334ZC,2020-08-25T10:27:44,true,3,,,,LD,LES TOURTOUX,07190,SAINT-MAURICE-EN-CHALENCON,,,07274,,,,,,,,,,,,,,,,,,,2008-01-01,A,,,,,43.34Z,NAFRev2,O,,,0,,,,,,
442821971,00037,44282197100037,O,2014-07-09,,,,2019-11-14T14:00:15,true,1,,,,,MOULINAS,07190,SAINT-MAURICE-EN-CHALENCON,,,07274,,,,,,,,,,,,,,,,,,,2014-07-09,A,,,,,68.20B,NAFRev2,N,4.5615723,44.8528776,0.89,poi,Pont de Moulinas Gluiras,https://osm.org/way/171961275,G,,
445245822,00017,44524582200017,O,2002-01-01,NN,,,2019-11-14T14:00:15,true,3,,,,,LE BUIS,07190,SAINT-MAURICE-EN-CHALENCON,,,07274,,,,,,,,,,,,,,,,,,,2008-01-01,A,,,,,01.24Z,NAFRev2,N,4.587878,44.846704,0.57,locality,La Plaine du Buis 07190 Saint-Maurice-en-Chalencon,07274_b064,G,LA PLAINE DU BUIS,
480271592,00010,48027159200010,O,2005-01-03,,,,2019-11-14T14:00:15,true,2,LE CHASTELARD,,,,,07190,SAINT-MAURICE-EN-CHALENCON,,,07274,,,,,,,,,,,,,,,,,,,2008-01-01,A,,,,,01.24Z,NAFRev2,N,,,0,,,,,,
482710993,00015,48271099300015,O,2005-06-01,,,,2019-11-14T14:00:15,true,2,LE VILLAGE,,,,,07190,SAINT-MAURICE-EN-CHALENCON,,,07274,,,,,,,,,,,,,,,,,,,2008-01-01,A,,,,,01.42Z,NAFRev2,N,,,0,,,,,,
488186719,00016,48818671900016,O,2005-12-29,,,,2019-11-14T14:00:15,false,3,,,,,QUARTIER ALYANDRE,07190,SAINT-MAURICE-EN-CHALENCON,,,07274,,,,,,,,,,,,,,,,,,,2012-01-01,F,,,,,68.20B,NAFRev2,N,4.589503,44.858571,0.93,street,Quartier Alyandre 07190 Saint-Maurice-en-Chalencon,07274_eqq8es,G,QUARTIER ALYANDRE,
508793346,00018,50879334600018,O,2009-01-01,,,,2019-11-14T14:00:15,true,1,LE SERRE,,,,,07190,SAINT-MAURICE-EN-CHALENCON,,,07274,,,,,,,,,,,,,,,,,,,2009-01-01,F,,,,,01.13Z,NAFRev2,N,4.5748,44.840756,0.6,locality,Serre Chaud 07190 Saint-Maurice-en-Chalencon,07274_b078,D,SERRE CHAUD,
509741328,00025,50974132800025,O,2015-07-01,,,,2019-11-14T14:00:15,true,1,,,,,BERANGER,07190,SAINT-MAURICE-EN-CHALENCON,,,07274,,,,,,,,,,,,,,,,,,,2015-07-01,A,LA FERME DE BERANGER,,,,01.13Z,NAFRev2,N,4.583961,44.869997,0.4,locality,Grange de Prêle 07190 Saint-Maurice-en-Chalencon,07274_b038,G,GRANGE DE PRELE,
509896445,00012,50989644500012,O,2009-01-01,,,,2019-11-14T14:00:15,true,2,,,,,LES LATTES,07190,SAINT-MAURICE-EN-CHALENCON,,,07274,,,,,,,,,,,,,,,,,,,2011-09-30,F,,,,,70.22Z,NAFRev2,N,5.5427756,45.0106275,0.89,poi.station,Les Lattes (Télécabine) Corrençon-en-Vercors,https://osm.org/node/505106275,G,,
519838270,00022,51983827000022,O,2020-02-06,,,,2020-03-05T08:23:35,true,1,ALYANDRE,,,CHE,DES ALIZEES,07190,SAINT-MAURICE-EN-CHALENCON,,,07274,,,,,,,,,,,,,,,,,,,2020-02-06,A,,,,ENTREPRISE D'ELAGAGE VALERO,81.30Z,NAFRev2,N,4.589219,44.858499,0.45,street,Alyandre 07190 Saint-Maurice-en-Chalencon,07274_pdrk9y,D,ALYANDRE,
522222405,00014,52222240500014,O,2009-05-07,,,,2019-11-14T14:00:15,true,1,,,,LD,CHAVALON,07190,SAINT-MAURICE-EN-CHALENCON,,,07274,,,,,,,,,,,,,,,,,,,2009-05-07,A,,,,,01.13Z,NAFRev2,N,4.5748,44.840756,0.4,locality,Serre Chaud 07190 Saint-Maurice-en-Chalencon,07274_b078,G,SERRE CHAUD,
524800653,00015,52480065300015,O,2010-09-10,,,,2019-11-14T14:00:15,true,1,LES ALIZES,,,,,07190,SAINT-MAURICE-EN-CHALENCON,,,07274,,,,,,,,,,,,,,,,,,,2010-09-10,A,,,,,96.04Z,NAFRev2,N,,,0,,,,,,
531220713,00014,53122071300014,O,2011-05-01,,,,2019-11-14T14:00:15,true,2,,,,,LE GRAND RIAS,07190,SAINT-MAURICE-EN-CHALENCON,,,07274,,,,,,,,,,,,,,,,,,,2018-07-06,F,,,,,74.90B,NAFRev2,N,4.590725,44.867294,0.75,locality,Grand Rias 07190 Saint-Maurice-en-Chalencon,07274_b037,G,GRAND RIAS,
533969572,00023,53396957200023,O,1900-01-01,,,,2019-11-14T14:00:15,true,2,,,,,BONORE,07190,SAINT-MAURICE-EN-CHALENCON,,,07274,,,,,,,,,,,,,,,,,,,2014-03-01,A,,,,,70.10Z,NAFRev2,N,,,0,,,,,,
534415914,00017,53441591400017,O,2011-08-25,,,,2019-11-14T14:00:15,true,1,,,,,LE CHASTELARD,07190,SAINT-MAURICE-EN-CHALENCON,,,07274,,,,,,,,,,,,,,,,,,,2011-08-25,A,,,,,68.20B,NAFRev2,N,6.136144,45.685669,0.77,poi.post_office,Le Châtelard (Bureau de poste) Le Châtelard,https://osm.org/way/180895563,G,,
538874066,00011,53887406600011,O,2012-01-15,,,4339ZZ,2019-11-14T14:00:15,true,2,,,,,TROUILLER,07190,SAINT-MAURICE-EN-CHALENCON,,,07274,,,,,,,,,,,,,,,,,,,2014-07-31,F,,,,,43.39Z,NAFRev2,N,4.399048,45.2311993,0.88,poi.pitch,Jean Trouiller (Terrain de sport) Riotord,https://osm.org/way/235212168,G,,
750672719,00010,75067271900010,O,2012-03-15,,,,2019-11-14T14:00:15,true,2,,,,,TROUILLER,07190,SAINT-MAURICE-EN-CHALENCON,,,07274,,,,,,,,,,,,,,,,,,,2013-03-27,F,,,,,43.91A,NAFRev2,N,4.399048,45.2311993,0.88,poi.pitch,Jean Trouiller (Terrain de sport) Riotord,https://osm.org/way/235212168,G,,
751923103,00012,75192310300012,O,2012-06-01,01,2018,,2020-08-25T10:54:37,true,4,,,,,PONT DU MOULINAS,07190,SAINT-MAURICE-EN-CHALENCON,,,07274,,,,,,,,,,,,,,,,,,,2017-04-25,A,JL ACCOMPAGNEMENT,,,JL ACCOMPAGNEMENT,49.41B,NAFRev2,N,4.563928,44.853238,0.89,poi.information,Pont du Moulinas (Informations) Saint-Maurice-en-Chalencon,https://osm.org/node/2912104089,G,,
776268492,00019,77626849200019,O,,,,,2019-11-14T14:00:15,true,1,,,,,,07190,SAINT-MAURICE-EN-CHALENCON,,,07274,,,,,,,,,,,,,,,,,,,1984-12-25,F,,,,,55.60,NAP,N,,,0,,,,,,
776268500,00019,77626850000019,O,,NN,,,2019-11-14T14:00:15,true,1,,,,LD,LA ROCHE,07190,SAINT-MAURICE-EN-CHALENCON,,,07274,,,,,,,,,,,,,,,,,,,1989-08-31,F,,,,,57.03,NAP,N,4.587878,44.846704,0.31,locality,La Plaine du Buis 07190 Saint-Maurice-en-Chalencon,07274_b064,G,LA PLAINE DU BUIS,
781609011,00015,78160901100015,O,,,,,2019-11-14T14:00:15,true,1,,,,LD,LA ROCHE SAINT MAURICE,07190,SAINT-MAURICE-EN-CHALENCON,,,07274,,,,,,,,,,,,,,,,,,,1984-12-25,F,,,,,79.06,NAP,N,4.587878,44.846704,0.65,locality,La Plaine du Buis 07190 Saint-Maurice-en-Chalencon,07274_b064,G,LA PLAINE DU BUIS,
790044499,00016,79004449900016,O,2013-01-03,,,4333ZZ,2019-11-14T14:00:15,true,2,,,,,QUARTIER PALIX,07190,SAINT-MAURICE-EN-CHALENCON,,,07274,,,,,,,,,,,,,,,,,,,2018-12-13,F,CARRELAGE SAINT MAURICE EN CHALENCO,,,CARRELAGE SAINT MAURICE EN CHALENCON,43.33Z,NAFRev2,N,4.589503,44.858571,0.56,street,Quartier Alyandre 07190 Saint-Maurice-en-Chalencon,07274_eqq8es,G,QUARTIER ALYANDRE,
791028699,00019,79102869900019,O,2013-01-21,,,,2019-11-14T14:00:15,true,1,,,,,MANTEL,07190,SAINT-MAURICE-EN-CHALENCON,,,07274,,,,,,,,,,,,,,,,,,,2013-01-21,A,,,,,68.20B,NAFRev2,N,3.1249666,48.958419,0.89,poi.track,Chemin de Mantel La Ferté-sous-Jouarre,https://osm.org/way/137748981,G,,
792795189,00010,79279518900010,O,2013-04-01,,,,2019-11-14T14:00:15,true,1,,,,,TREIGNAC,07190,SAINT-MAURICE-EN-CHALENCON,,,07274,,,,,,,,,,,,,,,,,,,2013-04-01,A,,,,,01.13Z,NAFRev2,N,1.7928917,45.538127,0.9,poi.park,(Parc) Treignac,https://osm.org/way/234976130,G,,
800668519,00013,80066851900013,O,2014-01-27,,,,2019-11-14T14:00:15,true,2,MAIRIE,,,,ALLIANDRE,07190,SAINT-MAURICE-EN-CHALENCON,,,07274,,,,,,,,,,,,,,,,,,,2014-02-24,F,,,,,47.99A,NAFRev2,N,4.589219,44.858499,0.56,street,Alyandre 07190 Saint-Maurice-en-Chalencon,07274_pdrk9y,G,ALYANDRE,
801695750,00019,80169575000019,O,2014-03-01,,,,2019-11-14T14:00:15,true,1,,,,,LES LATTES,07190,SAINT-MAURICE-EN-CHALENCON,,,07274,,,,,,,,,,,,,,,,,,,2014-03-01,A,,,,,68.20B,NAFRev2,N,5.5427756,45.0106275,0.89,poi.station,Les Lattes (Télécabine) Corrençon-en-Vercors,https://osm.org/node/505106275,G,,
810284414,00010,81028441400010,O,2015-03-13,,,4391AZ,2019-11-14T14:00:15,true,1,,,,,LIEU DIT TROUILLER,07190,SAINT-MAURICE-EN-CHALENCON,,,07274,,,,,,,,,,,,,,,,,,,2015-03-13,A,,,,VAN LEEUWEEN BENJAMIN,43.91A,NAFRev2,N,4.399048,45.2311993,0.88,poi.pitch,Jean Trouiller (Terrain de sport) Riotord,https://osm.org/way/235212168,G,,
813261104,00018,81326110400018,O,2015-09-07,,,,2019-11-14T14:00:15,true,2,,,,,LES ALIZES,07190,SAINT-MAURICE-EN-CHALENCON,,,07274,,,,,,,,,,,,,,,,,,,2017-12-01,F,,,,,85.52Z,NAFRev2,N,0.6594249,47.387746,0.9,poi.bar,Les Alizés (Bar) La Riche,https://osm.org/node/3486774294,G,,
821748613,00014,82174861300014,O,2016-07-25,NN,,,2019-11-14T14:00:15,false,2,,,,,LE VILLAGE,07190,SAINT-MAURICE-EN-CHALENCON,,,07274,,,,,,,,,,,,,,,,,,,2017-03-13,F,,,,,62.01Z,NAFRev2,O,2.2950702,48.9311749,0.9,poi.bar,bar le village Gennevilliers,https://osm.org/node/3287755128,G,,
831629456,00011,83162945600011,O,2017-08-04,,,,2019-11-14T14:00:15,true,1,,,,LD,LA ROCHE,07190,SAINT-MAURICE-EN-CHALENCON,,,07274,,,,,,,,,,,,,,,,,,,2017-08-04,A,,,,,35.11Z,NAFRev2,N,4.587878,44.846704,0.31,locality,La Plaine du Buis 07190 Saint-Maurice-en-Chalencon,07274_b064,G,LA PLAINE DU BUIS,
838440238,00015,83844023800015,O,2018-04-02,01,2018,4312BA,2020-08-25T11:40:52,true,1,,,,,ALYANDRE,07190,SAINT-MAURICE-EN-CHALENCON,,,07274,,,,,,,,,,,,,,,,,,,2018-04-02,A,,,,D & C TP,43.12A,NAFRev2,O,4.589219,44.858499,0.93,street,Alyandre 07190 Saint-Maurice-en-Chalencon,07274_pdrk9y,G,ALYANDRE,
841470966,00018,84147096600018,O,2018-07-06,,,,2019-11-14T14:00:15,true,1,,,,,LE GRAND RIAS,07190,SAINT-MAURICE-EN-CHALENCON,,,07274,,,,,,,,,,,,,,,,,,,2018-07-06,A,HOLOSYNERGIE,,,HOLOSYNERGIE,85.59B,NAFRev2,N,4.590725,44.867294,0.75,locality,Grand Rias 07190 Saint-Maurice-en-Chalencon,07274_b037,G,GRAND RIAS,
841968597,00010,84196859700010,O,2014-09-09,,,,2019-11-14T14:00:15,true,1,LAVISE-MANTEL,,,,,07190,SAINT-MAURICE-EN-CHALENCON,,,07274,,,,,,,,,,,,,,,,,,,2014-09-09,A,,,,,94.99Z,NAFRev2,N,,,0,,,,,,
848078820,00018,84807882000018,O,2019-02-01,,,,2019-11-14T14:00:15,true,2,,,,,LE SERRE,07190,SAINT-MAURICE-EN-CHALENCON,,,07274,,,,,,,,,,,,,,,,,,,2019-09-02,F,,,,,01.13Z,NAFRev2,N,4.5748,44.840756,0.6,locality,Serre Chaud 07190 Saint-Maurice-en-Chalencon,07274_b078,G,SERRE CHAUD,
848683397,00014,84868339700014,O,2019-02-26,,,,2019-11-14T14:00:15,true,1,,,,,LA ROCHE,07190,SAINT-MAURICE-EN-CHALENCON,,,07274,,,,,,,,,,,,,,,,,,,2019-02-26,A,CHATTERIE DES MAINECOONS DE L O,,,,01.49Z,NAFRev2,N,4.587878,44.846704,0.31,locality,La Plaine du Buis 07190 Saint-Maurice-en-Chalencon,07274_b064,G,LA PLAINE DU BUIS,
848764585,00024,84876458500024,O,2019-09-01,,,8121ZZ,2020-02-29T04:16:30,true,1,,,,,LA ROCHE,07190,SAINT-MAURICE-EN-CHALENCON,,,07274,,,,,,,,,,,,,,,,,,,2019-09-01,A,,,,,81.21Z,NAFRev2,N,4.587878,44.846704,0.31,locality,La Plaine du Buis 07190 Saint-Maurice-en-Chalencon,07274_b064,G,LA PLAINE DU BUIS,
849513452,00011,84951345200011,O,2019-04-01,,,,2019-12-18T04:10:38,true,2,,,,,PALIX,07190,SAINT-MAURICE-EN-CHALENCON,,,07274,,,,,,,,,,,,,,,,,,,2019-11-29,F,PONTON ELODIE,,,,01.24Z,NAFRev2,N,,,0,,,,,,
879647915,00013,87964791500013,O,2019-11-26,,,,2019-12-17T07:13:11,true,1,,,,,LES PEYRETS ,07190,SAINT-MAURICE-EN-CHALENCON,,,07274,,,,,,,,,,,,,,,,,,,2019-11-26,A,,,,,68.20B,NAFRev2,N,5.3720751,43.4100144,0.8,poi.shelter,Peyrets Fabrégoules (Abri) Septèmes-les-Vallons,https://osm.org/node/4324280693,G,,
882280696,00015,88228069600015,O,2020-04-01,,,4399CZ,2020-03-09T19:33:27,true,1,,,,,LE PONT DU MOULINAS,07190,SAINT-MAURICE-EN-CHALENCON,,,07274,,,,,,,,,,,,,,,,,,,2020-04-01,A,,,,,43.99C,NAFRev2,N,4.563928,44.853238,0.75,poi.information,Pont du Moulinas (Informations) Saint-Maurice-en-Chalencon,https://osm.org/node/2912104089,G,,
