siren,nic,siret,statutDiffusionEtablissement,dateCreationEtablissement,trancheEffectifsEtablissement,anneeEffectifsEtablissement,activitePrincipaleRegistreMetiersEtablissement,dateDernierTraitementEtablissement,etablissementSiege,nombrePeriodesEtablissement,complementAdresseEtablissement,numeroVoieEtablissement,indiceRepetitionEtablissement,typeVoieEtablissement,libelleVoieEtablissement,codePostalEtablissement,libelleCommuneEtablissement,libelleCommuneEtrangerEtablissement,distributionSpecialeEtablissement,codeCommuneEtablissement,codeCedexEtablissement,libelleCedexEtablissement,codePaysEtrangerEtablissement,libellePaysEtrangerEtablissement,complementAdresse2Etablissement,numeroVoie2Etablissement,indiceRepetition2Etablissement,typeVoie2Etablissement,libelleVoie2Etablissement,codePostal2Etablissement,libelleCommune2Etablissement,libelleCommuneEtranger2Etablissement,distributionSpeciale2Etablissement,codeCommune2Etablissement,codeCedex2Etablissement,libelleCedex2Etablissement,codePaysEtranger2Etablissement,libellePaysEtranger2Etablissement,dateDebut,etatAdministratifEtablissement,enseigne1Etablissement,enseigne2Etablissement,enseigne3Etablissement,denominationUsuelleEtablissement,activitePrincipaleEtablissement,nomenclatureActivitePrincipaleEtablissement,caractereEmployeurEtablissement,longitude,latitude,geo_score,geo_type,geo_adresse,geo_id,geo_ligne,geo_l4,geo_l5
210900064,00010,21090006400010,O,1983-03-01,02,2018,,2020-08-25T10:15:40,true,3,,,,,,09400,ALLIAT,,,09006,,,,,,,,,,,,,,,,,,,2008-01-01,A,MAIRIE,,,,84.11Z,NAFRev2,O,,,0,,,,,,
210900064,00028,21090006400028,O,1995-12-25,NN,,,2008-01-04T18:24:57,false,2,MAIRIE,,,,,09400,ALLIAT,,,09006,,,,,,,,,,,,,,,,,,,2008-01-01,A,SCE EAU ET ASSAINISSEMENT,,,,36.00Z,NAFRev2,N,1.586735,42.817185,0.9,street,Rue de la Mairie 09400 Alliat,09006_0070,D,RUE DE LA MAIRIE,
260901327,00015,26090132700015,O,1984-09-17,NN,,,2018-05-30T14:33:51,true,5,MAIRIE,,,,,09400,ALLIAT,,,09006,,,,,,,,,,,,,,,,,,,2018-01-01,F,,,,,88.99B,NAFRev2,N,1.586735,42.817185,0.9,street,Rue de la Mairie 09400 Alliat,09006_0070,D,RUE DE LA MAIRIE,
322943291,00029,32294329100029,O,1995-04-23,NN,,,,true,1,,,,,,09400,ALLIAT,,,09006,,,,,,,,,,,,,,,,,,,1998-05-06,F,,,,,92.5C,NAF1993,O,,,0,,,,,,
325357267,00013,32535726700013,O,,NN,,,,true,1,,,,,,09400,ALLIAT,,,09006,,,,,,,,,,,,,,,,,,,,F,,,,,49.01,NAP,N,,,0,,,,,,
353284540,00013,35328454000013,O,,NN,,,,true,1,,,,,,09400,ALLIAT,,,09006,,,,,,,,,,,,,,,,,,,1995-01-01,F,,,,,55.2C,NAF1993,N,,,0,,,,,,
381106962,00024,38110696200024,O,1999-04-06,,,,2008-11-08T00:38:42,false,3,,1,,RUE,DE LA MAIRIE,09400,ALLIAT,,,09006,,,,,,,,,,,,,,,,,,,2000-10-02,F,,,,,93.0D,NAF1993,N,1.586735,42.817185,0.93,housenumber,1 Rue de la Mairie 09400 Alliat,09006_0070_00001,G,1 RUE DE LA MAIRIE,
401088299,00011,40108829900011,O,1995-06-02,,,,,true,3,,,,,DOMAINE DE LA HILLE,09400,ALLIAT,,,09006,,,,,,,,,,,,,,,,,,,1998-07-21,F,,,,,55.2C,NAF1993,N,1.589134,42.815969,0.47,street,Prado de la Hillo 09400 Alliat,09006_b029,G,PRADO DE LA HILLO,
404980583,00011,40498058300011,O,1961-01-01,NN,,,,true,4,,,,RTE,N AMIEL LA MOULINE,09400,ALLIAT,,,09006,,,,,,,,,,,,,,,,,,,2003-05-12,F,,,,,01.1A,NAFRev1,N,,,0,,,,,,
415279801,00013,41527980100013,O,1998-01-22,,,,,true,1,,,,,DOMAINE DE LA HILLE,09400,ALLIAT,,,09006,,,,,,,,,,,,,,,,,,,2000-12-21,F,,,,,74.1J,NAF1993,N,1.589134,42.815969,0.47,street,Prado de la Hillo 09400 Alliat,09006_b029,G,PRADO DE LA HILLO,
418771077,00017,41877107700017,O,1998-05-01,NN,,,2018-09-29T12:42:32,true,5,,,,RUE,DE L'OUSTAL,09400,ALLIAT,,,09006,,,,,,,,,,,,,,,,,,,2008-01-01,A,,,,,91.04Z,NAFRev2,O,1.586735,42.817185,0.47,street,Rue de la Mairie 09400 Alliat,09006_0070,G,RUE DE LA MAIRIE,
419432711,00010,41943271100010,O,1998-06-24,NN,,,2014-03-31T15:19:47,false,5,,,,DOM,DE LA HILLE,09400,ALLIAT,,,09006,,,,,,,,,,,,,,,,,,,2014-03-18,F,,,,,55.30Z,NAFRev2,O,1.589134,42.815969,0.58,street,Prado de la Hillo 09400 Alliat,09006_b029,G,PRADO DE LA HILLO,
422853002,00018,42285300200018,O,1998-07-01,NN,,,2007-07-03T18:17:41,true,3,,,,,DOMAINE DE LA HILLE,09400,ALLIAT,,,09006,,,,,,,,,,,,,,,,,,,2006-03-08,F,,,,,70.2C,NAFRev1,N,1.589134,42.815969,0.47,street,Prado de la Hillo 09400 Alliat,09006_b029,G,PRADO DE LA HILLO,
422853085,00013,42285308500013,O,1998-07-01,NN,,,2014-10-31T11:27:21,true,3,,,,,DOMAINE DE LA HILLE,09400,ALLIAT,,,09006,,,,,,,,,,,,,,,,,,,2008-01-01,A,,,,,68.20B,NAFRev2,N,1.589134,42.815969,0.47,street,Prado de la Hillo 09400 Alliat,09006_b029,G,PRADO DE LA HILLO,
430499954,00039,43049995400039,O,2014-06-02,,,,2015-12-17T04:32:27,true,1,,1,,IMP,ROUCATEL,09400,ALLIAT,,,09006,,,,,,,,,,,,,,,,,,,2014-06-02,A,,,,,47.89Z,NAFRev2,N,1.585993,42.816598,0.8,housenumber,1 Impasse du Roucatel 09400 Alliat,09006_0078_00001,G,1 IMPASSE DU ROUCATEL,
441109873,00014,44110987300014,O,2002-03-01,NN,,,2008-01-04T21:12:36,true,3,,,,,DOMAINE DE LA HILLE,09400,ALLIAT,,,09006,,,,,,,,,,,,,,,,,,,2008-01-01,A,,,,,68.20A,NAFRev2,N,1.589134,42.815969,0.47,street,Prado de la Hillo 09400 Alliat,09006_b029,G,PRADO DE LA HILLO,
441178423,00014,44117842300014,O,2002-02-07,NN,,4399CZ,2015-03-17T01:07:16,true,4,,,,,DOMAINE DE LA HILLE,09400,ALLIAT,,,09006,,,,,,,,,,,,,,,,,,,2004-06-01,F,,,,,45.2V,NAFRev1,N,1.589134,42.815969,0.47,street,Prado de la Hillo 09400 Alliat,09006_b029,G,PRADO DE LA HILLO,
443908587,00027,44390858700027,O,2010-02-02,,,,2016-02-04T04:20:51,true,2,,,,DOM,DE LA HILLE,09400,ALLIAT,,,09006,,,,,,,,,,,,,,,,,,,2015-12-31,F,,,,,64.30Z,NAFRev2,N,1.589134,42.815969,0.58,street,Prado de la Hillo 09400 Alliat,09006_b029,G,PRADO DE LA HILLO,
479191785,00019,47919178500019,O,2004-10-23,NN,,,2008-11-08T02:44:32,true,3,,,,,DOMAINE DE LA HILLE,09400,ALLIAT,,,09006,,,,,,,,,,,,,,,,,,,2005-04-22,F,,,,,45.4C,NAFRev1,N,1.589134,42.815969,0.47,street,Prado de la Hillo 09400 Alliat,09006_b029,G,PRADO DE LA HILLO,
479192510,00010,47919251000010,O,2004-10-23,NN,,,2008-11-08T02:44:33,true,3,,,,,DOMAINE DE LA HILLE,09400,ALLIAT,,,09006,,,,,,,,,,,,,,,,,,,2006-03-08,F,,,,,45.4C,NAFRev1,N,1.589134,42.815969,0.47,street,Prado de la Hillo 09400 Alliat,09006_b029,G,PRADO DE LA HILLO,
479199242,00013,47919924200013,O,2004-10-22,,,,2008-01-05T03:58:07,true,3,,,,,LA MOULINE,09400,ALLIAT,,,09006,,,,,,,,,,,,,,,,,,,2008-01-01,A,,,,,01.43Z,NAFRev2,N,1.588994,42.807103,0.9,street,Lieu Dit la Mouline 09400 Alliat,09006_9sgra6,G,LIEU DIT LA MOULINE,
481111615,00011,48111161500011,O,2005-03-01,,,,2011-11-16T10:38:49,true,3,,2,,IMP,DU ROUCATEL,09400,ALLIAT,,,09006,,,,,,,,,,,,,,,,,,,2011-10-14,F,,,,,01.11Z,NAFRev2,N,1.586013,42.817012,0.82,housenumber,2 Impasse du Roucatel 09400 Alliat,09006_0078_00002,G,2 IMPASSE DU ROUCATEL,
481587137,00011,48158713700011,O,2005-03-15,,,,2008-11-08T02:50:11,true,2,,,,,DOMAINE DE LA HILLE,09400,ALLIAT,,,09006,,,,,,,,,,,,,,,,,,,2006-02-28,F,,,,,45.4C,NAFRev1,N,1.589134,42.815969,0.47,street,Prado de la Hillo 09400 Alliat,09006_b029,G,PRADO DE LA HILLO,
484090287,00026,48409028700026,O,2016-02-18,,,,2016-03-08T04:02:12,true,1,,,,DOM,DE LA HILLE,09400,ALLIAT,,,09006,,,,,,,,,,,,,,,,,,,2016-02-18,A,,,,,68.20B,NAFRev2,N,1.589134,42.815969,0.58,street,Prado de la Hillo 09400 Alliat,09006_b029,G,PRADO DE LA HILLO,
484538954,00013,48453895400013,O,2005-09-23,,,,2008-11-08T02:56:12,true,2,,,,,DOMAINE DE LA HILLE,09400,ALLIAT,,,09006,,,,,,,,,,,,,,,,,,,2006-03-08,F,,,,,45.4C,NAFRev1,N,1.589134,42.815969,0.47,street,Prado de la Hillo 09400 Alliat,09006_b029,G,PRADO DE LA HILLO,
488798604,00010,48879860400010,O,2006-02-09,NN,,,2012-05-05T11:10:47,false,5,,,,DOM,DE LA HILLE,09400,ALLIAT,,,09006,,,,,,,,,,,,,,,,,,,2010-02-01,F,CAMPING DES GROTTES,,,,55.30Z,NAFRev2,O,1.589134,42.815969,0.58,street,Prado de la Hillo 09400 Alliat,09006_b029,G,PRADO DE LA HILLO,
488807306,00011,48880730600011,O,2006-02-09,,,,2008-01-05T22:01:59,true,2,,,,,DOMAINE DE LA HILLE,09400,ALLIAT,,,09006,,,,,,,,,,,,,,,,,,,2008-01-01,A,,,,,68.20B,NAFRev2,N,1.589134,42.815969,0.47,street,Prado de la Hillo 09400 Alliat,09006_b029,G,PRADO DE LA HILLO,
501275069,00034,50127506900034,O,2013-01-22,,,4312AZ,2018-08-23T09:17:38,true,2,,,,,DOMAINE DE LA HILLE,09400,ALLIAT,,,09006,,,,,,,,,,,,,,,,,,,2018-06-30,F,,,,LA TOUR TERRASSEMENT,43.12A,NAFRev2,N,1.589134,42.815969,0.47,street,Prado de la Hillo 09400 Alliat,09006_b029,G,PRADO DE LA HILLO,
517658738,00029,51765873800029,O,2018-06-01,,,,2018-12-18T03:38:41,true,2,,,,PL,ANDRE FOURNIE,09400,ALLIAT,,,09006,,,,,,,,,,,,,,,,,,,2018-12-31,F,,,,MATTHIEU SOULA,81.30Z,NAFRev2,N,-2.5527823,48.5898951,0.77,poi.bakery,Le Fournil de la Couture (Boulangerie) Pléneuf-Val-André,https://osm.org/node/4081645796,G,,
519546360,00016,51954636000016,O,2010-01-18,01,2018,,2020-08-25T10:33:43,true,4,CHEMIN DE LA HILLE,,,DOM,DE LA HILLE,09400,ALLIAT,,,09006,,,,,,,,,,,,,,,,,,,2011-06-01,A,,,,,55.30Z,NAFRev2,O,1.589134,42.815969,0.58,street,Prado de la Hillo 09400 Alliat,09006_b029,G,PRADO DE LA HILLO,
520609876,00021,52060987600021,O,2012-01-01,,,,2016-01-21T14:47:37,false,2,,,,,IMPASSE DU CANTOU,09400,ALLIAT,,,09006,,,,,,,,,,,,,,,,,,,2016-01-01,F,,,,,58.19Z,NAFRev2,N,1.58727,42.817031,0.93,street,Impasse du Cantou 09400 Alliat,09006_0030,G,IMPASSE DU CANTOU,
522504349,00021,52250434900021,O,2017-08-01,,,4321AA,2018-10-18T19:33:59,true,1,,,,RTE,DE GENAT,09400,ALLIAT,,,09006,,,,,,,,,,,,,,,,,,,2017-08-01,A,,,,ARIEGE SATELLITE,43.21A,NAFRev2,N,1.585089,42.816925,0.78,street,Route de Genat 09400 Alliat,09006_0050,G,ROUTE DE GENAT,
817450422,00024,81745042200024,O,2016-12-08,,,,2016-12-30T08:45:52,true,1,LE CAMP FOURCAT,,,RTE,DE GENAT,09400,ALLIAT,,,09006,,,,,,,,,,,,,,,,,,,2016-12-08,A,,,,,62.01Z,NAFRev2,N,1.585089,42.816925,0.78,street,Route de Genat 09400 Alliat,09006_0050,G,ROUTE DE GENAT,
820051654,00011,82005165400011,O,2016-04-16,,,,2017-03-03T03:40:56,true,1,,,,DOM,DE LA HILLE,09400,ALLIAT,,,09006,,,,,,,,,,,,,,,,,,,2016-04-16,A,,,,,64.20Z,NAFRev2,N,1.589134,42.815969,0.58,street,Prado de la Hillo 09400 Alliat,09006_b029,G,PRADO DE LA HILLO,
841859994,00011,84185999400011,O,2018-07-01,,,4312AZ,2018-08-23T09:17:38,true,1,,,,,DOMAINE DE LA HILLE,09400,ALLIAT,,,09006,,,,,,,,,,,,,,,,,,,2018-07-01,A,,,,LA TOUR TERRASSEMENT,43.12A,NAFRev2,N,1.589134,42.815969,0.47,street,Prado de la Hillo 09400 Alliat,09006_b029,G,PRADO DE LA HILLO,
883565194,00015,88356519400015,O,2020-05-07,,,,2020-05-25T09:05:15,true,1,DOMAINE DE LA HILLE,,,,,09400,ALLIAT,,,09006,,,,,,,,,,,,,,,,,,,2020-05-07,A,,,,,68.20B,NAFRev2,N,1.589134,42.815969,0.47,street,Prado de la Hillo 09400 Alliat,09006_b029,D,PRADO DE LA HILLO,
