siren,nic,siret,statutDiffusionEtablissement,dateCreationEtablissement,trancheEffectifsEtablissement,anneeEffectifsEtablissement,activitePrincipaleRegistreMetiersEtablissement,dateDernierTraitementEtablissement,etablissementSiege,nombrePeriodesEtablissement,complementAdresseEtablissement,numeroVoieEtablissement,indiceRepetitionEtablissement,typeVoieEtablissement,libelleVoieEtablissement,codePostalEtablissement,libelleCommuneEtablissement,libelleCommuneEtrangerEtablissement,distributionSpecialeEtablissement,codeCommuneEtablissement,codeCedexEtablissement,libelleCedexEtablissement,codePaysEtrangerEtablissement,libellePaysEtrangerEtablissement,complementAdresse2Etablissement,numeroVoie2Etablissement,indiceRepetition2Etablissement,typeVoie2Etablissement,libelleVoie2Etablissement,codePostal2Etablissement,libelleCommune2Etablissement,libelleCommuneEtranger2Etablissement,distributionSpeciale2Etablissement,codeCommune2Etablissement,codeCedex2Etablissement,libelleCedex2Etablissement,codePaysEtranger2Etablissement,libellePaysEtranger2Etablissement,dateDebut,etatAdministratifEtablissement,enseigne1Etablissement,enseigne2Etablissement,enseigne3Etablissement,denominationUsuelleEtablissement,activitePrincipaleEtablissement,nomenclatureActivitePrincipaleEtablissement,caractereEmployeurEtablissement,longitude,latitude,geo_score,geo_type,geo_adresse,geo_id,geo_ligne,geo_l4,geo_l5
171402118,00227,17140211800227,O,1983-01-01,NN,,,2012-07-27T11:22:23,false,4,,,,PL,NICOLAS COPERNIC,14420,POTIGNY,,,14516,,,,,,,,,,,,,,,,,,,2010-01-25,F,TRESORERIE POTIGNY,,,,84.11Z,NAFRev2,N,-0.241773,48.968797,0.85,locality,Place Nicolas Copernic 14420 Potigny,14516_0570,G,PLACE NICOLAS COPERNIC,
191400779,00010,19140077900010,O,1983-03-01,12,2018,,2020-08-25T10:14:01,true,5,,,,RUE,DU MARCHE,14420,POTIGNY,,,14516,,,,,,,,,,,,,,,,,,,2008-01-01,A,,,,,85.31Z,NAFRev2,O,-0.242869,48.969038,0.94,street,Rue du Marché 14420 Potigny,14516_0510,G,RUE DU MARCHE,
211405162,00010,21140516200010,O,1983-03-01,00,2018,,2020-08-25T10:15:55,false,5,,,,PL,NICOLAS COPERNIC,14420,POTIGNY,,,14516,,,,,,,,,,,,,,,,,,,2018-01-01,F,MAIRIE,,,,84.11Z,NAFRev2,O,-0.241773,48.968797,0.85,locality,Place Nicolas Copernic 14420 Potigny,14516_0570,G,PLACE NICOLAS COPERNIC,
211405162,00044,21140516200044,O,1983-12-21,11,2018,,2020-08-25T10:15:55,false,4,,,,RUE,DU MARCHE,14420,POTIGNY,,,14516,,,,,,,,,,,,,,,,,,,2008-01-01,A,ECOLE MATERNELLE PUB. A. DE ST EXUPERY,,,,85.10Z,NAFRev2,N,-0.242869,48.969038,0.94,street,Rue du Marché 14420 Potigny,14516_0510,G,RUE DU MARCHE,
211405162,00051,21140516200051,O,1990-09-01,12,2018,,2020-08-25T10:15:55,false,4,,,,RUE,JEAN MOULIN,14420,POTIGNY,,,14516,,,,,,,,,,,,,,,,,,,2008-01-01,A,ECOLE PRIMAIRE PUBLIQUE PAUL LANGEVIN,,,,85.20Z,NAFRev2,N,-0.240723,48.969732,0.94,street,Rue Jean Moulin 14420 Potigny,14516_0405,G,RUE JEAN MOULIN,
211405162,00069,21140516200069,O,1995-12-25,NN,,,2018-03-22T11:05:34,false,3,CENTRE ADMINISTRATIF,,,PL,1ERE DIVISION BLINDEE POLONAISE,14420,POTIGNY,,,14516,,,,,,,,,,,,,,,,,,,2017-12-31,F,SERVICE D'ASSAINISSEMENT,,,,84.12Z,NAFRev2,N,,,0,,,,,,
211405162,00077,21140516200077,O,1999-12-25,NN,,,2018-03-23T16:21:13,false,3,CENTRE ADMINISTRATIF,,,PL,1ERE DIVISION BLINDEE POLONAISE,14420,POTIGNY,,,14516,,,,,,,,,,,,,,,,,,,2017-12-31,F,SERVICE D'EAU,,,,36.00Z,NAFRev2,N,,,0,,,,,,
211405162,00085,21140516200085,O,1998-12-25,NN,,,2019-05-10T13:33:20,false,3,CENTRE ADMINISTRATIF,,,PL,1ERE DIVISION BLINDEE POLONAISE,14420,POTIGNY,,,14516,,,,,,,,,,,,,,,,,,,2015-12-31,F,SERVICE TRANSPORTS SCOLAIRES,,,,49.39A,NAFRev2,N,,,0,,,,,,
211405162,00093,21140516200093,O,2000-04-01,NN,,,2015-10-14T17:43:03,false,4,MAIRIE,,,PL,NICOLAS COPERNIC,14420,POTIGNY,,,14516,,,,,,,,,,,,,,,,,,,2012-10-03,F,ATELIER RELAIS,,,,68.20B,NAFRev2,N,-0.241773,48.968797,0.85,locality,Place Nicolas Copernic 14420 Potigny,14516_0570,G,PLACE NICOLAS COPERNIC,
211405162,00101,21140516200101,O,2004-01-01,NN,,,2013-04-18T14:02:46,false,4,MAIRIE,,,PL,NICOLAS COPERNIC,14420,POTIGNY,,,14516,,,,,,,,,,,,,,,,,,,2011-04-18,F,LOTISSEMENT,,,,42.99Z,NAFRev2,N,-0.241773,48.968797,0.85,locality,Place Nicolas Copernic 14420 Potigny,14516_0570,G,PLACE NICOLAS COPERNIC,
211405162,00127,21140516200127,O,2018-01-01,,,,2019-07-05T03:48:38,true,1,CENTRE ADMINISTRATIF,,,PL,1ERE DIVISION BLINDEE POLONAISE,14420,POTIGNY,,,14516,,,,,,,,,,,,,,,,,,,2018-01-01,A,MAIRIE,,,,84.11Z,NAFRev2,O,,,0,,,,,,
251401683,00015,25140168300015,O,1983-03-01,NN,,,2006-10-26T23:43:17,true,3,MAIRIE,,,PL,NICOLAS COPERNIC,14420,POTIGNY,,,14516,,,,,,,,,,,,,,,,,,,2004-07-16,F,,,,,75.1E,NAFRev1,N,-0.241773,48.968797,0.85,locality,Place Nicolas Copernic 14420 Potigny,14516_0570,G,PLACE NICOLAS COPERNIC,
251403952,00020,25140395200020,O,1996-02-16,01,2018,,2020-08-25T10:20:15,true,3,MAIRIE,,,,,14420,POTIGNY,,,14516,,,,,,,,,,,,,,,,,,,2008-01-01,A,,,,,42.99Z,NAFRev2,N,-0.243069,48.971805,0.51,street,Chemin de Marie Joly 14420 Potigny,14516_0540,D,CHEMIN DE MARIE JOLY,
251404844,00010,25140484400010,O,1997-06-05,NN,,,2008-09-24T15:10:44,true,3,MAIRIE,,,PL,NICOLAS COPERNIC,14420,POTIGNY,,,14516,,,,,,,,,,,,,,,,,,,2003-12-31,F,,,,,75.1C,NAFRev1,N,-0.241773,48.968797,0.85,locality,Place Nicolas Copernic 14420 Potigny,14516_0570,G,PLACE NICOLAS COPERNIC,
261401004,00104,26140100400104,O,2011-03-28,21,2018,,2020-08-25T10:20:48,false,1,,,,RTE,DE BONS TASSILLY,14420,POTIGNY,,,14516,,,,,,,,,,,,,,,,,,,2011-03-28,A,EHPAD POTIGNY,,,,87.10A,NAFRev2,O,-0.2379517,48.9587687,0.81,poi.place_of_worship,Église de Bons (Lieu de culte) Bons-Tassilly,https://osm.org/way/236586658,G,,
261401426,00018,26140142600018,O,1992-11-01,00,2018,,2020-08-25T10:20:49,false,5,,,,PL,NICOLAS COPERNIC,14420,POTIGNY,,,14516,,,,,,,,,,,,,,,,,,,2018-01-01,F,CCAS,,,,88.99B,NAFRev2,O,-0.241773,48.968797,0.85,locality,Place Nicolas Copernic 14420 Potigny,14516_0570,G,PLACE NICOLAS COPERNIC,
261401426,00026,26140142600026,O,2018-01-01,01,2018,,2020-08-25T10:20:49,true,1,CENTRE ADMINISTRATIF,,,PL,1ERE DIVISION BLINDEE POLONAISE,14420,POTIGNY,,,14516,,,,,,,,,,,,,,,,,,,2018-01-01,A,,,,,88.99B,NAFRev2,O,,,0,,,,,,
261407704,00012,26140770400012,O,1995-12-25,,,,2006-10-26T23:44:53,true,2,MAIRIE,,,PL,NICOLAS COPERNIC,14420,POTIGNY,,,14516,,,,,,,,,,,,,,,,,,,2004-12-09,F,CDE,,,,85.3K,NAFRev1,N,-0.241773,48.968797,0.85,locality,Place Nicolas Copernic 14420 Potigny,14516_0570,G,PLACE NICOLAS COPERNIC,
271400491,00012,27140049100012,O,,,,,,true,1,,,,PL,COPERNIC,14420,POTIGNY,,,14516,,,,,,,,,,,,,,,,,,,1995-12-25,F,,,,,41.0Z,NAF1993,N,-0.241773,48.968797,0.78,locality,Place Nicolas Copernic 14420 Potigny,14516_0570,G,PLACE NICOLAS COPERNIC,
301055539,00078,30105553900078,O,2002-03-15,,,,2019-02-12T19:34:40,true,4,ZI,,,RTE,D AISY,14420,POTIGNY,,,14516,,,,,,,,,,,,,,,,,,,2008-12-19,F,,,,,46.69B,NAFRev2,N,-0.245049,48.970957,0.59,street,Chemin d'Aisy 14420 Potigny,14516_b010,G,CHEMIN D AISY,
302592589,00014,30259258900014,O,1900-01-01,,,,,true,4,,47,,RUE,DU MAL LECLERC,14420,POTIGNY,,,14516,,,,,,,,,,,,,,,,,,,1993-12-25,F,,,,,52.4C,NAF1993,N,-0.242147,48.97022,0.82,housenumber,47 Rue du Général Leclerc 14420 Potigny,14516_0340_00047,G,47 RUE DU GENERAL LECLERC,
303277669,00014,30327766900014,O,,,,,,true,1,,136,,RUE,DE PRAGUE,14420,POTIGNY,,,14516,,,,,,,,,,,,,,,,,,,1984-12-25,F,,,,,82.06,NAP,N,-0.251065,48.971594,0.94,housenumber,136 Rue de Prague 14420 Potigny,14516_0760_00136,G,136 RUE DE PRAGUE,
305277972,00025,30527797200025,O,1988-03-25,NN,,,2008-11-07T00:20:58,false,4,,41,B,RUE,DU GENERAL LECLERC,14420,POTIGNY,,,14516,,,,,,,,,,,,,,,,,,,1999-08-31,F,,,,,93.0D,NAF1993,O,-0.242802,48.971382,0.88,housenumber,41 b Rue du Général Leclerc 14420 Potigny,14516_0340_00041_b,G,41 B RUE DU GENERAL LECLERC,
306380205,00022,30638020500022,O,,NN,,,,true,1,,,,,,14420,POTIGNY,,,14516,,,,,,,,,,,,,,,,,,,1986-12-31,F,,,,,81.21,NAP,N,,,0,,,,,,
308500123,00036,30850012300036,O,2020-01-15,,,,2020-01-27T12:04:18,true,1,,57,,RUE,DU GENERAL LECLERC,14420,POTIGNY,,,14516,,,,,,,,,,,,,,,,,,,2020-01-15,A,A LA DESCENTE DE MARIE JOLY,,,A LA DESCENTE DE MARIE JOLY,55.20Z,NAFRev2,N,-0.241276,48.968706,0.94,housenumber,57 Rue du Général Leclerc 14420 Potigny,14516_0340_00057,G,57 RUE DU GENERAL LECLERC,
308868538,00015,30886853800015,O,,NN,,,,true,1,,49,,RUE,DU GAL LECLERC,14420,POTIGNY,,,14516,,,,,,,,,,,,,,,,,,,1989-03-30,F,,,,,62.43,NAP,N,-0.242056,48.970077,0.86,housenumber,49 Rue du Général Leclerc 14420 Potigny,14516_0340_00049,G,49 RUE DU GENERAL LECLERC,
308968973,00013,30896897300013,O,,NN,,,,true,1,,,,RUE,DU GENERAL LECLERC,14420,POTIGNY,,,14516,,,,,,,,,,,,,,,,,,,1990-05-16,F,,,,,84.12,NAP,N,-0.244977,48.97512,0.94,street,Rue du Général Leclerc 14420 Potigny,14516_0340,G,RUE DU GENERAL LECLERC,
309092419,00014,30909241900014,O,1966-01-01,,,,,true,1,,38,,RUE,GENERAL LECLERC,14420,POTIGNY,,,14516,,,,,,,,,,,,,,,,,,,2002-03-31,F,,,,,15.8D,NAF1993,N,-0.242293,48.970171,0.9,housenumber,38 Rue du Général Leclerc 14420 Potigny,14516_0340_00038,G,38 RUE DU GENERAL LECLERC,
309559144,00014,30955914400014,O,,,,,,true,1,,,,RUE,LOUIS LEFEVRE,14420,POTIGNY,,,14516,,,,,,,,,,,,,,,,,,,,F,,,,,87.01,NAP,N,-0.242432,48.970292,0.94,street,Rue Louis Lefèvre 14420 Potigny,14516_0480,G,RUE LOUIS LEFEVRE,
309592897,00016,30959289700016,O,1965-01-01,NN,,,2009-06-27T03:51:08,true,4,,32,,RUE,GAL LECLERC,14420,POTIGNY,,,14516,,,,,,,,,,,,,,,,,,,2007-06-30,F,,,,,52.2C,NAFRev1,O,-0.242701,48.970968,0.79,housenumber,32 Rue du Général Leclerc 14420 Potigny,14516_0340_00032,G,32 RUE DU GENERAL LECLERC,
309636777,00018,30963677700018,O,,NN,,,,true,1,,46,,RUE,DU GAL LECLERC,14420,POTIGNY,,,14516,,,,,,,,,,,,,,,,,,,1997-09-30,F,,,,,52.3A,NAF1993,O,-0.241925,48.969622,0.86,housenumber,46 Rue du Général Leclerc 14420 Potigny,14516_0340_00046,G,46 RUE DU GENERAL LECLERC,
310138086,00015,31013808600015,O,,NN,,,,true,1,,,,CHE,DE MARY JOLY,14420,POTIGNY,,,14516,,,,,,,,,,,,,,,,,,,,F,,,,,55.73,NAP,N,-0.243069,48.971805,0.68,street,Chemin de Marie Joly 14420 Potigny,14516_0540,G,CHEMIN DE MARIE JOLY,
313963050,00049,31396305000049,O,2010-09-01,NN,,,2016-04-26T02:10:55,true,3,,36,,RUE,DU VILLAGE,14420,POTIGNY,,,14516,,,,,,,,,,,,,,,,,,,2014-02-28,F,,,,,86.23Z,NAFRev2,O,-0.240095,48.968099,0.94,housenumber,36 Rue du Village 14420 Potigny,14516_0900_00036,G,36 RUE DU VILLAGE,
314535659,00028,31453565900028,O,1999-10-28,NN,,,2008-11-07T00:29:50,false,3,,63,,RUE,GENERAL LECLERC,14420,POTIGNY,,,14516,,,,,,,,,,,,,,,,,,,2004-07-15,F,NATHALIE FLEURS,,,,52.4X,NAFRev1,N,-0.241104,48.968438,0.9,housenumber,63 Rue du Général Leclerc 14420 Potigny,14516_0340_00063,G,63 RUE DU GENERAL LECLERC,
314535659,00036,31453565900036,O,2004-07-15,,,,2014-07-08T00:18:29,true,4,,38,,RUE,DU GENERAL LECLERC,14420,POTIGNY,,,14516,,,,,,,,,,,,,,,,,,,2009-12-04,F,,,,,47.76Z,NAFRev2,N,-0.242293,48.970171,0.94,housenumber,38 Rue du Général Leclerc 14420 Potigny,14516_0340_00038,G,38 RUE DU GENERAL LECLERC,
315200865,00030,31520086500030,O,2003-12-31,NN,,,2007-01-19T14:50:56,true,4,,,,,ZONE INDUSTRIELLE,14420,POTIGNY,,,14516,,,,,,,,,,,,,,,,,,,2006-12-30,F,,,,,36.4Z,NAFRev1,O,5.0269111,45.7705982,0.92,poi.industrial,Zone Industrielle Meyzieu,https://osm.org/way/117589602,G,,
316651637,00027,31665163700027,O,1988-10-23,NN,,,2015-01-27T04:31:02,false,4,,17,,RUE,DU GENERAL LECLERC,14420,POTIGNY,,,14516,,,,,,,,,,,,,,,,,,,2015-01-31,F,,,,,47.22Z,NAFRev2,N,-0.244636,48.973679,0.94,housenumber,17 Rue du Général Leclerc 14420 Potigny,14516_0340_00017,G,17 RUE DU GENERAL LECLERC,
318210887,00036,31821088700036,O,1982-07-01,NN,,,2011-04-23T04:58:31,true,6,ZONE INDUSTRIELLE,,,CHE,DES CANTINES,14420,POTIGNY,,BP 4,14516,,,,,,,,,,,,,,,,,,,2009-12-31,F,,,,,32.30Z,NAFRev2,O,-0.246134,48.970444,0.54,street,Rue des Capucines 14420 Potigny,14516_0100,G,RUE DES CAPUCINES,
318407327,00010,31840732700010,O,,,,,,true,1,,70,,RUE,GENERAL LECLERC,14420,POTIGNY,,,14516,,,,,,,,,,,,,,,,,,,1984-12-25,F,,,,,82.06,NAP,N,-0.239775,48.966932,0.9,housenumber,70 Rue du Général Leclerc 14420 Potigny,14516_0340_00070,G,70 RUE DU GENERAL LECLERC,
319748281,00023,31974828100023,O,1974-01-01,NN,,,2008-01-04T18:06:04,false,3,,33,,RUE,DU GENERAL LECLERC,14420,POTIGNY,,,14516,,,,,,,,,,,,,,,,,,,2008-01-01,A,,,,,64.19Z,NAFRev2,N,-0.243136,48.971981,0.94,housenumber,33 Rue du Général Leclerc 14420 Potigny,14516_0340_00033,G,33 RUE DU GENERAL LECLERC,
319763827,00015,31976382700015,O,1980-10-01,NN,,,2009-06-27T04:17:17,true,6,,24,B,RUE,DU MAL LECLERC,14420,POTIGNY,,,14516,,,,,,,,,,,,,,,,,,,2008-11-24,F,,,,,47.52B,NAFRev2,N,-0.243099,48.971638,0.71,housenumber,24 bis Rue du Général Leclerc 14420 Potigny,14516_0340_00024_bis,G,24 BIS RUE DU GENERAL LECLERC,
319815676,00014,31981567600014,O,1980-05-09,NN,,,2008-01-05T19:22:02,true,3,,24,B,RUE,DU GENERAL LECLERC,14420,POTIGNY,,,14516,,,,,,,,,,,,,,,,,,,2008-01-01,A,,,,,68.20B,NAFRev2,N,-0.243099,48.971638,0.84,housenumber,24 bis Rue du Général Leclerc 14420 Potigny,14516_0340_00024_bis,G,24 BIS RUE DU GENERAL LECLERC,
320539851,00024,32053985100024,O,2003-12-23,NN,,,2012-07-28T11:47:37,true,4,,10,,RUE,DU GENERAL LECLERC,14420,POTIGNY,,,14516,,,,,,,,,,,,,,,,,,,2010-12-25,F,,,,,47.78C,NAFRev2,N,-0.24427,48.973117,0.94,housenumber,10 Rue du Général Leclerc 14420 Potigny,14516_0340_00010,G,10 RUE DU GENERAL LECLERC,
320550478,00012,32055047800012,O,,NN,,,,true,1,,36,,RUE,GENERAL LECLERC,14420,POTIGNY,,,14516,,,,,,,,,,,,,,,,,,,,F,,,,,67.04,NAP,N,-0.242459,48.97055,0.9,housenumber,36 Rue du Général Leclerc 14420 Potigny,14516_0340_00036,G,36 RUE DU GENERAL LECLERC,
321181224,00049,32118122400049,O,2017-03-02,,,,2018-04-03T11:31:19,true,2,,4,,RUE,LOUIS BOUILLARD PROLONGEE,14420,POTIGNY,,,14516,,,,,,,,,,,,,,,,,,,2017-12-31,F,,,,,45.11Z,NAFRev2,N,-0.252955,48.969527,0.94,housenumber,4 Rue Louis Bouillard Prolongee 14420 Potigny,14516_lhxfrm_00004,G,4 RUE LOUIS BOUILLARD PROLONGEE,
321594178,00022,32159417800022,O,1986-11-26,NN,,,2015-09-22T03:33:48,true,7,,40,,RUE,GENERAL LECLERC,14420,POTIGNY,,,14516,,,,,,,,,,,,,,,,,,,2015-09-07,F,,,,,68.20B,NAFRev2,N,-0.24217,48.97004,0.9,housenumber,40 Rue du Général Leclerc 14420 Potigny,14516_0340_00040,G,40 RUE DU GENERAL LECLERC,
322337742,00025,32233774200025,O,,,,,,true,1,,113,,RUE,DES HIRONDELLES,14420,POTIGNY,,,14516,,,,,,,,,,,,,,,,,,,1984-12-25,F,,,,,55.50,NAP,N,-0.246687,48.968561,0.94,housenumber,113 Rue des Hirondelles 14420 Potigny,14516_0380_00113,G,113 RUE DES HIRONDELLES,
323634022,00012,32363402200012,O,1982-02-01,NN,,,2016-05-30T02:38:11,true,5,,53,,RUE,GENERAL LECLERC,14420,POTIGNY,,,14516,,,,,,,,,,,,,,,,,,,2011-12-31,F,,,,,86.21Z,NAFRev2,N,-0.241437,48.96899,0.9,housenumber,53 Rue du Général Leclerc 14420 Potigny,14516_0340_00053,G,53 RUE DU GENERAL LECLERC,
323791665,00017,32379166500017,O,1981-10-01,NN,,,2020-01-14T04:06:58,true,4,,,,RUE,DU GENERAL LECLERC,14420,POTIGNY,,,14516,,,,,,,,,,,,,,,,,,,2019-06-30,F,,,,,86.90D,NAFRev2,N,-0.244977,48.97512,0.94,street,Rue du Général Leclerc 14420 Potigny,14516_0340,G,RUE DU GENERAL LECLERC,
324539303,00028,32453930300028,O,,,,,,true,1,,28,,RUE,DU GENERAL LECLERC,14420,POTIGNY,,,14516,,,,,,,,,,,,,,,,,,,1985-12-25,F,,,,,64.46,NAP,N,-0.242928,48.971362,0.94,housenumber,28 Rue du Général Leclerc 14420 Potigny,14516_0340_00028,G,28 RUE DU GENERAL LECLERC,
325009892,00028,32500989200028,O,1999-09-01,NN,,,2008-11-07T00:42:07,false,4,,41,B,RUE,DU GENERAL LECLERC,14420,POTIGNY,,,14516,,,,,,,,,,,,,,,,,,,2006-07-01,F,,,,,93.0D,NAFRev1,N,-0.242802,48.971382,0.88,housenumber,41 b Rue du Général Leclerc 14420 Potigny,14516_0340_00041_b,G,41 B RUE DU GENERAL LECLERC,
326855152,00012,32685515200012,O,1982-02-01,NN,,,2018-12-07T04:53:06,true,4,,69,,AV,GENERAL LECLERC,14420,POTIGNY,,,14516,,,,,,,,,,,,,,,,,,,2018-12-31,F,,,,,86.21Z,NAFRev2,N,-0.240822,48.968073,0.77,housenumber,69 Rue du Général Leclerc 14420 Potigny,14516_0340_00069,G,69 RUE DU GENERAL LECLERC,
327451142,00035,32745114200035,O,2019-04-03,,,,2020-03-31T03:51:45,true,3,,6,,RUE,DE BANWELL,14420,POTIGNY,,,14516,,,,,,,,,,,,,,,,,,,2020-03-16,F,,,,,68.31Z,NAFRev2,N,-0.254579,48.970315,0.94,housenumber,6 Rue de Banwell 14420 Potigny,14516_0070_00006,G,6 RUE DE BANWELL,
327635249,00045,32763524900045,O,1995-05-05,NN,,,,true,1,,6,,RUE,DU GENERAL LECLERC,14420,POTIGNY,,,14516,,,,,,,,,,,,,,,,,,,2001-03-31,F,,,,,55.3A,NAF1993,O,-0.24442,48.973798,0.94,housenumber,6 Rue du Général Leclerc 14420 Potigny,14516_0340_00006,G,6 RUE DU GENERAL LECLERC,
328182290,00010,32818229000010,O,1983-01-01,NN,,,2008-01-04T19:36:01,true,3,,,,RUE,LOUIS LEFEVRE,14420,POTIGNY,,,14516,,,,,,,,,,,,,,,,,,,2008-01-01,A,,,,,01.11Z,NAFRev2,N,-0.242432,48.970292,0.94,street,Rue Louis Lefèvre 14420 Potigny,14516_0480,G,RUE LOUIS LEFEVRE,
328413968,00012,32841396800012,O,,NN,,,,true,1,,,,RUE,MARECHAL LECLERC,14420,POTIGNY,,,14516,,,,,,,,,,,,,,,,,,,,F,,,,,81.21,NAP,N,-0.244977,48.97512,0.59,street,Rue du Général Leclerc 14420 Potigny,14516_0340,G,RUE DU GENERAL LECLERC,
328622154,00024,32862215400024,O,,NN,,,,true,1,,,,LD,LES CARRIERES,14420,POTIGNY,,,14516,,,,,,,,,,,,,,,,,,,,F,,,,,64.47,NAP,N,-0.246384,48.973698,0.94,street,Les Carrieres 14420 Potigny,14516_pwix9m,G,LES CARRIERES,
328681218,00025,32868121800025,O,1995-01-01,NN,,,2008-11-07T00:46:34,false,4,,69,B,RUE,DU GENERAL LECLERC,14420,POTIGNY,,,14516,,,,,,,,,,,,,,,,,,,1997-12-31,F,,,,,60.2E,NAF1993,O,-0.240803,48.968051,0.94,interpolation,69 Rue du Général Leclerc 14420 Potigny,,G,67 RUE DU GENERAL LECLERC,
328681218,00041,32868121800041,O,2003-04-01,NN,,4932ZA,2015-03-18T01:01:29,true,4,,45,,,CLOS MICHEL,14420,POTIGNY,,,14516,,,,,,,,,,,,,,,,,,,2015-01-31,F,,,,,49.32Z,NAFRev2,N,-0.250199,48.97247,0.88,housenumber,45 Le Clos Michel 14420 Potigny,14516_b020_00045,G,45 LE CLOS MICHEL,
328793294,00013,32879329400013,O,1900-01-01,,,,2012-03-20T07:47:49,false,2,,65,,RUE,GENERAL LECLERC,14420,POTIGNY,,,14516,,,,,,,,,,,,,,,,,,,1985-12-25,F,,,,,55.60,NAP,N,-0.241069,48.968368,0.9,housenumber,65 Rue du Général Leclerc 14420 Potigny,14516_0340_00065,G,65 RUE DU GENERAL LECLERC,
329759146,00031,32975914600031,O,,NN,,,,true,1,,,,RUE,DU GENERAL LECLERC,14420,POTIGNY,,,14516,,,,,,,,,,,,,,,,,,,1991-03-30,F,,,,,84.12,NAP,N,-0.244977,48.97512,0.94,street,Rue du Général Leclerc 14420 Potigny,14516_0340,G,RUE DU GENERAL LECLERC,
329960223,00017,32996022300017,O,,,,,,true,1,,38,,RUE,DU GENERAL LECLERC,14420,POTIGNY,,,14516,,,,,,,,,,,,,,,,,,,1985-12-25,F,,,,,38.40,NAP,N,-0.242293,48.970171,0.94,housenumber,38 Rue du Général Leclerc 14420 Potigny,14516_0340_00038,G,38 RUE DU GENERAL LECLERC,
332141415,00023,33214141500023,O,1994-08-01,NN,,,,true,1,,,,,BONS TASSILLY,14420,POTIGNY,,,14516,,,,,,,,,,,,,,,,,,,2001-04-01,F,,,,,51.1T,NAF1993,N,-0.2296135,48.9591514,0.9,poi.townhall,Mairie (Hôtel de ville) Bons-Tassilly,https://osm.org/node/2446837905,G,,
332188226,00036,33218822600036,O,1993-03-12,NN,,,2010-04-18T04:29:37,false,5,ZI,,,CHE,DES CANTINES,14420,POTIGNY,,,14516,,,,,,,,,,,,,,,,,,,2008-03-10,F,,,,,13.94Z,NAFRev2,O,-0.246134,48.970444,0.54,street,Rue des Capucines 14420 Potigny,14516_0100,G,RUE DES CAPUCINES,
332546860,00021,33254686000021,O,1987-07-01,NN,,,2008-11-07T00:51:53,false,4,,23,,RUE,GENERAL LECLERC,14420,POTIGNY,,,14516,,,,,,,,,,,,,,,,,,,1997-02-17,F,,,,,93.0D,NAF1993,O,-0.243502,48.972605,0.9,housenumber,23 Rue du Général Leclerc 14420 Potigny,14516_0340_00023,G,23 RUE DU GENERAL LECLERC,
332592179,00011,33259217900011,O,1985-04-01,NN,,,,true,1,,53,,RUE,GENERAL LECLERC,14420,POTIGNY,,,14516,,,,,,,,,,,,,,,,,,,2000-12-31,F,,,,,50.1Z,NAF1993,N,-0.241437,48.96899,0.9,housenumber,53 Rue du Général Leclerc 14420 Potigny,14516_0340_00053,G,53 RUE DU GENERAL LECLERC,
333908226,00017,33390822600017,O,1985-10-05,NN,,,,true,1,,28,,RUE,DU GENERAL LECLERC,14420,POTIGNY,,,14516,,,,,,,,,,,,,,,,,,,1999-01-27,F,,,,,52.4X,NAF1993,N,-0.242928,48.971362,0.94,housenumber,28 Rue du Général Leclerc 14420 Potigny,14516_0340_00028,G,28 RUE DU GENERAL LECLERC,
334346178,00026,33434617800026,O,1987-10-15,00,2018,,2020-08-25T10:36:42,true,5,,,,RUE,GENERAL LECLERC,14420,POTIGNY,,BP 8,14516,,,,,,,,,,,,,,,,,,,2019-07-31,F,,,,,80.10Z,NAFRev2,O,-0.244977,48.97512,0.89,street,Rue du Général Leclerc 14420 Potigny,14516_0340,G,RUE DU GENERAL LECLERC,
335540605,00011,33554060500011,O,,NN,,,,true,1,,40,,RUE,GENERAL LECLERC,14420,POTIGNY,,,14516,,,,,,,,,,,,,,,,,,,1994-03-31,F,,,,,52.4V,NAF1993,O,-0.24217,48.97004,0.9,housenumber,40 Rue du Général Leclerc 14420 Potigny,14516_0340_00040,G,40 RUE DU GENERAL LECLERC,
335540761,00012,33554076100012,O,1900-01-01,,,,,false,3,,,,RUE,L LEFEVRE,14420,POTIGNY,,,14516,,,,,,,,,,,,,,,,,,,1993-12-31,F,,,,,70.2C,NAF1993,N,-0.242432,48.970292,0.81,street,Rue Louis Lefèvre 14420 Potigny,14516_0480,G,RUE LOUIS LEFEVRE,
335540761,00020,33554076100020,O,1993-12-31,NN,,,2006-10-27T02:44:51,true,3,,24,,RUE,GENERAL LECLERC,14420,POTIGNY,,,14516,,,,,,,,,,,,,,,,,,,2004-02-25,F,,,,,70.2C,NAFRev1,N,-0.243138,48.971705,0.9,housenumber,24 Rue du Général Leclerc 14420 Potigny,14516_0340_00024,G,24 RUE DU GENERAL LECLERC,
335542593,00017,33554259300017,O,,NN,,,,true,1,,39,,RUE,GENERAL LECLERC,14420,POTIGNY,,,14516,,,,,,,,,,,,,,,,,,,,F,,,,,64.41,NAP,N,-0.242853,48.971476,0.9,housenumber,39 Rue du Général Leclerc 14420 Potigny,14516_0340_00039,G,39 RUE DU GENERAL LECLERC,
335542783,00014,33554278300014,O,,,,,,true,1,,34,,RUE,GENERAL LECLERC,14420,POTIGNY,,,14516,,,,,,,,,,,,,,,,,,,1985-12-25,F,,,,,87.03,NAP,N,-0.242641,48.970861,0.9,housenumber,34 Rue du Général Leclerc 14420 Potigny,14516_0340_00034,G,34 RUE DU GENERAL LECLERC,
335543443,00014,33554344300014,O,,,,,,true,1,,,,RUE,MAR LECLERC,14420,POTIGNY,,,14516,,,,,,,,,,,,,,,,,,,1984-12-25,F,,,,,81.21,NAP,N,-0.244977,48.97512,0.65,street,Rue du Général Leclerc 14420 Potigny,14516_0340,G,RUE DU GENERAL LECLERC,
335640371,00019,33564037100019,O,,NN,,,,true,1,,,,RUE,L LEFEVRE,14420,POTIGNY,,,14516,,,,,,,,,,,,,,,,,,,1988-02-09,F,,,,,52.1B,NAF1993,N,-0.242432,48.970292,0.81,street,Rue Louis Lefèvre 14420 Potigny,14516_0480,G,RUE LOUIS LEFEVRE,
335840088,00017,33584008800017,O,,,,,,true,1,,26,,RUE,GEN LECLERC,14420,POTIGNY,,,14516,,,,,,,,,,,,,,,,,,,1990-06-30,F,,,,,67.05,NAP,N,-0.242987,48.971456,0.79,housenumber,26 Rue du Général Leclerc 14420 Potigny,14516_0340_00026,G,26 RUE DU GENERAL LECLERC,
335841094,00014,33584109400014,O,,,,,,true,1,,,,RUE,DU GENERAL LECLERC,14420,POTIGNY,,,14516,,,,,,,,,,,,,,,,,,,1984-12-25,F,,,,,65.06,NAP,N,-0.244977,48.97512,0.94,street,Rue du Général Leclerc 14420 Potigny,14516_0340,G,RUE DU GENERAL LECLERC,
335841102,00015,33584110200015,O,,,,,,true,1,,,,RUE,L BOUILLARD,14420,POTIGNY,,,14516,,,,,,,,,,,,,,,,,,,1984-12-25,F,,,,,62.43,NAP,N,-0.249557,48.971236,0.83,street,Rue Louis Bouillard 14420 Potigny,14516_0460,G,RUE LOUIS BOUILLARD,
335941068,00017,33594106800017,O,,NN,,,,true,1,,,,RUE,GEN LECLERC,14420,POTIGNY,,,14516,,,,,,,,,,,,,,,,,,,1990-01-21,F,,,,,67.04,NAP,N,-0.244977,48.97512,0.77,street,Rue du Général Leclerc 14420 Potigny,14516_0340,G,RUE DU GENERAL LECLERC,
335941456,00014,33594145600014,O,,NN,,,,true,1,,,,RUE,DAISY,14420,POTIGNY,,,14516,,,,,,,,,,,,,,,,,,,1990-06-02,F,,,,,67.01,NAP,N,-0.241912,48.973176,0.57,street,Rue du Tais 14420 Potigny,14516_0840,G,RUE DU TAIS,
336041447,00010,33604144700010,O,,,,,,true,1,,2,,RUE,DE LA GARE,14420,POTIGNY,,,14516,,,,,,,,,,,,,,,,,,,,F,,,,,67.07,NAP,N,-0.255021,48.96997,0.67,housenumber,2 Chemin de la Gare 14420 Potigny,14516_0280_00002,G,2 CHEMIN DE LA GARE,
336140645,00019,33614064500019,O,,,,,,true,1,,,,RUE,GENERAL LECLERC,14420,POTIGNY,,,14516,,,,,,,,,,,,,,,,,,,1984-12-25,F,,,,,65.06,NAP,N,-0.244977,48.97512,0.89,street,Rue du Général Leclerc 14420 Potigny,14516_0340,G,RUE DU GENERAL LECLERC,
336240163,00012,33624016300012,O,,,,,,true,1,,,,,,14420,POTIGNY,,,14516,,,,,,,,,,,,,,,,,,,1987-12-31,F,,,,,67.07,NAP,N,,,0,,,,,,
336240478,00014,33624047800014,O,,,,,,true,1,,66,,RUE,NATIONALE,14420,POTIGNY,,,14516,,,,,,,,,,,,,,,,,,,,F,,,,,67.01,NAP,N,-0.248856,48.970431,0.46,housenumber,66 Rue de la Cooperative 14420 Potigny,14516_0210_00066,G,66 RUE DE LA COOPERATIVE,