siren,nic,siret,statutDiffusionEtablissement,dateCreationEtablissement,trancheEffectifsEtablissement,anneeEffectifsEtablissement,activitePrincipaleRegistreMetiersEtablissement,dateDernierTraitementEtablissement,etablissementSiege,nombrePeriodesEtablissement,complementAdresseEtablissement,numeroVoieEtablissement,indiceRepetitionEtablissement,typeVoieEtablissement,libelleVoieEtablissement,codePostalEtablissement,libelleCommuneEtablissement,libelleCommuneEtrangerEtablissement,distributionSpecialeEtablissement,codeCommuneEtablissement,codeCedexEtablissement,libelleCedexEtablissement,codePaysEtrangerEtablissement,libellePaysEtrangerEtablissement,complementAdresse2Etablissement,numeroVoie2Etablissement,indiceRepetition2Etablissement,typeVoie2Etablissement,libelleVoie2Etablissement,codePostal2Etablissement,libelleCommune2Etablissement,libelleCommuneEtranger2Etablissement,distributionSpeciale2Etablissement,codeCommune2Etablissement,codeCedex2Etablissement,libelleCedex2Etablissement,codePaysEtranger2Etablissement,libellePaysEtranger2Etablissement,dateDebut,etatAdministratifEtablissement,enseigne1Etablissement,enseigne2Etablissement,enseigne3Etablissement,denominationUsuelleEtablissement,activitePrincipaleEtablissement,nomenclatureActivitePrincipaleEtablissement,caractereEmployeurEtablissement,longitude,latitude,geo_score,geo_type,geo_adresse,geo_id,geo_ligne,geo_l4,geo_l5
300159068,00018,30015906800018,O,,NN,,,2019-01-14T08:51:41,true,1,,,,,,19120,BRIVEZAC,,,19032,,,,,,,,,,,,,,,,,,,1996-10-15,F,,,,,45.4C,NAF1993,N,,,0,,,,,,
311443287,00017,31144328700017,O,,NN,,,2019-01-14T08:51:41,true,1,,,,,,19120,BRIVEZAC,,,19032,,,,,,,,,,,,,,,,,,,,F,,,,,00.10,NAP,N,,,0,,,,,,
319560892,00014,31956089200014,O,,NN,,,2019-01-14T08:51:41,true,1,,,,,,19120,BRIVEZAC,,,19032,,,,,,,,,,,,,,,,,,,,F,,,,,00.10,NAP,N,,,0,,,,,,
319560900,00015,31956090000015,O,,NN,,,2019-01-14T08:51:41,true,1,,,,,LE BOURG,19120,BRIVEZAC,,,19032,,,,,,,,,,,,,,,,,,,1987-12-31,F,,,,,62.41,NAP,N,1.840323,45.025767,0.94,street,Le Bourg 19120 Beaulieu-sur-Dordogne,19019_bywuwc,G,LE BOURG,
325879096,00015,32587909600015,O,,NN,,,2019-01-14T08:51:41,true,1,,,,,LA ROUGERIE,19120,BRIVEZAC,,,19032,,,,,,,,,,,,,,,,,,,1995-12-25,F,,,,,70.2A,NAF1993,N,1.832558,45.009745,0.55,locality,La Cote Rouge (Brivezac) 19120 Beaulieu-sur-Dordogne,19032_b025,G,LA COTE ROUGE,BRIVEZAC
344311188,00017,34431118800017,O,,NN,,,2019-01-14T08:51:41,true,1,,,,,AU BOURG,19120,BRIVEZAC,,,19032,,,,,,,,,,,,,,,,,,,1992-12-31,F,,,,,55.3A,NAF1993,N,1.840323,45.025767,0.61,street,Le Bourg 19120 Beaulieu-sur-Dordogne,19019_bywuwc,G,LE BOURG,
344372107,00013,34437210700013,O,,NN,,,2019-01-14T08:51:41,true,1,,,,,LE BOURG,19120,BRIVEZAC,,,19032,,,,,,,,,,,,,,,,,,,1989-03-31,F,,,,,55.72,NAP,N,1.840323,45.025767,0.94,street,Le Bourg 19120 Beaulieu-sur-Dordogne,19019_bywuwc,G,LE BOURG,
349275784,00016,34927578400016,O,,,,,2019-01-14T08:51:41,true,1,,,,,BOURG,19120,BRIVEZAC,,,19032,,,,,,,,,,,,,,,,,,,1996-12-31,F,,,,,01.1A,NAF1993,N,1.840323,45.025767,0.92,street,Le Bourg 19120 Beaulieu-sur-Dordogne,19019_bywuwc,G,LE BOURG,
351148457,00010,35114845700010,O,,NN,,,2019-01-14T08:51:41,true,1,,,,LD,CHAMPS DE RODANGES,19120,BRIVEZAC,,,19032,,,,,,,,,,,,,,,,,,,1992-08-30,F,,,,,55.4B,NAF1993,N,1.845946,45.033868,0.6,street,Route de Rodanges 19120 Beaulieu-sur-Dordogne,19019_oa3qk6,G,ROUTE DE RODANGES,
378571046,00010,37857104600010,O,,NN,,,2019-01-14T08:51:41,true,1,,,,,BOURGNEAU,19120,BRIVEZAC,,,19032,,,,,,,,,,,,,,,,,,,1993-08-31,F,,,,,71.4B,NAF1993,O,,,0,,,,,,
385331145,00032,38533114500032,O,1900-01-01,NN,,,2019-01-14T08:51:41,false,3,,,,,VALEYRAN,19120,BRIVEZAC,,,19032,,,,,,,,,,,,,,,,,,,2004-12-25,F,,,,,55.2C,NAFRev1,N,1.849842,45.008175,0.91,street,Chemin de Valeyran 19120 Beaulieu-sur-Dordogne,19019_e46s6k,G,CHEMIN DE VALEYRAN,
389110891,00014,38911089100014,O,1981-01-01,,,,2019-01-14T08:51:41,true,1,,,,LD,CHAPOUX,19120,BRIVEZAC,,,19032,,,,,,,,,,,,,,,,,,,2001-06-30,F,,,,,01.2A,NAF1993,N,1.845859,45.026269,0.57,locality,Champs du Cheyroux (Brivezac) 19120 Beaulieu-sur-Dordogne,19032_b015,G,CHAMPS DU CHEYROUX,BRIVEZAC
389111253,00016,38911125300016,O,,,,,2019-01-14T08:51:41,true,1,,,,,CHERAC,19120,BRIVEZAC,,,19032,,,,,,,,,,,,,,,,,,,1994-12-31,F,,,,,01.1A,NAF1993,N,1.845859,45.026269,0.51,locality,Champs du Cheyroux (Brivezac) 19120 Beaulieu-sur-Dordogne,19032_b015,G,CHAMPS DU CHEYROUX,BRIVEZAC
390435741,00017,39043574100017,O,1993-01-01,NN,,,2019-01-14T08:51:41,true,1,,,,LD,CHIRAC,19120,BRIVEZAC,,,19032,,,,,,,,,,,,,,,,,,,1998-12-31,F,,,,,01.2A,NAF1993,N,1.822186,45.015683,0.91,street,Route de Chirac 19120 Beaulieu-sur-Dordogne,19019_icxkbn,G,ROUTE DE CHIRAC,
401270681,00018,40127068100018,O,1995-04-03,NN,,,2019-01-14T08:51:41,true,1,,,,,LE BOURG,19120,BRIVEZAC,,,19032,,,,,,,,,,,,,,,,,,,1998-03-31,F,,,,,74.1J,NAF1993,N,1.840323,45.025767,0.94,street,Le Bourg 19120 Beaulieu-sur-Dordogne,19019_bywuwc,G,LE BOURG,
401810049,00015,40181004900015,O,1995-06-01,NN,,,2019-01-14T08:51:41,true,1,,,,,,19120,BRIVEZAC,,,19032,,,,,,,,,,,,,,,,,,,2001-12-31,F,,,,,01.3Z,NAF1993,N,,,0,,,,,,
409621091,00019,40962109100019,O,1982-12-31,NN,,,2019-01-14T08:51:41,true,1,,,,,LE BOURG,19120,BRIVEZAC,,,19032,,,,,,,,,,,,,,,,,,,1998-12-02,F,,,,,01.3Z,NAF1993,N,1.840323,45.025767,0.94,street,Le Bourg 19120 Beaulieu-sur-Dordogne,19019_bywuwc,G,LE BOURG,
409621125,00015,40962112500015,O,1987-12-31,NN,,,2019-01-14T08:51:41,true,1,,,,,RODANGES,19120,BRIVEZAC,,,19032,,,,,,,,,,,,,,,,,,,2000-01-31,F,,,,,01.3Z,NAF1993,N,1.845946,45.033868,0.92,street,Route de Rodanges 19120 Beaulieu-sur-Dordogne,19019_oa3qk6,G,ROUTE DE RODANGES,
409621133,00019,40962113300019,O,1981-01-01,NN,,,2019-01-14T08:51:41,true,1,,,,,PEYRIGET,19120,BRIVEZAC,,,19032,,,,,,,,,,,,,,,,,,,2001-03-20,F,,,,,01.3Z,NAF1993,N,1.839419,45.02566,0.91,street,Route du Peyriget (Brivezac) 19120 Beaulieu-sur-Dordogne,19019_gki4wf,G,ROUTE DU PEYRIGET,BRIVEZAC
482266350,00016,48226635000016,O,,NN,,,2019-01-14T08:51:41,true,1,,,,,VALEYRAN,19120,BRIVEZAC,,,19032,,,,,,,,,,,,,,,,,,,2005-05-01,F,,,,,55.2C,NAFRev1,N,1.849842,45.008175,0.91,street,Chemin de Valeyran 19120 Beaulieu-sur-Dordogne,19019_e46s6k,G,CHEMIN DE VALEYRAN,
675512693,00010,67551269300010,O,,NN,,,2019-01-14T08:51:41,true,1,,,,,AU BOURG,19120,BRIVEZAC,,,19032,,,,,,,,,,,,,,,,,,,1988-02-18,F,,,,,67.01,NAP,N,1.840323,45.025767,0.61,street,Le Bourg 19120 Beaulieu-sur-Dordogne,19019_bywuwc,G,LE BOURG,
675611685,00016,67561168500016,O,,NN,,,2019-01-14T08:51:41,true,1,,,,LD,LA CHAMPAGNE,19120,BRIVEZAC,,,19032,,,,,,,,,,,,,,,,,,,1987-06-26,F,,,,,48.01,NAP,N,1.826772,45.00803,0.51,street,Chemin du Champ 19120 Beaulieu-sur-Dordogne,19019_z7z3ry,G,CHEMIN DU CHAMP,
675611842,00013,67561184200013,O,,,,,2019-01-14T08:51:41,true,1,,,,,,19120,BRIVEZAC,,,19032,,,,,,,,,,,,,,,,,,,1984-12-25,F,,,,,00.97,NAP,N,,,0,,,,,,
675814602,00016,67581460200016,O,,,,,2019-01-14T08:51:41,true,1,,,,,,19120,BRIVEZAC,,,19032,,,,,,,,,,,,,,,,,,,1984-12-25,F,,,,,64.22,NAP,N,,,0,,,,,,
675914337,00018,67591433700018,O,,NN,,,2019-01-14T08:51:41,true,1,,,,,LE BOURG,19120,BRIVEZAC,,,19032,,,,,,,,,,,,,,,,,,,,F,,,,,00.10,NAP,N,1.840323,45.025767,0.94,street,Le Bourg 19120 Beaulieu-sur-Dordogne,19019_bywuwc,G,LE BOURG,
676311004,00011,67631100400011,O,,NN,,,2019-01-14T08:51:41,true,1,,,,,LE BOURG,19120,BRIVEZAC,,,19032,,,,,,,,,,,,,,,,,,,1988-06-30,F,,,,,67.01,NAP,N,1.840323,45.025767,0.94,street,Le Bourg 19120 Beaulieu-sur-Dordogne,19019_bywuwc,G,LE BOURG,
676810542,00016,67681054200016,O,1965-01-01,NN,,,2019-01-14T08:51:41,true,1,,,,,,19120,BRIVEZAC,,,19032,,,,,,,,,,,,,,,,,,,2001-09-02,F,,,,,15.8C,NAF1993,N,,,0,,,,,,
777927526,00015,77792752600015,O,,NN,,,2019-01-14T08:51:41,true,1,,,,,LE BOURG,19120,BRIVEZAC,,,19032,,,,,,,,,,,,,,,,,,,,F,,,,,57.03,NAP,N,1.840323,45.025767,0.94,street,Le Bourg 19120 Beaulieu-sur-Dordogne,19019_bywuwc,G,LE BOURG,
777927542,00012,77792754200012,O,,,,,2019-01-14T08:51:41,true,1,,,,,LE BOURG,19120,BRIVEZAC,,,19032,,,,,,,,,,,,,,,,,,,1994-03-31,F,,,,,52.1B,NAF1993,N,1.840323,45.025767,0.94,street,Le Bourg 19120 Beaulieu-sur-Dordogne,19019_bywuwc,G,LE BOURG,
