siren,nic,siret,statutDiffusionEtablissement,dateCreationEtablissement,trancheEffectifsEtablissement,anneeEffectifsEtablissement,activitePrincipaleRegistreMetiersEtablissement,dateDernierTraitementEtablissement,etablissementSiege,nombrePeriodesEtablissement,complementAdresseEtablissement,numeroVoieEtablissement,indiceRepetitionEtablissement,typeVoieEtablissement,libelleVoieEtablissement,codePostalEtablissement,libelleCommuneEtablissement,libelleCommuneEtrangerEtablissement,distributionSpecialeEtablissement,codeCommuneEtablissement,codeCedexEtablissement,libelleCedexEtablissement,codePaysEtrangerEtablissement,libellePaysEtrangerEtablissement,complementAdresse2Etablissement,numeroVoie2Etablissement,indiceRepetition2Etablissement,typeVoie2Etablissement,libelleVoie2Etablissement,codePostal2Etablissement,libelleCommune2Etablissement,libelleCommuneEtranger2Etablissement,distributionSpeciale2Etablissement,codeCommune2Etablissement,codeCedex2Etablissement,libelleCedex2Etablissement,codePaysEtranger2Etablissement,libellePaysEtranger2Etablissement,dateDebut,etatAdministratifEtablissement,enseigne1Etablissement,enseigne2Etablissement,enseigne3Etablissement,denominationUsuelleEtablissement,activitePrincipaleEtablissement,nomenclatureActivitePrincipaleEtablissement,caractereEmployeurEtablissement,longitude,latitude,geo_score,geo_type,geo_adresse,geo_id,geo_ligne,geo_l4,geo_l5
200076487,00012,20007648700012,O,2018-01-01,03,2018,,2020-08-25T10:15:18,true,1,,8,,RTE,DE CONCHES,27190,LE VAL-DORE,,,27447,,,,,,,,,,,,,,,,,,,2018-01-01,A,MAIRIE,,,,84.11Z,NAFRev2,O,1.028311,48.937312,0.83,housenumber,8 Route de Conches 27190 Le Val-Doré,27447_0008_00008,G,8 ROUTE DE CONCHES,
200076487,00020,20007648700020,O,2018-01-01,,,,2018-01-02T14:59:02,false,1,,2,,RUE,DE L'EGLISE,27190,LE VAL-DORE,,,27447,,,,,,,,,,,,,,,,,,,2018-01-01,A,COMMUNE DELEGUEE DE LE FRESNE,,,,84.11Z,NAFRev2,N,0.977699,48.94962,0.94,housenumber,2 Rue de l'Eglise 27190 Le Val-Doré,27268_0016_00002,G,2 RUE DE L EGLISE,
200076487,00038,20007648700038,O,2018-01-01,,,,2018-01-02T14:59:07,false,1,,,,RTE,NOGENT,27190,LE VAL-DORE,,,27447,,,,,,,,,,,,,,,,,,,2018-01-01,A,COMMUNE DELEGUEE DE LE MESNIL-HARDRAY,,,,84.11Z,NAFRev2,N,0.977786,48.935926,0.68,street,Rue de Nogent 27190 Le Val-Doré,27402_0047,G,RUE DE NOGENT,
200076487,00046,20007648700046,O,2018-01-01,,,,2017-09-28T15:20:17,false,1,,8,,RTE,DE CONCHES,27190,LE VAL-DORE,,,27447,,,,,,,,,,,,,,,,,,,2018-01-01,A,COMMUNE DELEGUEE D'ORVAUX,,,,84.11Z,NAFRev2,N,1.028311,48.937312,0.83,housenumber,8 Route de Conches 27190 Le Val-Doré,27447_0008_00008,G,8 ROUTE DE CONCHES,
200076487,00053,20007648700053,O,2018-01-01,01,2018,,2020-08-25T10:15:18,false,1,,8,,RTE,DE CONCHES,27190,LE VAL-DORE,,,27447,,,,,,,,,,,,,,,,,,,2018-01-01,A,ECOLE PRIMAIRE,,,,85.20Z,NAFRev2,N,1.028311,48.937312,0.83,housenumber,8 Route de Conches 27190 Le Val-Doré,27447_0008_00008,G,8 ROUTE DE CONCHES,
200080000,00017,20008000000017,O,2018-01-11,,,,2018-02-22T14:32:28,true,1,MAIRIE,8,,RTE,DE CONCHES,27190,LE VAL-DORE,,,27447,,,,,,,,,,,,,,,,,,,2018-01-11,A,,,,,88.99B,NAFRev2,N,1.028311,48.937312,0.83,housenumber,8 Route de Conches 27190 Le Val-Doré,27447_0008_00008,G,8 ROUTE DE CONCHES,
212702682,00015,21270268200015,O,1983-03-01,01,2017,,2019-06-24T13:09:59,true,4,,2,,RUE,DE L'EGLISE,27190,LE VAL-DORE,,,27447,,,,,,,,,,,,,,,,,,,2018-01-01,F,MAIRIE,,,,84.11Z,NAFRev2,N,0.977699,48.94962,0.94,housenumber,2 Rue de l'Eglise 27190 Le Val-Doré,27268_0016_00002,G,2 RUE DE L EGLISE,
212704027,00011,21270402700011,O,1983-03-01,01,2017,,2019-06-24T13:10:00,true,5,,,,RTE,DE NOGENT,27190,LE VAL-DORE,,,27447,,,,,,,,,,,,,,,,,,,2018-01-01,F,MAIRIE,,,,84.11Z,NAFRev2,O,0.977786,48.935926,0.74,street,Rue de Nogent 27190 Le Val-Doré,27402_0047,G,RUE DE NOGENT,
212704472,00019,21270447200019,O,1983-03-01,02,2017,,2019-06-24T13:10:00,true,5,,8,,RTE,DES CONCHES,27190,LE VAL-DORE,,,27447,,,,,,,,,,,,,,,,,,,2018-01-01,F,MAIRIE,,,,84.11Z,NAFRev2,O,1.028311,48.937312,0.72,housenumber,8 Route de Conches 27190 Le Val-Doré,27447_0008_00008,G,8 ROUTE DE CONCHES,
212704472,00027,21270447200027,O,1983-12-21,00,2018,,2020-08-25T10:16:29,false,5,,8,,RUE,DE CONCHES,27190,LE VAL-DORE,,,27447,,,,,,,,PL,DE LA MAIRIE,27190,LE VAL-DORE,,,27447,,,,,2018-01-01,F,ECOLE ELEMENTAIRE PUBLIQUE,,,,85.20Z,NAFRev2,N,1.028311,48.937312,0.78,housenumber,8 Route de Conches 27190 Le Val-Doré,27447_0008_00008,G,8 ROUTE DE CONCHES,
262703325,00015,26270332500015,O,1995-12-25,NN,,,2018-01-02T14:27:37,true,3,,,,RTE,DE NOGENT,27190,LE VAL-DORE,,,27447,,,,,,,,,,,,,,,,,,,2015-12-31,F,CCAS,,,,88.99B,NAFRev2,N,0.977786,48.935926,0.74,street,Rue de Nogent 27190 Le Val-Doré,27402_0047,G,RUE DE NOGENT,
262705098,00016,26270509800016,O,1995-12-25,,,,2018-02-11T18:13:26,true,3,MAIRIE,8,,RTE,DES CONCHES,27190,LE VAL-DORE,,,27447,,,,,,,,,,,,,,,,,,,2018-01-01,F,CCAS,,,,88.99B,NAFRev2,N,1.028311,48.937312,0.72,housenumber,8 Route de Conches 27190 Le Val-Doré,27447_0008_00008,G,8 ROUTE DE CONCHES,
262705155,00014,26270515500014,O,1995-12-25,,,,2018-02-11T18:13:26,true,3,MAIRIE,2,,RUE,DE L'EGLISE,27190,LE VAL-DORE,,,27447,,,,,,,,,,,,,,,,,,,2017-08-01,F,CCAS,,,,88.99B,NAFRev2,N,0.977699,48.94962,0.94,housenumber,2 Rue de l'Eglise 27190 Le Val-Doré,27268_0016_00002,G,2 RUE DE L EGLISE,
305245805,00018,30524580500018,O,1900-01-01,02,2018,,2020-08-25T10:23:07,true,8,,,,,LE BOSHION,27190,LE VAL-DORE,,,27447,,,,,,,,,,,,,,,,,,,2015-03-31,A,,,,,71.11Z,NAFRev2,N,1.007925,48.943783,0.94,street,Le Boshion 27190 Le Val-Doré,27447_sxll8d,G,LE BOSHION,
307723247,00028,30772324700028,O,1900-01-01,NN,,,2018-01-02T14:59:03,true,3,,,,,,27190,LE VAL-DORE,,,27447,,,,,,,,,,,,,,,,,,,1998-12-25,F,,,,,92.6C,NAF1993,N,,,0,,,,,,
309208320,00015,30920832000015,O,,NN,,,,true,1,,,,,,27190,LE VAL-DORE,,,27447,,,,,,,,,,,,,,,,,,,1995-06-30,F,,,,,74.1G,NAF1993,N,,,0,,,,,,
310295175,00015,31029517500015,O,1977-01-01,NN,,,2008-11-07T00:25:11,true,3,,86,,ALL,DES MESANGES,27190,LE VAL-DORE,,,27447,,,,,,,,,,,,,,,,,,,2005-03-31,F,,,,,45.3E,NAFRev1,N,1.02684,48.943663,0.87,housenumber,86 Allée des Mesanges 27190 Le Val-Doré,27447_0019_00086,G,86 ALLEE DES MESANGES,
310536883,00013,31053688300013,O,,,,,,true,1,,,,,,27190,LE VAL-DORE,,,27447,,,,,,,,,,,,,,,,,,,2002-09-23,F,,,,,51.1R,NAF1993,N,,,0,,,,,,
315372367,00021,31537236700021,O,1980-07-01,NN,,,2009-06-27T04:04:50,true,4,,,,,,27190,LE VAL-DORE,,,27447,,,,,,,,,,,,,,,,,,,2007-09-30,F,,,,,45.2J,NAFRev1,O,,,0,,,,,,
319532503,00053,31953250300053,O,2008-05-01,,,,2018-01-02T14:56:41,true,1,,2,,RUE,DE LA PLAINE,27190,LE VAL-DORE,,,27447,,,,,,,,,,,,,,,,,,,2008-05-01,A,,,,,70.22Z,NAFRev2,N,0.97686,48.948901,0.92,housenumber,2 Rue de la Plaine (Le Fresne) 27190 Le Val-Doré,27268_0027_00002,G,2 RUE DE LA PLAINE,LE FRESNE
321489726,00026,32148972600026,O,1992-01-01,NN,,,2018-01-05T04:10:25,true,3,,2,,RUE,DU LAVOIR,27190,LE VAL-DORE,,,27447,,,,,,,,,,,,,,,,,,,2008-01-01,A,,,,,01.11Z,NAFRev2,N,0.971742,48.951379,0.94,housenumber,2 Rue du Lavoir 27190 Le Val-Doré,27268_0024_00002,G,2 RUE DU LAVOIR,
322400938,00047,32240093800047,O,2002-12-03,NN,,,2018-01-02T14:59:01,true,3,,2,B,,LE BOUT AU MACON,27190,LE VAL-DORE,,,27447,,,,,,,,,,,,,,,,,,,2005-02-18,F,,,,,45.1A,NAFRev1,N,0.96699,48.9577,0.94,street,Le Bout au Maçon 27190 Le Val-Doré,27268_b007,G,LE BOUT AU MACON,
323248534,00014,32324853400014,O,,NN,,,,true,1,,96,,ALL,DES PIVERTS,27190,LE VAL-DORE,,,27447,,,,,,,,,,,,,,,,,,,1994-03-31,F,,,,,51.1R,NAF1993,N,1.02187,48.942405,0.87,housenumber,96 Allée des Piverts 27190 Le Val-Doré,27447_0027_00096,G,96 ALLEE DES PIVERTS,
323667162,00024,32366716200024,O,1984-04-14,,,,,true,4,,,,,,27190,LE VAL-DORE,,,27447,,,,,,,,,,,,,,,,,,,1991-12-25,F,,,,,77.14,NAP,N,,,0,,,,,,
325484897,00013,32548489700013,O,1982-10-01,NN,,,2019-03-30T04:06:04,true,4,,,,,LE BOSHION,27190,LE VAL-DORE,,,27447,,,,,,,,,,,,,,,,,,,2018-07-31,F,,,,,01.61Z,NAFRev2,N,1.007925,48.943783,0.94,street,Le Boshion 27190 Le Val-Doré,27447_sxll8d,G,LE BOSHION,
328596606,00017,32859660600017,O,1900-01-01,NN,,,2011-06-15T06:23:14,true,7,,28,,RTE,DE LA MAIRIE,27190,LE VAL-DORE,,,27447,,,,,,,,,,,,,,,,,,,2011-04-30,F,ATEC 27,,,,43.21A,NAFRev2,N,1.033436,48.940464,0.79,housenumber,28 Rue de la Mairie (Orvaux) 27190 Le Val-Doré,27447_0017_00028,G,28 RUE DE LA MAIRIE,ORVAUX
328800610,00011,32880061000011,O,1984-01-01,NN,,,2015-05-14T06:14:00,false,4,,,,,LE BOSHION,27190,LE VAL-DORE,,,27447,,,,,,,,,,,,,,,,,,,2013-12-23,F,,,,,01.41Z,NAFRev2,N,1.007925,48.943783,0.94,street,Le Boshion 27190 Le Val-Doré,27447_sxll8d,G,LE BOSHION,
328800610,00029,32880061000029,O,2013-12-23,01,2018,,2020-08-25T10:33:27,true,1,,10,,RUE,SAINT PIERRE,27190,LE VAL-DORE,,,27447,,,,,,,,,,,,,,,,,,,2013-12-23,A,,,,,01.41Z,NAFRev2,O,1.00801,48.940628,0.94,housenumber,10 Rue Saint-pierre 27190 Le Val-Doré,27447_0038_00010,G,10 RUE SAINT PIERRE,
329504682,00017,32950468200017,O,1984-03-01,NN,,,2018-01-02T14:56:43,true,4,,,,,FERME DU HELOUP,27190,LE VAL-DORE,,,27447,,,,,,,,,,,,,,,,,,,1995-12-31,F,,,,,01.1A,NAF1993,N,0.993064,48.946817,0.66,street,Rue du Heloup 27190 Le Val-Doré,27402_0028,G,RUE DU HELOUP,
330306127,00011,33030612700011,O,1983-01-01,NN,,,,false,3,,,,PL,DE L ECOLE,27190,LE VAL-DORE,,,27447,,,,,,,,,,,,,,,,,,,1994-03-19,F,,,,,91.3E,NAF1993,N,1.03355,48.933659,0.54,street,Route de Saint Andre de l'Eure 27190 Le Val-Doré,27447_1bpcfj,G,ROUTE DE SAINT ANDRE DE L EURE,
330370404,00023,33037040400023,O,,NN,,,,true,1,,33,,ALL,DES BOUVREUILS,27190,LE VAL-DORE,,,27447,,,,,,,,,,,,,,,,,,,1996-03-30,F,,,,,60.2L,NAF1993,N,1.027044,48.947207,0.88,housenumber,33 Allée des Bouvreuils 27190 Le Val-Doré,27447_0003_00033,G,33 ALLEE DES BOUVREUILS,
330939562,00014,33093956200014,O,,NN,,,,true,1,,96,,ALL,DES PIVERTS,27190,LE VAL-DORE,,,27447,,,,,,,,,,,,,,,,,,,,F,,,,,77.11,NAP,N,1.02187,48.942405,0.87,housenumber,96 Allée des Piverts 27190 Le Val-Doré,27447_0027_00096,G,96 ALLEE DES PIVERTS,
334780020,00015,33478002000015,O,1985-11-08,NN,,,2008-01-04T20:54:34,true,3,,,,,LE BOSHION,27190,LE VAL-DORE,,,27447,,,,,,,,,,,,,,,,,,,2008-01-01,A,,,,,46.11Z,NAFRev2,N,1.007925,48.943783,0.94,street,Le Boshion 27190 Le Val-Doré,27447_sxll8d,G,LE BOSHION,
338253131,09234,33825313109234,O,2004-03-15,NN,,,2018-01-02T14:56:41,false,4,VILLAGE EQUESTRE LE FRESNE,,,,L AULNAYE,27190,LE VAL-DORE,,,27447,,,,,,,,,,,,,,,,,,,2012-12-31,F,SODEXHO FRANCE ECOLES ET UNIVERSITES,,,,56.29A,NAFRev2,O,0.970104,48.977585,0.94,street,L'Aulnaye 27190 Le Val-Doré,27447_ijsn8k,G,L AULNAYE,
339986119,00024,33998611900024,O,1990-01-01,,,,2018-01-02T14:58:59,true,4,,,,RTE,D EVREUX,27190,LE VAL-DORE,,,27447,,,,,,,,,,,,,,,,,,,2008-01-01,A,,,,,47.76Z,NAFRev2,N,0.957516,48.960804,0.8,street,Route d'Evreux 27190 Le Val-Doré,27268_0021,G,ROUTE D EVREUX,
339986119,00032,33998611900032,O,1998-07-01,02,2018,,2020-08-25T10:38:58,false,4,,,,RTE,D EVREUX,27190,LE VAL-DORE,,,27447,,,,,,,,,,,,,,,,,,,2018-01-02,A,,,,,01.24Z,NAFRev2,O,0.957516,48.960804,0.8,street,Route d'Evreux 27190 Le Val-Doré,27268_0021,G,ROUTE D EVREUX,
340983071,00028,34098307100028,O,2009-09-15,,,,2012-11-09T00:34:54,false,2,AU GARAGE AUTO SAINT MARTIN,60,,ALL,DES PIVERTS,27190,LE VAL-DORE,,,27447,,,,,,,,,,,,,,,,,,,2010-01-01,F,,,,,45.20A,NAFRev2,N,1.023566,48.944534,0.87,housenumber,60 Allée des Piverts 27190 Le Val-Doré,27447_0027_00060,G,60 ALLEE DES PIVERTS,
341023414,00012,34102341400012,O,,NN,,,,true,1,,99,,ALL,,27190,LE VAL-DORE,,,27447,,,,,,,,,,,,,,,,,,,1991-03-15,F,,,,,55.40,NAP,N,1.021254,48.943158,0.78,housenumber,99 Allée des Piverts 27190 Le Val-Doré,27447_0027_00099,G,99 ALLEE DES PIVERTS,
348112467,00041,34811246700041,O,2000-01-01,NN,,,2018-01-02T14:56:40,false,4,,,,,Z I LES PISTES,27190,LE VAL-DORE,,,27447,,,,,,,,,,,,,,,,,,,2004-06-30,F,,,,,25.2C,NAFRev1,N,,,0,,,,,,
348431107,00013,34843110700013,O,1988-10-01,NN,,,2018-01-02T14:59:07,true,3,,,,,,27190,LE VAL-DORE,,,27447,,,,,,,,,,,,,,,,,,,2007-04-27,F,,,,,01.1A,NAFRev1,N,,,0,,,,,,
348942186,00019,34894218600019,O,,NN,,,,true,1,,,,LD,LE BOSHION,27190,LE VAL-DORE,,,27447,,,,,,,,,,,,,,,,,,,1993-12-31,F,,,,,01.1A,NAF1993,N,1.007925,48.943783,0.94,street,Le Boshion 27190 Le Val-Doré,27447_sxll8d,G,LE BOSHION,
349156968,00019,34915696800019,O,1989-01-02,NN,,,2018-01-02T14:56:39,true,5,LE BOUT AU MACON,,,RTE,D EVREUX,27190,LE VAL-DORE,,,27447,,,,,,,,,,,,,,,,,,,2010-12-31,F,,,,,33.20A,NAFRev2,O,0.957516,48.960804,0.8,street,Route d'Evreux 27190 Le Val-Doré,27268_0021,G,ROUTE D EVREUX,
349522086,00017,34952208600017,O,1989-01-05,NN,,,2018-01-02T14:59:02,true,4,,,,,LA BROSSE,27190,LE VAL-DORE,,,27447,,,,,,,,,,,,,,,,,,,2008-01-01,A,,,,,85.51Z,NAFRev2,O,0.981555,48.960375,0.94,street,La Brosse 27190 Le Val-Doré,27447_yrfsey,G,LA BROSSE,
349907352,00018,34990735200018,O,1988-08-01,NN,,,2018-01-02T14:27:40,true,4,,,,,,27190,LE VAL-DORE,,,27447,,,,,,,,,,,,,,,,,,,2004-12-31,F,,,,,01.1A,NAFRev1,N,,,0,,,,,,
350137360,00011,35013736000011,O,,,,,,true,1,,,,,CHATEAU D'ORVAUX,27190,LE VAL-DORE,,,27447,,,,,,,,,,,,,,,,,,,1991-11-14,F,,,,,58.12,NAP,N,0.993848,48.945427,0.53,street,Rue d'Orvaux 27190 Le Val-Doré,27402_0052,G,RUE D ORVAUX,
352611735,00015,35261173500015,O,1989-10-21,NN,,,2008-01-04T23:44:31,true,3,,,,,,27190,LE VAL-DORE,,,27447,,,,,,,,,,,,,,,,,,,2008-01-01,A,,,,,68.20A,NAFRev2,N,,,0,,,,,,
353225147,00019,35322514700019,O,1990-01-08,,,,2006-10-28T00:02:53,true,4,,,,LD,LE BOSHION,27190,LE VAL-DORE,,,27447,,,,,,,,,,,,,,,,,,,2004-06-24,F,,,,,52.6D,NAFRev1,N,1.007925,48.943783,0.94,street,Le Boshion 27190 Le Val-Doré,27447_sxll8d,G,LE BOSHION,
378186662,00011,37818666200011,O,1990-04-01,NN,,,2006-10-28T00:19:21,true,3,,,,,,27190,LE VAL-DORE,,,27447,,,,,,,,,,,,,,,,,,,2006-09-29,F,,,,,01.1A,NAFRev1,N,,,0,,,,,,
380013581,00026,38001358100026,O,,NN,,,,true,1,,,,,LE CLOS DU BOIS DE CHARME,27190,LE VAL-DORE,,,27447,,,,,,,,,,,,,,,,,,,1993-12-31,F,,,,,51.1T,NAF1993,N,1.026269,48.944952,0.65,street,Rue du Bois des Charmes 27190 Le Val-Doré,27447_0004,G,RUE DU BOIS DES CHARMES,
380414763,00017,38041476300017,O,1991-02-01,00,2018,,2020-08-25T10:17:23,true,5,,,,,LA BROSSE,27190,LE VAL-DORE,,,27447,,,,,,,,,,,,,,,,,,,2008-01-01,F,,,,,49.41A,NAFRev2,O,0.981555,48.960375,0.94,street,La Brosse 27190 Le Val-Doré,27447_yrfsey,G,LA BROSSE,
381515063,00034,38151506300034,O,2009-04-19,NN,,8121ZZ,2017-05-04T02:21:06,true,1,,47,,ALL,DES HIRONDELES,27190,LE VAL-DORE,,,27447,,,,,,,,,,,,,,,,,,,2009-04-19,A,B.E.N.,,,,81.21Z,NAFRev2,O,1.028045,48.944906,0.84,housenumber,47 Allée des Hirondelles 27190 Le Val-Doré,27447_0015_00047,G,47 ALLEE DES HIRONDELLES,
381550797,00025,38155079700025,O,1998-06-22,NN,,,2008-09-24T04:29:20,true,4,,22,,ALL,DES BOUVREUILS,27190,LE VAL-DORE,,,27447,,,,,,,,,,,,,,,,,,,2008-07-30,F,,,,,68.20A,NAFRev2,N,1.030129,48.94504,0.88,housenumber,22 Allée des Bouvreuils 27190 Le Val-Doré,27447_0003_00022,G,22 ALLEE DES BOUVREUILS,
381674183,00011,38167418300011,O,,NN,,,,true,1,,,,,,27190,LE VAL-DORE,,,27447,,,,,,,,,,,,,,,,,,,1992-06-05,F,,,,,45.2V,NAF1993,N,,,0,,,,,,
382307411,00019,38230741100019,O,1991-07-08,NN,,,2014-07-08T01:06:52,true,4,,,,,LE BOURG,27190,LE VAL-DORE,,,27447,,,,,,,,,,,,,,,,,,,2011-04-30,F,,,,,43.29A,NAFRev2,N,0.980022,48.949462,0.61,street,Le Bout au Parey 27190 Le Val-Doré,27268_b008,G,LE BOUT AU PAREY,
382400521,00011,38240052100011,O,1991-06-14,12,2018,,2020-08-25T10:19:21,true,7,,,,,DOMAINE DE L'AULNAYE,27190,LE VAL-DORE,,,27447,,,,,,,,,,,,,,,,,,,2008-01-01,A,,,,,93.29Z,NAFRev2,O,0.970104,48.977585,0.51,street,L'Aulnaye 27190 Le Val-Doré,27447_ijsn8k,G,L AULNAYE,
382603173,00016,38260317300016,O,1991-07-18,NN,,,2008-01-04T22:12:19,true,3,,,,,LE BOURG,27190,LE VAL-DORE,,,27447,,,,,,,,,,,,,,,,,,,2008-01-01,A,,,,,68.20A,NAFRev2,N,0.980022,48.949462,0.61,street,Le Bout au Parey 27190 Le Val-Doré,27268_b008,G,LE BOUT AU PAREY,
382629418,00015,38262941800015,O,1991-06-25,NN,,,2018-01-02T14:27:37,true,5,,,,,LES MOUSSEAUX,27190,LE VAL-DORE,,,27447,,,,,,,,,,,,,,,,,,,2014-07-31,F,,,,,01.50Z,NAFRev2,O,0.977026,48.93613,0.85,street,Rue des Mousseaux 27190 Le Val-Doré,27402_0043,G,RUE DES MOUSSEAUX,
383313004,00012,38331300400012,O,1991-07-14,NN,,,2018-01-02T14:59:06,false,4,,,,,LES MOUSSEAUX,27190,LE VAL-DORE,,,27447,,,,,,,,,,,,,,,,,,,2014-07-31,F,,,,,68.20B,NAFRev2,N,0.977026,48.93613,0.85,street,Rue des Mousseaux 27190 Le Val-Doré,27402_0043,G,RUE DES MOUSSEAUX,
383313004,00020,38331300400020,O,2014-02-01,,,,2018-01-02T14:27:42,true,1,,2,,RUE,DU NOGENT,27190,LE VAL-DORE,,,27447,,,,,,,,,,,,,,,,,,,2014-02-01,A,,,,,01.11Z,NAFRev2,O,0.977786,48.935926,0.77,housenumber,2 Rue de Nogent 27190 Le Val-Doré,27402_0047_00002,G,2 RUE DE NOGENT,
383393725,00015,38339372500015,O,1989-04-03,NN,,,2006-11-25T11:41:17,true,3,,,,,CHATEAU D ORVAUX,27190,LE VAL-DORE,,,27447,,,,,,,,,,,,,,,,,,,1991-11-14,F,,,,,58.12,NAP,N,0.993848,48.945427,0.53,street,Rue d'Orvaux 27190 Le Val-Doré,27402_0052,G,RUE D ORVAUX,
385267166,00010,38526716600010,O,1974-05-01,NN,,,2018-01-02T14:59:05,false,3,,,,,,27190,LE VAL-DORE,,,27447,,,,,,,,,,,,,,,,,,,2004-07-31,F,,,,,01.3Z,NAFRev1,N,,,0,,,,,,
385272166,00013,38527216600013,O,1983-01-01,NN,,,2018-01-02T14:27:39,true,5,,,,,FERME DE BELLEMARE,27190,LE VAL-DORE,,,27447,,,,,,,,,,,,,,,,,,,2008-06-23,F,,,,,68.20B,NAFRev2,N,0.982516,48.918479,0.55,street,Bellemare 27190 Le Val-Doré,27447_r3smnp,G,BELLEMARE,
387696099,00010,38769609900010,O,1992-04-01,03,2018,4331ZB,2020-08-25T10:22:50,true,4,LE BOIS DU CHARME,34,,ALL,DES BOUVREUILS,27190,LE VAL-DORE,,,27447,,,,,,,,,,,,,,,,,,,2008-01-01,A,,,,,43.32A,NAFRev2,O,1.027758,48.946152,0.88,housenumber,34 Allée des Bouvreuils 27190 Le Val-Doré,27447_0003_00034,G,34 ALLEE DES BOUVREUILS,
387786734,00021,38778673400021,O,2011-05-30,,,,2018-01-02T14:59:03,true,2,,4,,HAM,DE LA BROSSE,27190,LE VAL-DORE,,,27447,,,,,,,,,,,,,,,,,,,2013-03-21,F,,,,,68.20A,NAFRev2,N,0.979216,48.960828,0.87,housenumber,4 Hameau de la Brosse 27190 Le Val-Doré,27268_a010_00004,G,4 HAMEAU DE LA BROSSE,
388072027,00013,38807202700013,O,1977-02-10,,,,2018-01-02T14:27:40,false,4,,,,,LA GRANDE FERME,27190,LE VAL-DORE,,,27447,,,,,,,,,,,,,,,,,,,2009-06-11,F,,,,,01.11Z,NAFRev2,N,1.026202,48.940302,0.52,street,Rue de la Ferme 27190 Le Val-Doré,27447_0014,G,RUE DE LA FERME,
388072027,00021,38807202700021,O,2009-06-11,NN,,,2020-02-15T03:40:56,true,1,,6,,RUE,DE LA MAIRIE,27190,LE VAL-DORE,,,27447,,,,,,,,,,,,,,,,,,,2009-06-11,A,,,,,01.11Z,NAFRev2,O,1.029716,48.938833,0.92,housenumber,6 Rue de la Mairie (Orvaux) 27190 Le Val-Doré,27447_0017_00006,G,6 RUE DE LA MAIRIE,ORVAUX
391819984,00017,39181998400017,O,1991-07-24,NN,,,2018-01-02T14:27:38,true,3,,,,,,27190,LE VAL-DORE,,,27447,,,,,,,,,,,,,,,,,,,2001-07-31,F,,,,,70.2B,NAF1993,N,,,0,,,,,,
392449195,00016,39244919500016,O,1993-08-18,NN,,,2008-01-05T00:05:04,true,3,,,,,LE VILLAGE,27190,LE VAL-DORE,,,27447,,,,,,,,,,,,,,,,,,,2008-01-01,A,,,,,68.20A,NAFRev2,N,1.010404,48.942749,0.51,street,Chemin de Gaudreville 27190 Le Val-Doré,27447_0016,G,CHEMIN DE GAUDREVILLE,
392682670,00014,39268267000014,O,1993-07-01,NN,,,2013-05-18T03:21:12,true,3,,,,,,27190,LE VAL-DORE,,,27447,,,,,,,,,,,,,,,,,,,2008-01-01,A,,,,,01.50Z,NAFRev2,N,,,0,,,,,,
393925383,00035,39392538300035,O,2016-09-19,,,,2016-09-23T11:25:22,true,1,,60,,ALL,DES PIVERTS,27190,LE VAL-DORE,,,27447,,,,,,,,,,,,,,,,,,,2016-09-19,A,,,,,02.20Z,NAFRev2,N,1.023566,48.944534,0.87,housenumber,60 Allée des Piverts 27190 Le Val-Doré,27447_0027_00060,G,60 ALLEE DES PIVERTS,
397733304,00018,39773330400018,O,1994-06-06,NN,,,2018-01-05T04:10:25,true,4,LE HELOUP,,,,,27190,LE VAL-DORE,,,27447,,,,,,,,,,,,,,,,,,,2015-11-15,A,,,,,01.11Z,NAFRev2,N,0.99353,48.94758,0.92,street,Le Héloup - le Mesnil 27190 Le Val-Doré,27402_b015,D,LE HELOUP  LE MESNIL,
398617522,00014,39861752200014,O,1994-10-01,,,,2008-01-04T18:53:38,true,4,,,,,LE CLOS DU BOIS DE CHARME,27190,LE VAL-DORE,,,27447,,,,,,,,,,,,,,,,,,,2008-01-01,A,,,,,68.20A,NAFRev2,N,1.026269,48.944952,0.65,street,Rue du Bois des Charmes 27190 Le Val-Doré,27447_0004,G,RUE DU BOIS DES CHARMES,
399097518,00019,39909751800019,O,1994-12-15,,,,2018-01-02T14:59:06,false,4,,,,,,27190,LE VAL-DORE,,,27447,,,,,,,,,,,,,,,,,,,2013-12-26,F,,,,,01.11Z,NAFRev2,N,,,0,,,,,,
399097518,00027,39909751800027,O,2013-12-26,NN,,,2018-01-02T14:59:00,true,1,,19,,,LA BROSSE,27190,LE VAL-DORE,,,27447,,,,,,,,,,,,,,,,,,,2013-12-26,A,,,,,01.11Z,NAFRev2,O,0.986976,48.961234,0.94,housenumber,19 La Brosse 27190 Le Val-Doré,27447_yrfsey_00019,G,19 LA BROSSE,
399171909,00019,39917190900019,O,1994-11-01,NN,,,2018-01-02T14:56:43,true,3,,,,,LE HELOUP,27190,LE VAL-DORE,,,27447,,,,,,,,,,,,,,,,,,,2008-01-01,A,,,,,68.20B,NAFRev2,N,0.99353,48.94758,0.92,street,Le Héloup - le Mesnil 27190 Le Val-Doré,27402_b015,G,LE HELOUP  LE MESNIL,
399845965,00017,39984596500017,O,1995-01-01,NN,,,2018-01-02T14:56:42,true,3,,4,,RUE,DU LAVOIR,27190,LE VAL-DORE,,,27447,,,,,,,,,,,,,,,,,,,2008-01-01,A,,,,,01.11Z,NAFRev2,N,0.971039,48.9513,0.94,housenumber,4 Rue du Lavoir 27190 Le Val-Doré,27268_0024_00004,G,4 RUE DU LAVOIR,
399847375,00017,39984737500017,O,1995-01-01,NN,,,2018-01-02T14:59:06,true,3,,,,,,27190,LE VAL-DORE,,,27447,,,,,,,,,,,,,,,,,,,2008-01-01,A,,,,,01.11Z,NAFRev2,N,,,0,,,,,,
400490165,00018,40049016500018,O,1995-03-16,NN,,,2018-01-02T14:54:21,true,3,,4,,RUE,DU LAVOIR,27190,LE VAL-DORE,,,27447,,,,,,,,,,,,,,,,,,,2006-03-31,F,,,,,01.1A,NAFRev1,N,0.971039,48.9513,0.94,housenumber,4 Rue du Lavoir 27190 Le Val-Doré,27268_0024_00004,G,4 RUE DU LAVOIR,
401577432,00016,40157743200016,O,,NN,,,,true,1,,1,,ALL,DES ROUGES GORGES,27190,LE VAL-DORE,,,27447,,,,,,,,,,,,,,,,,,,1996-09-30,F,,,,,52.6E,NAF1993,N,1.023411,48.941061,0.88,housenumber,1 Allée des Rouges-gorges 27190 Le Val-Doré,27447_0030_00001,G,1 ALLEE DES ROUGES GORGES,
403166499,00018,40316649900018,O,1996-01-02,NN,,9602AB,2018-01-02T14:59:01,true,3,,2,,RUE,LE BOUT AU MACON,27190,LE VAL-DORE,,,27447,,,,,,,,,,,,,,,,,,,2008-01-01,A,,,,,96.02A,NAFRev2,N,0.96774,48.959,0.76,housenumber,2 Le Bout au Maçon 27190 Le Val-Doré,27268_b007_00002,G,2 LE BOUT AU MACON,
403692031,00012,40369203100012,O,1996-01-02,NN,,,2018-01-02T14:59:07,true,4,,,,,LES MOUSSEAUX,27190,LE VAL-DORE,,,27447,,,,,,,,,,,,,,,,,,,2010-12-31,F,,,,,70.22Z,NAFRev2,N,0.977026,48.93613,0.85,street,Rue des Mousseaux 27190 Le Val-Doré,27402_0043,G,RUE DES MOUSSEAUX,
404663858,00011,40466385800011,O,1980-01-01,NN,,,2018-01-02T14:56:43,true,3,,,,,,27190,LE VAL-DORE,,,27447,,,,,,,,,,,,,,,,,,,2008-01-01,A,,,,,01.11Z,NAFRev2,N,,,0,,,,,,
404666448,00018,40466644800018,O,1979-12-31,NN,,,,true,4,,,,,,27190,LE VAL-DORE,,,27447,,,,,,,,,,,,,,,,,,,1999-03-31,F,,,,,01.1A,NAF1993,N,,,0,,,,,,
404666455,00013,40466645500013,O,1980-01-01,NN,,,,true,4,,,,,,27190,LE VAL-DORE,,,27447,,,,,,,,,,,,,,,,,,,1998-05-24,F,,,,,01.1A,NAF1993,N,,,0,,,,,,
404867178,00034,40486717800034,O,2019-08-05,,,,2020-04-21T20:00:42,true,1,,6,,RUE,DE LA MAIRIE,27190,LE VAL-DORE,,BP 65,27447,,,,,,,,,,,,,,,,,,,2019-08-05,A,,,,,01.11Z,NAFRev2,N,1.029716,48.938833,0.92,housenumber,6 Rue de la Mairie (Orvaux) 27190 Le Val-Doré,27447_0017_00006,G,6 RUE DE LA MAIRIE,ORVAUX
408218592,00017,40821859200017,O,1996-06-26,NN,,,2018-01-02T14:59:00,false,4,,,,LD,QUENET,27190,LE VAL-DORE,,,27447,,,,,,,,,,,,,,,,,,,2003-05-31,F,,,,,70.2A,NAFRev1,N,0.958731,48.966857,0.94,street,Quenet 27190 Le Val-Doré,27447_qss29c,G,QUENET,
410094965,00010,41009496500010,O,1996-09-23,NN,,,2018-01-02T14:27:36,true,3,,,,,,27190,LE VAL-DORE,,,27447,,,,,,,,,,,,,,,,,,,2008-01-01,A,,,,,68.20B,NAFRev2,N,,,0,,,,,,
411915291,00016,41191529100016,O,1997-05-01,NN,,,2008-01-04T22:06:52,true,3,,20,,RUE,DE LA MAIRIE,27190,LE VAL-DORE,,,27447,,,,,,,,,,,,,,,,,,,2008-01-01,A,,,,,66.22Z,NAFRev2,N,1.032799,48.939801,0.92,housenumber,20 Rue de la Mairie (Orvaux) 27190 Le Val-Doré,27447_0017_00020,G,20 RUE DE LA MAIRIE,ORVAUX
413473307,00028,41347330700028,O,1997-09-26,01,2018,,2020-08-25T10:41:11,false,4,,,,,,27190,LE VAL-DORE,,,27447,,,,,,,,,,,,,,,,,,,2020-03-31,F,,,,,01.11Z,NAFRev2,N,,,0,,,,,,