siren,nic,siret,statutDiffusionEtablissement,dateCreationEtablissement,trancheEffectifsEtablissement,anneeEffectifsEtablissement,activitePrincipaleRegistreMetiersEtablissement,dateDernierTraitementEtablissement,etablissementSiege,nombrePeriodesEtablissement,complementAdresseEtablissement,numeroVoieEtablissement,indiceRepetitionEtablissement,typeVoieEtablissement,libelleVoieEtablissement,codePostalEtablissement,libelleCommuneEtablissement,libelleCommuneEtrangerEtablissement,distributionSpecialeEtablissement,codeCommuneEtablissement,codeCedexEtablissement,libelleCedexEtablissement,codePaysEtrangerEtablissement,libellePaysEtrangerEtablissement,complementAdresse2Etablissement,numeroVoie2Etablissement,indiceRepetition2Etablissement,typeVoie2Etablissement,libelleVoie2Etablissement,codePostal2Etablissement,libelleCommune2Etablissement,libelleCommuneEtranger2Etablissement,distributionSpeciale2Etablissement,codeCommune2Etablissement,codeCedex2Etablissement,libelleCedex2Etablissement,codePaysEtranger2Etablissement,libellePaysEtranger2Etablissement,dateDebut,etatAdministratifEtablissement,enseigne1Etablissement,enseigne2Etablissement,enseigne3Etablissement,denominationUsuelleEtablissement,activitePrincipaleEtablissement,nomenclatureActivitePrincipaleEtablissement,caractereEmployeurEtablissement,longitude,latitude,geo_score,geo_type,geo_adresse,geo_id,geo_ligne,geo_l4,geo_l5
212001788,00018,21200178800018,O,1983-03-01,01,2018,,2020-08-25T10:16:08,true,4,HOTEL DE VILLE,,,,,20217,NONZA,,,2B178,,,,,,,,,,,,,,,,,,,2008-01-01,A,MAIRIE,,,,84.11Z,NAFRev2,O,,,0,,,,,,
212001788,00026,21200178800026,O,1997-01-01,NN,,,2008-01-04T18:27:45,false,3,MAIRIE,,,,,20217,NONZA,,,2B178,,,,,,,,,,,,,,,,,,,2008-01-01,A,SERVICE EAU ET ASSAINISSEMENT,,,,36.00Z,NAFRev2,N,,,0,,,,,,
242000297,00018,24200029700018,O,1983-03-01,NN,,,,true,4,,,,,HOTEL DE VILLE,20217,NONZA,,,2B178,,,,,,,,,,,,,,,,,,,1995-12-25,F,,,,,75.1A,NAF1993,N,3.0709671,50.6304695,0.92,poi.townhall,Hôtel de Ville Lille,https://osm.org/way/40917078,G,,
262020787,00012,26202078700012,O,2002-01-01,,,,2008-01-04T18:56:41,true,3,HOTEL DE VILLE,,,,,20217,NONZA,,,2B178,,,,,,,,,,,,,,,,,,,2008-01-01,A,,,,,88.99B,NAFRev2,N,,,0,,,,,,
300355310,00032,30035531000032,O,,,,,,true,1,,,,,LD PIAZZA,20217,NONZA,,,2B178,,,,,,,,,,,,,,,,,,,1997-08-21,F,,,,,55.3B,NAF1993,N,6.4961295,44.5643686,0.89,poi.cafe,Piazza Café Embrun,https://osm.org/node/1728784451,G,,
304959091,00014,30495909100014,O,,NN,,,,true,1,,,,,,20217,NONZA,,,2B178,,,,,,,,,,,,,,,,,,,1996-03-31,F,,,,,26.7Z,NAF1993,O,,,0,,,,,,
305904575,00019,30590457500019,O,1976-01-01,NN,,,2014-06-11T13:23:45,true,14,,,,LD,BARAGATAGHIU,20217,NONZA,,,2B178,,,,,,,,,,,,,,,,,,,2010-05-01,A,LE PIRATE,,,,68.20B,NAFRev2,N,,,0,,,,,,
327090155,00018,32709015500018,O,1983-04-11,02,2018,,2020-08-25T10:32:20,true,10,,,,,,20217,NONZA,,,2B178,,,,,,,,,,,,,,,,,,,2019-05-01,A,,,,,56.10A,NAFRev2,O,,,0,,,,,,
327825725,00010,32782572500010,O,,,,,,true,1,,,,,NONZA,20217,NONZA,,,2B178,,,,,,,,,,,,,,,,,,,1984-12-25,F,,,,,62.41,NAP,N,9.34537,42.78382,0.93,street,Nonza,2B178_33nw21,G,NONZA,
332108596,00013,33210859600013,O,,NN,,,,true,1,,,,,,20217,NONZA,,,2B178,,,,,,,,,,,,,,,,,,,1990-09-30,F,,,,,38.40,NAP,N,,,0,,,,,,
349106872,00055,34910687200055,O,2016-10-01,,,,2018-04-19T15:41:34,false,2,,,,QUAI,MEZZU SUPRANU,20217,NONZA,,,2B178,,,,,,,,,,,,,,,,,,,2018-04-16,F,,,,,70.22Z,NAFRev2,N,,,0,,,,,,
352527915,00016,35252791500016,O,1984-02-09,01,2018,,2020-08-25T10:12:44,true,3,,,,,,20217,NONZA,,,2B178,,,,,,,,,,,,,,,,,,,2008-01-01,A,,,,,88.10A,NAFRev2,N,,,0,,,,,,
356000000,10979,35600000010979,O,2012-01-01,,,,2014-01-19T06:18:45,false,2,,,,,VILLAGE VILLAGE VILLAGE,20217,NONZA,,,2B178,,,,,,,,,,,,,,,,,,,2014-01-10,A,LA POSTE,,,,53.10Z,NAFRev2,N,2.0586385,49.0147805,0.88,poi.cafe,Le Village (Café) Neuville-sur-Oise,https://osm.org/way/99308596,G,,
356000943,00585,35600094300585,O,1991-01-01,NN,,,2009-10-17T12:56:30,false,4,,,,,LE BOURG,20217,NONZA,,,2B178,,,,,,,,,,,,,,,,,,,2009-03-18,F,BUREAU DE POSTE,,,,53.10Z,NAFRev2,O,2.212915,47.9910304,0.9,poi.bar,Le Bourg (Bar) Ingrannes,https://osm.org/node/1718543174,G,,
378067433,00037,37806743300037,O,2002-10-01,NN,,,2006-12-15T00:39:28,false,4,,,,LD,PIAZZA,20217,NONZA,,,2B178,,,,,,,,,,,,,,,,,,,2003-09-30,F,,,,,92.1B,NAFRev1,N,6.4961295,44.5643686,0.89,poi.cafe,Piazza Café Embrun,https://osm.org/node/1728784451,G,,
378067433,00045,37806743300045,O,2005-01-01,,,,2011-06-15T15:32:53,true,5,SNACK RESTAURANT AUBERGE,,,,,20217,NONZA,,,2B178,,,,,,,,,,,,,,,,,,,2010-07-06,A,,,,,56.10A,NAFRev2,N,,,0,,,,,,
378067433,00052,37806743300052,O,2005-01-01,NN,,,2015-04-28T11:49:40,false,7,,,,,,20217,NONZA,,,2B178,,,,,,,,,,,,,,,,,,,2015-04-16,F,,,,,56.10A,NAFRev2,N,,,0,,,,,,
379146707,00011,37914670700011,O,1990-06-01,NN,,,,true,1,,,,,,20217,NONZA,,,2B178,,,,,,,,,,,,,,,,,,,2000-09-30,F,,,,,52.1B,NAF1993,N,,,0,,,,,,
382109817,00017,38210981700017,O,,NN,,,,true,1,,,,,,20217,NONZA,,,2B178,,,,,,,,,,,,,,,,,,,1992-09-30,F,,,,,15.8C,NAF1993,N,,,0,,,,,,
390884716,00015,39088471600015,O,,NN,,,,true,1,,,,,,20217,NONZA,,,2B178,,,,,,,,,,,,,,,,,,,1994-06-30,F,,,,,45.3A,NAF1993,N,,,0,,,,,,
391946290,00015,39194629000015,O,1993-07-10,NN,,,2014-07-08T01:19:55,true,5,,,,LD,CASA QUADIGO,20217,NONZA,,,2B178,,,,,,,,,,,,,,,,,,,2010-12-31,F,,,,,10.71C,NAFRev2,N,9.344881,42.784592,0.64,locality,Casa Quadra 20217 Nonza,2b178_b032,G,CASA QUADRA,
402654206,00018,40265420600018,O,1995-10-02,NN,,,2009-06-27T07:54:53,true,5,CHEZ JF FRANCESCHINI,,,,PAGHIOLELLU,20217,NONZA,,,2B178,,,,,,,,,,,,,,,,,,,2008-01-01,A,,,,,94.99Z,NAFRev2,N,,,0,,,,,,
410914162,00012,41091416200012,O,1997-02-03,NN,,4399CZ,2015-03-17T00:49:28,true,3,,,,,,20217,NONZA,,,2B178,,,,,,,,,,,,,,,,,,,2008-01-01,A,,,,,43.99C,NAFRev2,N,,,0,,,,,,
410914162,00020,41091416200020,O,1998-06-13,NN,,,2008-12-06T05:16:24,false,3,,,,PL,LOUIS CARLINI,20217,NONZA,,,2B178,,,,,,,,,,,,,,,,,,,2008-01-01,A,LA STALLA,,,,56.10C,NAFRev2,N,,,0,,,,,,
410914162,00038,41091416200038,O,2015-02-26,,,,2018-11-29T10:34:59,false,3,,,,,PIAZZA,20217,NONZA,,,2B178,,,,,,,,,,,,,,,,,,,2018-09-30,A,A STALLA,,,,56.10C,NAFRev2,N,6.4961295,44.5643686,0.89,poi.cafe,Piazza Café Embrun,https://osm.org/node/1728784451,G,,
414664839,00019,41466483900019,O,1988-12-31,NN,,,,true,3,,,,,,20217,NONZA,,,2B178,,,,,,,,,,,,,,,,,,,2003-02-14,F,,,,,01.2A,NAFRev1,N,,,0,,,,,,
421544784,00018,42154478400018,O,1999-01-15,NN,,,2008-01-05T00:08:46,true,3,,,,CHE,DU FOSSU,20217,NONZA,,,2B178,,,,,,,,,,,,,,,,,,,2008-01-01,A,,,,,79.90Z,NAFRev2,N,,,0,,,,,,
423080282,00019,42308028200019,O,1999-05-02,NN,,,,false,4,,,,,,20217,NONZA,,,2B178,,,,,,,,,,,,,,,,,,,2000-03-01,F,,,,,92.3B,NAF1993,O,,,0,,,,,,
423535855,00013,42353585500013,O,1998-07-03,NN,,,2008-11-08T01:43:59,true,3,,,,,TOUR PAOLINE,20217,NONZA,,,2B178,,,,,,,,,,,,,,,,,,,2005-09-13,F,,,,,74.8A,NAFRev1,N,9.4145505,42.658458,0.89,poi.3,Tour Paoline (Patrimoine national) Furiani,https://osm.org/way/266248714,G,,
432328342,00014,43232834200014,O,2000-05-16,NN,,,2008-01-04T18:34:14,true,3,SALLE ANCIENNE CONFRERIE,,,,MAISON DES ASSOCIATIONS,20217,NONZA,,,2B178,,,,,,,,,,,,,,,,,,,2008-01-01,A,,,,,90.01Z,NAFRev2,N,4.78635,44.1366275,0.91,poi.community_centre,Maison des associations (Salle des fêtes) Orange,https://osm.org/way/150448104,G,,
438128571,00017,43812857100017,O,2001-04-01,NN,,,2008-01-04T20:04:59,true,3,,,,,,20217,NONZA,,,2B178,,,,,,,,,,,,,,,,,,,2008-01-01,A,,,,,47.11B,NAFRev2,N,,,0,,,,,,
479303133,00017,47930313300017,O,2004-11-02,NN,,4312BA,2018-12-12T04:28:56,true,6,NONZA,,,,VILLAGE,20217,NONZA,,,2B178,,,,,,,,,,,,,,,,,,,2018-12-03,F,NTP,,,,43.12A,NAFRev2,N,9.34597,42.785235,0.47,street,Cavallareccia 20217 Nonza,2B178_dhjmaa,D,CAVALLARECCIA,
481653400,00020,48165340000020,O,2014-06-01,,,,2015-12-11T03:28:27,true,2,,,,,PLAGE DE NONZA,20217,NONZA,,,2B178,,,,,,,,,,,,,,,,,,,2015-09-30,F,LE PIRATE,,,,56.10A,NAFRev2,O,9.34426,42.785026,0.44,locality,Monte d'Erasimo 20217 Nonza,2b178_b098,G,MONTE D ERASIMO,
481740215,00019,48174021500019,O,2004-12-30,01,2018,1039BP,2020-08-25T10:26:18,true,8,,,,,,20217,NONZA,,,2B178,,,,,,,,,,,,,,,,,,,2020-06-02,A,,,,,56.30Z,NAFRev2,O,,,0,,,,,,
484650155,00019,48465015500019,O,2005-10-17,01,2018,,2020-08-25T10:29:59,true,5,,,,,,20217,NONZA,,,2B178,,,,,,,,,,,,,,,,,,,2008-05-15,A,,,,,43.21A,NAFRev2,O,,,0,,,,,,
484650155,00027,48465015500027,O,2006-05-06,,,,2010-02-01T17:10:08,false,4,,,,,,20217,NONZA,,,2B178,,,,,,,,,,,,,,,,,,,2010-01-01,A,,,,,68.20B,NAFRev2,N,,,0,,,,,,
485388110,00010,48538811000010,O,2005-10-25,NN,,,2010-04-18T11:40:48,true,3,,,,,MAISON DES ASSOCIATIONS,20217,NONZA,,,2B178,,,,,,,,,,,,,,,,,,,2008-01-01,A,,,,,94.99Z,NAFRev2,O,4.78635,44.1366275,0.91,poi.community_centre,Maison des associations (Salle des fêtes) Orange,https://osm.org/way/150448104,G,,
488170200,00015,48817020000015,O,2006-01-01,,,,2008-01-05T02:28:25,true,2,LE CASALE,,,,,20217,NONZA,,,2B178,,,,,,,,,,,,,,,,,,,2008-01-01,A,,,,,90.03B,NAFRev2,N,9.346049,42.78495,0.39,locality,Casa Ciccana 20217 Nonza,2b178_b031,D,CASA CICCANA,
488370164,00011,48837016400011,O,2006-02-03,NN,,,2018-09-29T12:31:57,true,7,,,,,CASA MARIA,20217,NONZA,,,2B178,,,,,,,,,,,,,,,,,,,2017-10-31,F,CASA MARIA,,,,55.20Z,NAFRev2,N,9.344881,42.784592,0.42,locality,Casa Quadra 20217 Nonza,2b178_b032,G,CASA QUADRA,
491033601,00023,49103360100023,O,2019-01-01,,,,2019-09-27T10:18:01,true,1,,,,,L'AJOLA,20217,NONZA,,,2B178,,,,,,,,,,,,,,,,,,,2019-01-01,A,,,,,68.20A,NAFRev2,N,6.5536877,47.9494551,0.76,poi.chalet,Gîte de l'Auberge de la Ferme Saint-Vallier (Chalet) Girmont-Val-d'Ajol,https://osm.org/node/2032367533,G,,
496012428,00017,49601242800017,O,,,,,,true,1,,,,,,20217,NONZA,,,2B178,,,,,,,,,,,,,,,,,,,1985-12-25,F,,,,,38.40,NAP,N,,,0,,,,,,
496512450,00016,49651245000016,O,1965-01-01,NN,,,2006-11-25T21:54:21,true,3,,,,,,20217,NONZA,,,2B178,,,,,,,,,,,,,,,,,,,2005-01-01,F,,,,,55.3A,NAFRev1,N,,,0,,,,,,
497212068,00017,49721206800017,O,1972-01-01,NN,,,2006-11-25T21:54:23,true,3,,,,,,20217,NONZA,,,2B178,,,,,,,,,,,,,,,,,,,2004-12-30,F,,,,,55.4B,NAFRev1,N,,,0,,,,,,
507604684,00021,50760468400021,O,2016-06-01,01,2017,,2019-06-24T13:12:35,false,1,,,,LD,LA MARINE,20217,NONZA,,,2B178,,,,,,,,,,,,,,,,,,,2016-06-01,A,L'ASSIETTE DE L'ELEVEUR  U SANT ANTONE ,,,,01.42Z,NAFRev2,O,-2.8015935,47.589994,0.9,poi.pub,La Marine (Pub) Île-d'Arz,https://osm.org/way/169104904,G,,
513373571,00019,51337357100019,O,2009-06-01,NN,,,2014-06-11T13:23:45,true,4,PLAGE DE NONZA,,,,,20217,NONZA,,,2B178,,,,,,,,,,,,,,,,,,,2011-11-29,F,LE PIRATE,,,,56.10A,NAFRev2,O,9.34426,42.785026,0.44,locality,Monte d'Erasimo 20217 Nonza,2b178_b098,D,MONTE D ERASIMO,
519885446,00012,51988544600012,O,2010-01-01,NN,,,2015-06-06T12:49:06,true,1,,,,,MONE D'ERASIMO,20217,NONZA,,,2B178,,,,,,,,,,,,,,,,,,,2010-01-01,A,LA CANTINA DI MARIA,,,,56.21Z,NAFRev2,O,9.34426,42.785026,0.81,locality,Monte d'Erasimo 20217 Nonza,2b178_b098,G,MONTE D ERASIMO,
519885446,00020,51988544600020,O,2010-01-01,03,2018,,2020-08-25T10:34:05,false,1,,,,CHE,TOUR,20217,NONZA,,,2B178,,,,,,,,,,,,,,,,,,,2010-01-01,A,,,,,56.10A,NAFRev2,O,5.1409682,45.5910011,0.79,poi.track,Chemin de la Tour Roche,https://osm.org/way/120023992,G,,
529908071,00010,52990807100010,O,2011-01-26,00,2017,1071CB,2019-06-24T13:31:45,true,3,,,,,CHEMIN DU FOSSU,20217,NONZA,,,2B178,,,,,,,,,,,,,,,,,,,2017-11-12,F,,,,,10.71C,NAFRev2,O,,,0,,,,,,
534318316,00013,53431831600013,O,2011-06-14,,,,2011-08-30T09:06:04,true,1,,,,,CHEZ MR PETER HOCH,20217,NONZA,,,2B178,,,,,,,,,,,,,,,,,,,2011-06-14,A,,,,,68.20A,NAFRev2,N,,,0,,,,,,
809156045,00019,80915604500019,O,2015-01-22,,,,2017-03-23T16:22:20,true,2,MAISON FRANCESCHI,,,,RD80,20217,NONZA,,,2B178,,,,,,,,,,,,,,,,,,,2015-06-01,A,,,,,93.19Z,NAFRev2,N,,,0,,,,,,
809835747,00019,80983574700019,O,1995-05-16,,,,2015-02-26T08:10:46,true,1,,,,,MAIRIE,20217,NONZA,,,2B178,,,,,,,,,,,,,,,,,,,1995-05-16,A,,,,,94.99Z,NAFRev2,N,3.0709671,50.6304695,0.92,poi.townhall,Hôtel de Ville Lille,https://osm.org/way/40917078,G,,
809943061,00014,80994306100014,O,2015-03-03,NN,,,2020-07-10T08:32:59,true,7,,,,,VILLAGE DE NONZA,20217,NONZA,,,2B178,,,,,,,,,,,,,,,,,,,2020-07-01,A,BOCCAFINE,,,,56.10A,NAFRev2,O,9.34537,42.78382,0.4,street,Nonza,2B178_33nw21,G,NONZA,
814082350,00038,81408235000038,O,2018-05-14,00,2018,,2020-08-25T11:22:46,false,3,VILLAGE DE NONZA,,,,,20217,NONZA,,,2B178,,,,,,,,,,,,,,,,,,,2019-04-16,F,MELOTTI,,,,56.10A,NAFRev2,N,9.34537,42.78382,0.4,street,Nonza,2B178_33nw21,D,NONZA,
819169806,00018,81916980600018,O,2016-02-15,,,,2016-03-18T14:13:08,true,1,,,,PL,CARLINI,20217,NONZA,,,2B178,,,,,,,,,,,,,,,,,,,2016-02-15,A,,,,,94.99Z,NAFRev2,N,,,0,,,,,,
820487007,00016,82048700700016,O,2016-01-01,,,,2016-09-05T09:56:08,true,1,,,,RUE,BORGO VECHIU,20217,NONZA,,,2B178,,,,,,,,,,,,,,,,,,,2016-01-01,A,,,,LOCATION MEUBLEE ESPINASSE,68.20A,NAFRev2,N,9.342472,42.784585,0.44,locality,Borgho Vecchio 20217 Nonza,2b178_b016,G,BORGHO VECCHIO,
823405774,00014,82340577400014,O,2016-10-01,,,,2017-08-30T16:29:25,true,3,LIEU DIT,,,,PIAZZA,20217,NONZA,,,2B178,,,,,,,,,,,,,,,,,,,2017-06-18,A,MILK CAFFE,,,,56.10C,NAFRev2,O,6.4961295,44.5643686,0.89,poi.cafe,Piazza Café Embrun,https://osm.org/node/1728784451,G,,
829933316,00012,82993331600012,O,2017-05-24,,,,2019-09-13T09:29:47,false,2,VILLAGE DE NONZA,,,,,20217,NONZA,,,2B178,,,,,,,,,,,,,,,,,,,2018-05-13,F,,,,L'IMPROVISTA,56.10A,NAFRev2,O,9.34537,42.78382,0.4,street,Nonza,2B178_33nw21,D,NONZA,
832721401,00012,83272140100012,O,2017-08-01,,,,2017-10-19T03:46:29,true,1,,,,LD,PORTELLO VECCHIO,20217,NONZA,,,2B178,,,,,,,,,,,,,,,,,,,2017-08-01,A,,,,,68.20B,NAFRev2,N,9.343754,42.784381,0.93,locality,Portello Vecchio 20217 Nonza,2b178_b131,G,PORTELLO VECCHIO,
839799244,00018,83979924400018,O,2018-05-01,,,1071CB,2018-08-13T13:18:47,true,2,,,,,VILLAGE,20217,NONZA,,,2B178,,,,,,,,,,,,,,,,,,,2018-07-01,A,,,,,10.71C,NAFRev2,O,4.39087,45.4547668,0.89,poi.cafe,Village Café Saint-Étienne,https://osm.org/node/5321738834,G,,
840170823,00016,84017082300016,O,2018-06-14,,,,2018-06-08T03:56:11,true,1,VILLAGE,,,,NONZA,20217,NONZA,,,2B178,,,,,,,,,,,,,,,,,,,2018-06-14,A,,,,LA TOUR PAOLINE,47.89Z,NAFRev2,N,9.34537,42.78382,0.93,street,Nonza,2B178_33nw21,G,NONZA,
844006023,00015,84400602300015,O,2018-10-01,,,4312BA,2018-11-22T03:48:25,true,1,,,,,VILLAGE DE NONZA,20217,NONZA,,,2B178,,,,,,,,,,,,,,,,,,,2018-10-01,A,,,,,43.12A,NAFRev2,N,9.34537,42.78382,0.4,street,Nonza,2B178_33nw21,G,NONZA,
847630266,00017,84763026600017,O,2019-01-21,,,,2019-01-23T09:22:11,true,1,,,,QUA,CORSU,20217,NONZA,,,2B178,,,,,,,,,,,,,,,,,,,2019-01-21,A,,,,,85.51Z,NAFRev2,N,,,0,,,,,,
881531826,00017,88153182600017,O,2018-04-23,,,,2020-02-12T14:54:19,true,1,,,,,U CASALE,20217,NONZA,,,2B178,,,,,,,,,,,,,,,,,,,2018-04-23,A,,,,,94.99Z,NAFRev2,N,,,0,,,,,,
882836091,00018,88283609100018,O,2020-04-09,,,,2020-04-10T03:48:25,true,1,,,,,,20217,NONZA,,,2B178,,,,,,,,,,,,,,,,,,,2020-04-09,A,,,,,01.49Z,NAFRev2,N,,,0,,,,,,
