siren,nic,siret,statutDiffusionEtablissement,dateCreationEtablissement,trancheEffectifsEtablissement,anneeEffectifsEtablissement,activitePrincipaleRegistreMetiersEtablissement,dateDernierTraitementEtablissement,etablissementSiege,nombrePeriodesEtablissement,complementAdresseEtablissement,numeroVoieEtablissement,indiceRepetitionEtablissement,typeVoieEtablissement,libelleVoieEtablissement,codePostalEtablissement,libelleCommuneEtablissement,libelleCommuneEtrangerEtablissement,distributionSpecialeEtablissement,codeCommuneEtablissement,codeCedexEtablissement,libelleCedexEtablissement,codePaysEtrangerEtablissement,libellePaysEtrangerEtablissement,complementAdresse2Etablissement,numeroVoie2Etablissement,indiceRepetition2Etablissement,typeVoie2Etablissement,libelleVoie2Etablissement,codePostal2Etablissement,libelleCommune2Etablissement,libelleCommuneEtranger2Etablissement,distributionSpeciale2Etablissement,codeCommune2Etablissement,codeCedex2Etablissement,libelleCedex2Etablissement,codePaysEtranger2Etablissement,libellePaysEtranger2Etablissement,dateDebut,etatAdministratifEtablissement,enseigne1Etablissement,enseigne2Etablissement,enseigne3Etablissement,denominationUsuelleEtablissement,activitePrincipaleEtablissement,nomenclatureActivitePrincipaleEtablissement,caractereEmployeurEtablissement,longitude,latitude,geo_score,geo_type,geo_adresse,geo_id,geo_ligne,geo_l4,geo_l5
173402116,00227,17340211600227,O,1983-01-01,NN,,,2019-11-14T14:00:34,false,3,,,,CRS,DU VIGUIER,34330,LA SALVETAT-SUR-AGOUT,,,34293,,,,,,,,,,,,,,,,,,,2008-01-01,F,TRESORERIE LA SALVETAT-SUR-AGOUT,,,,84.11Z,NAFRev2,N,2.702095,43.599948,0.82,street,Cours du Viguier 34330 La Salvetat-sur-Agout,34293_0361,G,COURS DU VIGUIER,
173406612,00122,17340661200122,O,1983-03-16,NN,,,2019-11-14T14:00:34,false,4,,,,,,34330,LA SALVETAT-SUR-AGOUT,,,34293,,,,,,,,,,,,,,,,,,,2009-12-31,F,DD DE L EQUIPEMENT,,,,84.13Z,NAFRev2,N,,,0,,,,,,
213402936,00016,21340293600016,O,1983-03-01,NN,,,2019-11-14T14:00:34,false,5,HOTEL DE VILLE,,,CRS,VIGUIER,34330,LA SALVETAT-SUR-AGOUT,,,34293,,,,,,,,,,,,,,,,,,,2008-01-01,F,MAIRIE,,,,84.11Z,NAFRev2,O,2.702095,43.599948,0.71,street,Cours du Viguier 34330 La Salvetat-sur-Agout,34293_0361,G,COURS DU VIGUIER,
213402936,00024,21340293600024,O,1983-03-16,NN,,,2019-11-14T14:00:34,false,4,,,,LD,GUA VERGNE,34330,LA SALVETAT-SUR-AGOUT,,,34293,,,,,,,,,,,,,,,,,,,2008-01-01,A,CAMPING MUNICIPAL LOU REDOUNDEL,,,,55.30Z,NAFRev2,N,2.69888,43.605124,0.92,street,Gua de la Vergne 34330 La Salvetat-sur-Agout,34293_b106,G,GUA DE LA VERGNE,
213402936,00032,21340293600032,O,1983-12-21,00,2018,,2020-08-25T10:16:54,false,4,,,,RUE,PLAINE BELOT,34330,LA SALVETAT-SUR-AGOUT,,,34293,,,,,,,,,,,,,,,,,,,2018-02-21,F,ECOLE PRIMAIRE PUBLIQUE L'ERMITAGE,,,,85.20Z,NAFRev2,N,2.693858,43.598027,0.7,street,Plaine de Belot 34330 La Salvetat-sur-Agout,34293_b208,G,PLAINE DE BELOT,
213402936,00040,21340293600040,O,1999-01-01,NN,,,2019-11-14T14:00:34,false,5,,,,,LES BOULDOUIRES,34330,LA SALVETAT-SUR-AGOUT,,,34293,,,,,,,,,,,,,,,,,,,2016-12-31,F,VVF,,,,42.99Z,NAFRev2,N,2.680821,43.603017,0.94,street,Les Bouldouires 34330 La Salvetat-sur-Agout,34293_anj47t,G,LES BOULDOUIRES,
213402936,00057,21340293600057,O,1993-01-01,02,2018,,2020-08-25T10:16:54,false,4,MAIRIE,,,PL,DE COMPOSTELLE,34330,LA SALVETAT-SUR-AGOUT,,BP 5,34293,,,,,,,,,,,,,,,,,,,2008-01-01,A,SERVICE D'EAU ET ASSAINISSEMENT,,,,36.00Z,NAFRev2,N,2.702882,43.602252,0.64,street,Place Compostele 34330 La Salvetat-sur-Agout,34293_0110,G,PLACE COMPOSTELE,
213402936,00065,21340293600065,O,2007-07-01,12,2018,,2020-08-25T10:16:54,true,1,,,,PL,DE COMPOSTELLE,34330,LA SALVETAT-SUR-AGOUT,,BP 5,34293,,,,,,,,,,,,,,,,,,,2007-07-01,A,,,,,84.11Z,NAFRev2,O,2.702882,43.602252,0.64,street,Place Compostele 34330 La Salvetat-sur-Agout,34293_0110,G,PLACE COMPOSTELE,
213402936,00073,21340293600073,O,2018-02-21,,,,2019-11-14T14:00:34,false,1,,,,CHE,DU GUA DE LA VERGNE,34330,LA SALVETAT-SUR-AGOUT,,,34293,,,,,,,,,,,,,,,,,,,2018-02-21,A,ECOLE PRIMAIRE PUBLIQUE MAURICE DE CROZALS,,,,85.20Z,NAFRev2,N,2.698884,43.605105,0.86,street,Chemin du Gua de la Vergne 34330 La Salvetat-sur-Agout,34293_0152,G,CHEMIN DU GUA DE LA VERGNE,
243400371,00015,24340037100015,O,1992-09-04,NN,,,2019-11-14T14:00:34,true,3,,,,,MAIRIE,34330,LA SALVETAT-SUR-AGOUT,,,34293,,,,,,,,,,,,,,,,,,,2003-07-03,F,,,,,75.1A,NAFRev1,N,2.636229,43.593555,0.64,street,Avenue de Prairie 34330 La Salvetat-sur-Agout,34293_0285,G,AVENUE DE PRAIRIE,
243400389,00017,24340038900017,O,1992-12-30,NN,,,2019-11-14T14:00:34,false,5,,,,CRS,VIGUIER,34330,LA SALVETAT-SUR-AGOUT,,,34293,,,,,,,,,,,,,,,,,,,2009-12-22,F,,,,,84.11Z,NAFRev2,O,2.702095,43.599948,0.71,street,Cours du Viguier 34330 La Salvetat-sur-Agout,34293_0361,G,COURS DU VIGUIER,
243400389,00025,24340038900025,O,1999-01-01,NN,,,2019-11-14T14:00:34,false,4,,,,CRS,VIGUIER,34330,LA SALVETAT-SUR-AGOUT,,,34293,,,,,,,,,,,,,,,,,,,2008-01-01,F,SERVICES FUNERAIRES,,,,96.03Z,NAFRev2,N,2.702095,43.599948,0.71,street,Cours du Viguier 34330 La Salvetat-sur-Agout,34293_0361,G,COURS DU VIGUIER,
243400389,00033,24340038900033,O,1999-01-01,00,2017,,2019-11-14T14:00:34,false,5,,,,PL,DE COMPOSTELLE,34330,LA SALVETAT-SUR-AGOUT,,,34293,,,,,,,,,,,,,,,,,,,2017-01-01,F,ORDURES MENAGERES,,,,38.11Z,NAFRev2,O,2.702882,43.602252,0.64,street,Place Compostele 34330 La Salvetat-sur-Agout,34293_0110,G,PLACE COMPOSTELE,
243400389,00074,24340038900074,O,2009-12-22,00,2017,,2019-11-14T14:00:34,true,2,,,,PL,DE COMPOSTELLE,34330,LA SALVETAT-SUR-AGOUT,,,34293,,,,,,,,,,,,,,,,,,,2017-01-01,F,,,,,84.11Z,NAFRev2,O,2.702882,43.602252,0.64,street,Place Compostele 34330 La Salvetat-sur-Agout,34293_0110,G,PLACE COMPOSTELE,
253401137,00018,25340113700018,O,,,,,2019-11-14T14:00:34,true,1,,,,,HOTEL DE VILLE,34330,LA SALVETAT-SUR-AGOUT,,,34293,,,,,,,,,,,,,,,,,,,1992-12-31,F,,,,,90.0B,NAF1993,N,2.702891,43.603165,0.42,street,La Ville 34330 La Salvetat-sur-Agout,34293_f0zate,G,LA VILLE,
258102169,00335,25810216900335,O,2017-01-01,,,,2019-11-14T14:00:34,false,1,,,,LD,CABILLE,34330,LA SALVETAT-SUR-AGOUT,,,34293,,,,,,,,,,,,,,,,,,,2017-01-01,A,DECHETTERIE,,,,38.21Z,NAFRev2,O,2.733429,43.591951,0.94,street,Cabille 34330 La Salvetat-sur-Agout,34293_xdv21i,G,CABILLE,
263400061,00010,26340006100010,O,1983-03-01,21,2018,,2020-08-25T10:20:57,true,4,,,,CHE,REDOUNDEL,34330,LA SALVETAT-SUR-AGOUT,,,34293,,,,,,,,,,,,,,,,,,,2008-01-01,A,,,,,87.10A,NAFRev2,O,2.703267,43.602892,0.8,street,Chemin du Redoundel 34330 La Salvetat-sur-Agout,34293_0290,G,CHEMIN DU REDOUNDEL,
263403818,00010,26340381800010,O,1995-12-25,,,,2019-11-14T14:00:34,true,3,MAIRIE,,,PL,DE COMPOSTELLE,34330,LA SALVETAT-SUR-AGOUT,,BP 5,34293,,,,,,,,,,,,,,,,,,,2008-01-01,A,,,,,88.99B,NAFRev2,N,2.702882,43.602252,0.64,street,Place Compostele 34330 La Salvetat-sur-Agout,34293_0110,G,PLACE COMPOSTELE,
273401034,00015,27340103400015,O,,NN,,,2019-11-14T14:00:34,true,1,,,,CRS,DU VIGUIER,34330,LA SALVETAT-SUR-AGOUT,,,34293,,,,,,,,,,,,,,,,,,,1995-12-25,F,,,,,41.0Z,NAF1993,N,2.702095,43.599948,0.82,street,Cours du Viguier 34330 La Salvetat-sur-Agout,34293_0361,G,COURS DU VIGUIER,
300225653,00017,30022565300017,O,1964-01-01,NN,,,2019-11-14T14:00:34,true,1,,,,LD,VOIE PASTORALE,34330,LA SALVETAT-SUR-AGOUT,,,34293,,,,,,,,,,,,,,,,,,,1998-06-30,F,,,,,45.4J,NAF1993,N,2.704987,43.601075,0.94,street,Voie Pastorale 34330 La Salvetat-sur-Agout,34293_0210,G,VOIE PASTORALE,
300296720,00018,30029672000018,O,,NN,,,2019-11-14T14:00:34,true,1,,,,,CANTARANNE,34330,LA SALVETAT-SUR-AGOUT,,,34293,,,,,,,,,,,,,,,,,,,1996-07-27,F,,,,,55.3A,NAF1993,N,1.8016792,43.3671015,0.89,poi.track,Chemin de Cantaranne Avignonet-Lauragais,https://osm.org/way/32751435,G,,
300299666,00028,30029966600028,O,1996-11-15,NN,,,2019-11-14T14:00:34,true,1,,,,,PLAINE DE BELOT,34330,LA SALVETAT-SUR-AGOUT,,,34293,,,,,,,,,,,,,,,,,,,1999-01-20,F,,,,,51.5F,NAF1993,O,2.693858,43.598027,0.94,street,Plaine de Belot 34330 La Salvetat-sur-Agout,34293_b208,G,PLAINE DE BELOT,
300310349,00018,30031034900018,O,,,,,2019-11-14T14:00:34,true,1,,,,,LA PERGOLAT,34330,LA SALVETAT-SUR-AGOUT,,,34293,,,,,,,,,,,,,,,,,,,1984-12-25,F,,,,,,,N,2.69888,43.605124,0.4,street,Gua de la Vergne 34330 La Salvetat-sur-Agout,34293_b106,G,GUA DE LA VERGNE,
300335171,00025,30033517100025,O,1982-12-31,01,2018,3312ZA,2020-08-25T10:21:41,true,8,ROUTE DE LA PLAGE,,,RTE,DU LAC,34330,LA SALVETAT-SUR-AGOUT,,,34293,,,,,,,,,,,,,,,,,,,2016-01-02,A,,,,,35.11Z,NAFRev2,O,2.636118,43.593576,0.67,street,Avenue du Lac 34330 La Salvetat-sur-Agout,34293_19i69n,G,AVENUE DU LAC,
301136909,00019,30113690900019,O,,NN,,,2019-11-14T14:00:34,true,1,,,,,DESCENTE DE L'HOTEL,34330,LA SALVETAT-SUR-AGOUT,,,34293,,,,,,,,,,,,,,,,,,,1990-12-31,F,,,,,81.21,NAP,N,,,0,,,,,,
301598876,00011,30159887600011,O,1974-01-01,NN,,,2019-11-14T14:00:34,true,1,,,,,LA PAUTRUE,34330,LA SALVETAT-SUR-AGOUT,,,34293,,,,,,,,,,,,,,,,,,,1998-06-30,F,,,,,60.2B,NAF1993,N,2.653604,43.625787,0.78,street,La Pautru 34330 La Salvetat-sur-Agout,34293_odu41o,G,LA PAUTRU,
302248042,00012,30224804200012,O,1975-01-01,NN,,,2019-11-14T14:00:34,true,1,,,,RTE,DE LACAUNE,34330,LA SALVETAT-SUR-AGOUT,,,34293,,,,,,,,,,,,,,,,,,,2000-12-31,F,,,,,45.3E,NAF1993,N,2.679688,43.621333,0.82,locality,Route de Lacaune 34330 La Salvetat-sur-Agout,34293_0156,G,ROUTE DE LACAUNE,
302270921,00026,30227092100026,O,1994-07-04,,,,2019-11-14T14:00:34,true,4,,,,ALL,ST ETIENNE DE CAVALS,34330,LA SALVETAT-SUR-AGOUT,,,34293,,,,,,,,,,,,,,,,,,,2004-12-25,F,,,,,52.1C,NAFRev1,O,2.703474,43.602654,0.76,street,Allee Saint Etienne de Cavall 34330 La Salvetat-sur-Agout,34293_0300,G,ALLEE SAINT ETIENNE DE CAVALL,
304206006,00013,30420600600013,O,1975-01-01,NN,,,2019-11-14T14:00:34,true,1,,,,RTE,DE LACAUNE,34330,LA SALVETAT-SUR-AGOUT,,,34293,,,,,,,,,,,,,,,,,,,1998-12-31,F,,,,,55.2C,NAF1993,N,2.679688,43.621333,0.82,locality,Route de Lacaune 34330 La Salvetat-sur-Agout,34293_0156,G,ROUTE DE LACAUNE,
304357726,00013,30435772600013,O,,,,,2019-11-14T14:00:34,true,1,,,,,,34330,LA SALVETAT-SUR-AGOUT,,,34293,,,,,,,,,,,,,,,,,,,1984-12-25,F,,,,,62.11,NAP,N,,,0,,,,,,
304372568,00010,30437256800010,O,1966-01-01,NN,,,2019-11-14T14:00:34,true,1,,,,ESP,DES TROUBADOURS,34330,LA SALVETAT-SUR-AGOUT,,,34293,,,,,,,,,,,,,,,,,,,2001-02-28,F,,,,,52.1B,NAF1993,O,2.704637,43.600917,0.84,street,Esplanade des Troubadours 34330 La Salvetat-sur-Agout,34293_0330,G,ESPLANADE DES TROUBADOURS,
304568447,00060,30456844700060,O,2014-05-01,,,,2019-11-14T14:00:34,false,1,DOMAINE DE LABEL,,,RTE,GOUTTINE DE MAUR,34330,LA SALVETAT-SUR-AGOUT,,,34293,,,,,,,,,,,,,,,,,,,2014-05-01,F,,,,,96.04Z,NAFRev2,N,2.651126,43.577291,0.63,street,Hameau de Goutines de Maur 34330 La Salvetat-sur-Agout,34293_b116,G,HAMEAU DE GOUTINES DE MAUR,
304568447,00078,30456844700078,O,2014-05-01,,,,2019-11-14T14:00:34,true,1,DOMAINE DE LABEL,,,RTE,GOUTTINE DE MAUR,34330,LA SALVETAT-SUR-AGOUT,,,34293,,,,,,,,,,,,,,,,,,,2014-05-01,A,,,,,68.20A,NAFRev2,N,2.651126,43.577291,0.63,street,Hameau de Goutines de Maur 34330 La Salvetat-sur-Agout,34293_b116,G,HAMEAU DE GOUTINES DE MAUR,
305266744,00013,30526674400013,O,,NN,,,2019-11-14T14:00:34,true,1,,16,,RUE,DES CONSULS,34330,LA SALVETAT-SUR-AGOUT,,,34293,,,,,,,,,,,,,,,,,,,1990-01-01,F,,,,,81.21,NAP,N,2.703,43.60086,0.81,street,Rue des Consuls 34330 La Salvetat-sur-Agout,34293_0120,G,RUE DES CONSULS,
305445066,00015,30544506600015,O,1976-01-01,NN,,,2019-11-14T14:00:34,true,5,,,,PL,COMPOSTELLE,34330,LA SALVETAT-SUR-AGOUT,,,34293,,,,,,,,,,,,,,,,,,,2006-04-07,F,,,,,52.2C,NAFRev1,N,2.702882,43.602252,0.69,street,Place Compostele 34330 La Salvetat-sur-Agout,34293_0110,G,PLACE COMPOSTELE,
305571325,00011,30557132500011,O,,NN,,,2019-11-14T14:00:34,true,1,,16,,RUE,DES CONSULS,34330,LA SALVETAT-SUR-AGOUT,,,34293,,,,,,,,,,,,,,,,,,,1991-08-27,F,,,,,81.21,NAP,N,2.703,43.60086,0.81,street,Rue des Consuls 34330 La Salvetat-sur-Agout,34293_0120,G,RUE DES CONSULS,
306172453,00012,30617245300012,O,,NN,,,2019-11-14T14:00:34,true,1,,,,,FERME DE CAS,34330,LA SALVETAT-SUR-AGOUT,,,34293,,,,,,,,,,,,,,,,,,,,F,,,,,55.60,NAP,N,2.639403,43.590876,0.64,street,Avenue de la Ferme 34330 La Salvetat-sur-Agout,34293_0135,G,AVENUE DE LA FERME,
306269937,00018,30626993700018,O,1976-01-01,NN,,,2019-11-14T14:00:34,true,4,,,,,,34330,LA SALVETAT-SUR-AGOUT,,,34293,,,,,,,,,,,,,,,,,,,2003-06-02,F,,,,,45.2V,NAFRev1,N,,,0,,,,,,
306383969,00038,30638396900038,O,1997-07-01,NN,,,2019-11-14T14:00:34,true,7,,,,,RIEUMAJOU,34330,LA SALVETAT-SUR-AGOUT,,,34293,,,,,,,,,,,,,,,,,,,2011-09-08,F,,,,,43.34Z,NAFRev2,N,2.678003,43.598504,0.92,street,Lieu Dit Rieumajou 34330 La Salvetat-sur-Agout,34293_3avq7q,G,LIEU DIT RIEUMAJOU,
306608621,00018,30660862100018,O,1976-01-01,NN,,4399CZ,2019-11-14T14:00:34,true,4,,,,,BARRICAMPEMAR,34330,LA SALVETAT-SUR-AGOUT,,,34293,,,,,,,,,,,,,,,,,,,2014-12-31,F,,,,,43.99C,NAFRev2,N,,,0,,,,,,
308057546,00019,30805754600019,O,,,,,2019-11-14T14:00:34,true,1,,1,,RUE,TOUR DES HORTES,34330,LA SALVETAT-SUR-AGOUT,,,34293,,,,,,,,,,,,,,,,,,,1984-12-25,F,,,,,55.60,NAP,N,2.701807,43.601218,0.84,street,Rue le Tour des Hortes 34330 La Salvetat-sur-Agout,34293_0310,G,RUE LE TOUR DES HORTES,
308411438,00051,30841143800051,O,2006-03-01,NN,,,2019-11-14T14:00:34,false,2,LE PLO DEL REY,,,,LE SOULIE,34330,LA SALVETAT-SUR-AGOUT,,,34293,,,,,,,,,,,,,,,,,,,2007-02-10,F,LE PLO DEL REY,,,,92.7C,NAFRev1,N,2.708503,43.599796,0.47,street,Le Travers du Moulin 34330 La Salvetat-sur-Agout,34293_b289,G,LE TRAVERS DU MOULIN,
309592913,00011,30959291300011,O,1900-01-01,,,,2019-11-14T14:00:34,false,4,,,,LD,CANTARANNE,34330,LA SALVETAT-SUR-AGOUT,,,34293,,,,,,,,,,,,,,,,,,,1992-01-01,F,,,,,45.2V,NAF1993,N,1.8016792,43.3671015,0.89,poi.track,Chemin de Cantaranne Avignonet-Lauragais,https://osm.org/way/32751435,G,,
309592913,00029,30959291300029,O,1992-01-01,NN,,,2019-11-14T14:00:34,true,4,LD LE REC,,,RTE,DE LACAUNE,34330,LA SALVETAT-SUR-AGOUT,,,34293,,,,,,,,,,,,,,,,,,,2018-05-31,F,,,,,68.20B,NAFRev2,N,2.679688,43.621333,0.82,locality,Route de Lacaune 34330 La Salvetat-sur-Agout,34293_0156,G,ROUTE DE LACAUNE,
309598241,00011,30959824100011,O,,,,,2019-11-14T14:00:34,true,1,,,,ALL,DES PLATANES,34330,LA SALVETAT-SUR-AGOUT,,,34293,,,,,,,,,,,,,,,,,,,1987-12-25,F,,,,,67.04,NAP,N,2.70277,43.600439,0.37,street,Place des Archers 34330 La Salvetat-sur-Agout,34293_0010,G,PLACE DES ARCHERS,
310429626,00016,31042962600016,O,,,,,2019-11-14T14:00:34,true,1,,,,LD,LES BOULDOUIRES,34330,LA SALVETAT-SUR-AGOUT,,,34293,,,,,,,,,,,,,,,,,,,1984-12-25,F,,,,,81.21,NAP,N,2.680821,43.603017,0.94,street,Les Bouldouires 34330 La Salvetat-sur-Agout,34293_anj47t,G,LES BOULDOUIRES,
310563523,00011,31056352300011,O,,NN,,,2019-11-14T14:00:34,true,1,,,,,R DE LA SALVETAT,34330,LA SALVETAT-SUR-AGOUT,,,34293,,,,,,,,,,,,,,,,,,,1988-07-01,F,,,,,81.21,NAP,N,2.636954,43.593775,0.82,street,Rue de la Source 34330 La Salvetat-sur-Agout,34293_5vhlua,G,RUE DE LA SOURCE,
310765813,00012,31076581300012,O,,NN,,,2019-11-14T14:00:34,true,1,,,,RUE,DES HORTES,34330,LA SALVETAT-SUR-AGOUT,,,34293,,,,,,,,,,,,,,,,,,,1992-12-31,F,,,,,52.1B,NAF1993,N,2.701807,43.601218,0.86,street,Rue le Tour des Hortes 34330 La Salvetat-sur-Agout,34293_0310,G,RUE LE TOUR DES HORTES,
310776331,00012,31077633100012,O,1900-01-01,NN,,,2019-11-14T14:00:34,false,4,,,,,MONTEE DU BRISAOU,34330,LA SALVETAT-SUR-AGOUT,,,34293,,,,,,,,,,,,,,,,,,,1995-07-01,F,,,,,85.1C,NAF1993,O,2.703016,43.602019,0.94,street,Montee du Brisaou 34330 La Salvetat-sur-Agout,34293_0173,G,MONTEE DU BRISAOU,
310776331,00020,31077633100020,O,1995-07-01,01,2018,,2020-08-25T10:24:43,true,3,CABINET MEDICAL SALVETOIS,,,,CLOS DU GUE,34330,LA SALVETAT-SUR-AGOUT,,,34293,,,,,,,,,,,,,,,,,,,2008-01-01,A,,,,,86.21Z,NAFRev2,O,2.636716,43.592171,0.92,street,Rue le Clos du Gue 34330 La Salvetat-sur-Agout,34293_0097,G,RUE LE CLOS DU GUE,
311580625,00037,31158062500037,O,1994-07-01,NN,,,2019-11-14T14:00:34,false,3,,,,RUE,DE LA POTERNE,34330,LA SALVETAT-SUR-AGOUT,,,34293,,,,,,,,,,,,,,,,,,,1995-09-30,F,L ATELIER DE FELINES,,,,52.4H,NAF1993,N,2.703615,43.601055,0.94,street,Rue de la Poterne 34330 La Salvetat-sur-Agout,34293_0280,G,RUE DE LA POTERNE,
311580625,00045,31158062500045,O,1996-01-01,NN,,,2019-11-14T14:00:34,false,4,,,,,ZONE ARTISANALE,34330,LA SALVETAT-SUR-AGOUT,,,34293,,,,,,,,,,,,,,,,,,,2008-12-31,F,,,,,31.02Z,NAFRev2,O,2.7640352,42.6301915,0.9,poi.retail,Zone Artisanale (Zone commerciale) Thuir,https://osm.org/way/191039530,G,,
311580625,00052,31158062500052,O,2010-01-04,,,,2019-11-14T14:00:34,true,2,,,,,ZA,34330,LA SALVETAT-SUR-AGOUT,,,34293,,,,,,,,,,,,,,,,,,,2011-12-31,F,,,,,43.32A,NAFRev2,N,4.7170629,44.1023765,0.87,poi.industrial,ZA CNR (Zone industrielle) Caderousse,https://osm.org/way/74398546,G,,
312258130,00011,31225813000011,O,,,,,2019-11-14T14:00:34,true,1,,,,,,34330,LA SALVETAT-SUR-AGOUT,,,34293,,,,,,,,,,,,,,,,,,,1996-06-25,F,,,,,45.3A,NAF1993,N,,,0,,,,,,
313050866,00018,31305086600018,O,,NN,,,2019-11-14T14:00:34,true,1,,,,LD,GOUDAL,34330,LA SALVETAT-SUR-AGOUT,,,34293,,,,,,,,,,,,,,,,,,,1990-12-26,F,,,,,81.21,NAP,N,2.678445,43.627473,0.94,street,Goudal 34330 La Salvetat-sur-Agout,34293_ss77a7,G,GOUDAL,
313370884,00055,31337088400055,O,2004-01-01,NN,,,2019-11-14T14:00:34,false,4,,,,RUE,DE LA POTERNE,34330,LA SALVETAT-SUR-AGOUT,,,34293,,,,,,,,,,,,,,,,,,,2013-11-30,F,,,,,71.11Z,NAFRev2,N,2.703615,43.601055,0.94,street,Rue de la Poterne 34330 La Salvetat-sur-Agout,34293_0280,G,RUE DE LA POTERNE,
313643827,00022,31364382700022,O,1985-01-01,NN,,,2019-11-14T14:00:34,false,3,,,,RTE,D ANGLES,34330,LA SALVETAT-SUR-AGOUT,,,34293,,,,,,,,,,,,,,,,,,,2008-01-01,A,COLONIE FONT ROUGE,,,,55.20Z,NAFRev2,N,,,0,,,,,,
314067166,00012,31406716600012,O,1978-01-01,NN,,,2019-11-14T14:00:34,true,3,,,,,BONNEVAL RN RTE DU LACAUNE,34330,LA SALVETAT-SUR-AGOUT,,,34293,,,,,,,,,,,,,,,,,,,2008-01-01,A,,,,,68.20A,NAFRev2,N,,,0,,,,,,
314223975,00017,31422397500017,O,1900-01-01,,,,2019-11-14T14:00:34,true,3,,,,,VERGNE REDONDE,34330,LA SALVETAT-SUR-AGOUT,,,34293,,,,,,,,,,,,,,,,,,,1992-12-25,F,,,,,01.2C,NAF1993,N,2.698884,43.605105,0.5,street,Chemin du Gua de la Vergne 34330 La Salvetat-sur-Agout,34293_0152,G,CHEMIN DU GUA DE LA VERGNE,
314488529,00020,31448852900020,O,1988-09-30,NN,,,2019-11-14T14:00:34,false,4,,,,DOM,DE VERGNE REDONDE,34330,LA SALVETAT-SUR-AGOUT,,,34293,,,,,,,,,,,,,,,,,,,2000-01-08,F,,,,,92.6A,NAF1993,N,,,0,,,,,,
314502626,00026,31450262600026,O,1900-01-01,NN,,,2019-11-14T14:00:34,false,3,,,,,LA TAVERNE,34330,LA SALVETAT-SUR-AGOUT,,,34293,,,,,,,,,,,,,,,,,,,1992-12-25,F,,,,,02.0B,NAF1993,N,2.703615,43.601055,0.51,street,Rue de la Poterne 34330 La Salvetat-sur-Agout,34293_0280,G,RUE DE LA POTERNE,
314594235,00017,31459423500017,O,,NN,,,2019-11-14T14:00:34,true,1,,,,,,34330,LA SALVETAT-SUR-AGOUT,,,34293,,,,,,,,,,,,,,,,,,,1988-12-25,F,,,,,02.20,NAP,N,,,0,,,,,,
315051698,00019,31505169800019,O,,NN,,,2019-11-14T14:00:34,true,1,,,,RUE,DU PORCHE,34330,LA SALVETAT-SUR-AGOUT,,,34293,,,,,,,,,,,,,,,,,,,1988-06-12,F,,,,,81.11,NAP,N,2.703126,43.601119,0.94,street,Rue du Porche 34330 La Salvetat-sur-Agout,34293_0250,G,RUE DU PORCHE,
316035872,00043,31603587200043,O,2001-07-07,,,,2019-11-14T14:00:34,true,1,,,,RTE,DE LACAUNE,34330,LA SALVETAT-SUR-AGOUT,,,34293,,,,,,,,,,,,,,,,,,,2001-09-15,F,,,,,55.4B,NAF1993,N,2.679688,43.621333,0.82,locality,Route de Lacaune 34330 La Salvetat-sur-Agout,34293_0156,G,ROUTE DE LACAUNE,
316064898,00026,31606489800026,O,1983-06-01,NN,,,2019-11-14T14:00:34,true,1,,,,LD,DES TROUBADOURS,34330,LA SALVETAT-SUR-AGOUT,,,34293,,,,,,,,,,,,,,,,,,,2001-06-30,F,,,,,55.1A,NAF1993,O,2.704637,43.600917,0.92,street,Esplanade des Troubadours 34330 La Salvetat-sur-Agout,34293_0330,G,ESPLANADE DES TROUBADOURS,
316340470,00020,31634047000020,O,1983-07-01,NN,,,2019-11-14T14:00:34,true,4,,,,,COMBRES BEL AIR,34330,LA SALVETAT-SUR-AGOUT,,,34293,,,,,,,,,,,,,,,,,,,2018-12-31,F,,,,,01.49Z,NAFRev2,N,2.72128,43.563446,0.53,street,Combres 34330 La Salvetat-sur-Agout,34293_s5lrnu,G,COMBRES,
317411676,00016,31741167600016,O,,,,,2019-11-14T14:00:34,true,1,,,,,PORT DES BOULDOUIRES,34330,LA SALVETAT-SUR-AGOUT,,,34293,,,,,,,,,,,,,,,,,,,1987-12-25,F,,,,,86.10,NAP,N,2.680821,43.603017,0.64,street,Les Bouldouires 34330 La Salvetat-sur-Agout,34293_anj47t,G,LES BOULDOUIRES,
317963106,00016,31796310600016,O,1979-10-16,NN,,,2019-11-14T14:00:34,true,3,,,,RUE,DE LA POTERNE,34330,LA SALVETAT-SUR-AGOUT,,,34293,,,,,,,,,,,,,,,,,,,2008-01-01,A,,,,,68.31Z,NAFRev2,N,2.703615,43.601055,0.94,street,Rue de la Poterne 34330 La Salvetat-sur-Agout,34293_0280,G,RUE DE LA POTERNE,
318603156,00049,31860315600049,O,2006-07-01,,,4332AA,2019-11-14T14:00:34,true,3,,,,,MALDINIE,34330,LA SALVETAT-SUR-AGOUT,,,34293,,,,,,,,,,,,,,,,,,,2015-03-31,F,,,,,43.32A,NAFRev2,N,,,0,,,,,,
318647575,00014,31864757500014,O,,NN,,,2019-11-14T14:00:34,true,1,,,,PL,DES TROUBADOURS,34330,LA SALVETAT-SUR-AGOUT,,,34293,,,,,,,,,,,,,,,,,,,1990-11-30,F,,,,,64.49,NAP,N,2.704637,43.600917,0.79,street,Esplanade des Troubadours 34330 La Salvetat-sur-Agout,34293_0330,G,ESPLANADE DES TROUBADOURS,
319822243,00014,31982224300014,O,,NN,,,2019-11-14T14:00:34,true,1,,,,,GOUTTINES DE MAUR,34330,LA SALVETAT-SUR-AGOUT,,,34293,,,,,,,,,,,,,,,,,,,1988-12-25,F,,,,,02.20,NAP,N,2.651126,43.577291,0.82,street,Hameau de Goutines de Maur 34330 La Salvetat-sur-Agout,34293_b116,G,HAMEAU DE GOUTINES DE MAUR,
319824231,00017,31982423100017,O,,,,,2019-11-14T14:00:34,true,1,,,,RUE,DE LA POTERIE,34330,LA SALVETAT-SUR-AGOUT,,,34293,,,,,,,,,,,,,,,,,,,1984-12-25,F,,,,,64.47,NAP,N,2.703615,43.601055,0.79,street,Rue de la Poterne 34330 La Salvetat-sur-Agout,34293_0280,G,RUE DE LA POTERNE,
321061053,00021,32106105300021,O,,NN,,,2019-11-14T14:00:34,true,1,,,,,LA GACHE,34330,LA SALVETAT-SUR-AGOUT,,,34293,,,,,,,,,,,,,,,,,,,1988-12-31,F,,,,,02.20,NAP,N,2.684952,43.61731,0.92,street,Lieu Dit la Gache 34330 La Salvetat-sur-Agout,34293_vgyr9a,G,LIEU DIT LA GACHE,
321095226,00049,32109522600049,O,2012-04-12,,,,2019-11-14T14:00:34,true,1,,,,,LES BARTHEZES,34330,LA SALVETAT-SUR-AGOUT,,,34293,,,,,,,,,,,,,,,,,,,2012-04-12,A,,,,,01.42Z,NAFRev2,N,2.703841,43.646453,0.92,street,Lieu Dit les Barthezes 34330 La Salvetat-sur-Agout,34293_cjujdf,G,LIEU DIT LES BARTHEZES,
321095226,00056,32109522600056,O,2015-07-27,,,,2019-11-14T14:00:34,false,1,,,,LD,LES BARTHEZES,34330,LA SALVETAT-SUR-AGOUT,,,34293,,,,,,,,,,,,,,,,,,,2015-07-27,A,,,,,35.11Z,NAFRev2,N,2.703841,43.646453,0.92,street,Lieu Dit les Barthezes 34330 La Salvetat-sur-Agout,34293_cjujdf,G,LIEU DIT LES BARTHEZES,
321242984,00011,32124298400011,O,,,,,2019-11-14T14:00:34,true,1,,,,,CONDAX,34330,LA SALVETAT-SUR-AGOUT,,,34293,,,,,,,,,,,,,,,,,,,1984-12-25,F,,,,,62.43,NAP,N,2.672365,43.616714,0.94,street,Condax 34330 La Salvetat-sur-Agout,34293_h9n06o,G,CONDAX,
321311490,00023,32131149000023,O,1994-01-01,NN,,,2019-11-14T14:00:34,false,4,,161,,RUE,BARRI DU PONT,34330,LA SALVETAT-SUR-AGOUT,,,34293,,,,,,,,,,,,,,,,,,,2003-03-31,F,,,,,74.2C,NAFRev1,O,2.701259,43.599273,0.94,housenumber,161 Rue Barri du Pont 34330 La Salvetat-sur-Agout,34293_0040_00161,G,161 RUE BARRI DU PONT,
321597189,00018,32159718900018,O,1981-03-01,NN,,,2019-11-14T14:00:34,true,1,,,,,TOUR DES HORTS,34330,LA SALVETAT-SUR-AGOUT,,,34293,,,,,,,,,,,,,,,,,,,2001-06-30,F,,,,,45.3E,NAF1993,O,2.701807,43.601218,0.81,street,Rue le Tour des Hortes 34330 La Salvetat-sur-Agout,34293_0310,G,RUE LE TOUR DES HORTES,
321690034,00020,32169003400020,O,1981-03-23,NN,,,2019-11-14T14:00:34,false,3,,,,,MONTEE DU BRISADOU,34330,LA SALVETAT-SUR-AGOUT,,,34293,,,,,,,,,,,,,,,,,,,2008-01-01,A,,,,,69.10Z,NAFRev2,N,2.703016,43.602019,0.81,street,Montee du Brisaou 34330 La Salvetat-sur-Agout,34293_0173,G,MONTEE DU BRISAOU,
321933103,00012,32193310300012,O,1981-07-01,03,2018,1013BZ,2020-08-25T10:29:24,true,3,,,,PL,DE COMPOSTELLE,34330,LA SALVETAT-SUR-AGOUT,,,34293,,,,,,,,,,,,,,,,,,,2008-01-01,A,,,,,10.13A,NAFRev2,O,2.702882,43.602252,0.64,street,Place Compostele 34330 La Salvetat-sur-Agout,34293_0110,G,PLACE COMPOSTELE,