siren,nic,siret,statutDiffusionEtablissement,dateCreationEtablissement,trancheEffectifsEtablissement,anneeEffectifsEtablissement,activitePrincipaleRegistreMetiersEtablissement,dateDernierTraitementEtablissement,etablissementSiege,nombrePeriodesEtablissement,complementAdresseEtablissement,numeroVoieEtablissement,indiceRepetitionEtablissement,typeVoieEtablissement,libelleVoieEtablissement,codePostalEtablissement,libelleCommuneEtablissement,libelleCommuneEtrangerEtablissement,distributionSpecialeEtablissement,codeCommuneEtablissement,codeCedexEtablissement,libelleCedexEtablissement,codePaysEtrangerEtablissement,libellePaysEtrangerEtablissement,complementAdresse2Etablissement,numeroVoie2Etablissement,indiceRepetition2Etablissement,typeVoie2Etablissement,libelleVoie2Etablissement,codePostal2Etablissement,libelleCommune2Etablissement,libelleCommuneEtranger2Etablissement,distributionSpeciale2Etablissement,codeCommune2Etablissement,codeCedex2Etablissement,libelleCedex2Etablissement,codePaysEtranger2Etablissement,libellePaysEtranger2Etablissement,dateDebut,etatAdministratifEtablissement,enseigne1Etablissement,enseigne2Etablissement,enseigne3Etablissement,denominationUsuelleEtablissement,activitePrincipaleEtablissement,nomenclatureActivitePrincipaleEtablissement,caractereEmployeurEtablissement,longitude,latitude,geo_score,geo_type,geo_adresse,geo_id,geo_ligne,geo_l4,geo_l5
215100769,00011,21510076900011,O,1983-03-01,02,2018,,2020-08-25T10:17:34,true,3,,,,,,51800,BRAUX-SAINTE-COHIERE,,,51082,,,,,,,,,,,,,,,,,,,2008-01-01,A,MAIRIE,,,,84.11Z,NAFRev2,N,,,0,,,,,,
215100769,00029,21510076900029,O,1994-12-25,NN,,,2019-11-14T14:00:41,false,2,MAIRIE,,,,,51800,BRAUX-SAINTE-COHIERE,,,51082,,,,,,,,,,,,,,,,,,,2008-01-01,A,SERVICE D'EAU,,,,36.00Z,NAFRev2,N,,,0,,,,,,
265100768,00018,26510076800018,O,1983-03-01,NN,,,2019-11-14T14:00:41,true,4,MAIRIE,,,,,51800,BRAUX-SAINTE-COHIERE,,,51082,,,,,,,,,,,,,,,,,,,2016-01-01,F,CCAS,,,,88.99B,NAFRev2,N,,,0,,,,,,
295102735,00012,29510273500012,O,1983-08-10,NN,,,2019-11-14T14:00:41,true,3,MAIRIE,,,,,51800,BRAUX-SAINTE-COHIERE,,,51082,,,,,,,,,,,,,,,,,,,2008-01-01,A,,,,,42.99Z,NAFRev2,N,,,0,,,,,,
326069689,00031,32606968900031,O,2001-05-03,NN,,,2019-11-14T14:00:41,false,4,CHEZ MARCOUX GERARD,10,,RUE,CHEZ MR MARCOUX GERARD,51800,BRAUX-SAINTE-COHIERE,,,51082,,,,,,,,,,,,,,,,,,,2016-12-15,F,,,,,68.20B,NAFRev2,N,,,0,,,,,,
332060078,00026,33206007800026,O,2001-10-10,01,2018,,2020-08-25T10:35:22,true,3,,,,,GRANDE RUE,51800,BRAUX-SAINTE-COHIERE,,,51082,,,,,,,,,,,,,,,,,,,2008-01-01,A,,,,,01.11Z,NAFRev2,N,4.830646,49.090014,0.69,street,Grand Rue 51800 Braux-Sainte-Cohière,51082_fs4kj8,G,GRAND RUE,
348689084,00047,34868908400047,O,2010-04-01,,,,2019-11-14T14:00:41,true,2,,6,,,GRANDE RUE,51800,BRAUX-SAINTE-COHIERE,,,51082,,,,,,,,,,,,,,,,,,,2010-12-31,F,,,,,43.21A,NAFRev2,N,4.82948,49.091303,0.73,housenumber,6 Grand Rue 51800 Braux-Sainte-Cohière,51082_fs4kj8_00006,G,6 GRAND RUE,
350041778,00027,35004177800027,O,2012-12-01,,,,2019-11-14T14:00:41,true,1,,4,,RUE,DU MARAIS,51800,BRAUX-SAINTE-COHIERE,,,51082,,,,,,,,,,,,,,,,,,,2012-12-01,A,,,,,68.20B,NAFRev2,N,4.829651,49.090417,0.76,housenumber,4 Rue des Marais 51800 Braux-Sainte-Cohière,51082_0020_00004,G,4 RUE DES MARAIS,
353317050,00014,35331705000014,O,1990-01-01,NN,,,2019-11-14T14:00:41,true,3,,,,,,51800,BRAUX-SAINTE-COHIERE,,,51082,,,,,,,,,,,,,,,,,,,2008-01-01,A,,,,,01.11Z,NAFRev2,N,,,0,,,,,,
380653436,00010,38065343600010,O,1990-12-22,NN,,,2019-11-14T14:00:41,false,3,,,,,,51800,BRAUX-SAINTE-COHIERE,,BP 80,51082,,,,,,,,,,,,,,,,,,,2004-01-10,F,,,,,70.2B,NAFRev1,N,,,0,,,,,,
380653436,00028,38065343600028,O,2004-01-10,,,,2019-11-14T14:00:41,true,3,,20,,,GRANDE RUE,51800,BRAUX-SAINTE-COHIERE,,,51082,,,,,,,,,,,,,,,,,,,2008-01-01,A,,,,,68.20B,NAFRev2,N,4.827807,49.093484,0.74,housenumber,20 Grand Rue 51800 Braux-Sainte-Cohière,51082_fs4kj8_00020,G,20 GRAND RUE,
387569601,00017,38756960100017,O,1992-06-01,NN,,,2019-11-14T14:00:41,false,3,,,,RUE,DES MARAIS,51800,BRAUX-SAINTE-COHIERE,,,51082,,,,,,,,,,,,,,,,,,,2006-12-18,F,,,,,50.1Z,NAFRev1,N,4.82979,49.090707,0.93,street,Rue des Marais 51800 Braux-Sainte-Cohière,51082_0020,G,RUE DES MARAIS,
410687784,00018,41068778400018,O,1997-01-01,NN,,,2019-11-14T14:00:41,true,3,FERME DE PUISE,,,,,51800,BRAUX-SAINTE-COHIERE,,,51082,,,,,,,,,,,,,,,,,,,2008-01-01,A,,,,,01.11Z,NAFRev2,N,4.83917,49.08427,0.93,street,Ferme de Puise 51800 Braux-Sainte-Cohière,51082_b011,D,FERME DE PUISE,
410795744,00011,41079574400011,O,,,,,2019-11-14T14:00:41,true,1,,,,,,51800,BRAUX-SAINTE-COHIERE,,,51082,,,,,,,,,,,,,,,,,,,1997-08-30,F,,,,,01.3Z,NAF1993,N,,,0,,,,,,
410916449,00011,41091644900011,O,1997-01-01,NN,,,2019-11-14T14:00:41,true,3,,,,,,51800,BRAUX-SAINTE-COHIERE,,,51082,,,,,,,,,,,,,,,,,,,2008-01-01,A,,,,,68.20B,NAFRev2,N,,,0,,,,,,
420947947,00016,42094794700016,O,1998-11-01,NN,,,2019-11-14T14:00:41,true,3,,,,,GRANDE RUE,51800,BRAUX-SAINTE-COHIERE,,,51082,,,,,,,,,,,,,,,,,,,2008-01-01,A,,,,,01.11Z,NAFRev2,N,4.830646,49.090014,0.69,street,Grand Rue 51800 Braux-Sainte-Cohière,51082_fs4kj8,G,GRAND RUE,
480858844,00016,48085884400016,O,2005-01-26,NN,,,2019-11-14T14:00:41,false,2,,1,,,VOIE D ARGERS,51800,BRAUX-SAINTE-COHIERE,,,51082,,,,,,,,,,,,,,,,,,,2006-09-01,F,,,,,55.4C,NAFRev1,O,4.831777,49.09048,0.58,housenumber,1 Chemin d'Argers 51800 Braux-Sainte-Cohière,51082_5cm6m8_00001,G,1 CHEMIN D ARGERS,
480870237,00017,48087023700017,O,2005-02-01,,,,2019-11-14T14:00:41,false,2,,1,,,VOIE D'ARGERS,51800,BRAUX-SAINTE-COHIERE,,,51082,,,,,,,,,,,,,,,,,,,2006-09-01,F,,,,,70.2C,NAFRev1,N,4.831777,49.09048,0.58,housenumber,1 Chemin d'Argers 51800 Braux-Sainte-Cohière,51082_5cm6m8_00001,G,1 CHEMIN D ARGERS,
489997429,00019,48999742900019,O,2006-06-01,,,4332AA,2019-11-14T14:00:41,true,2,,8,,RUE,DES MARAIS,51800,BRAUX-SAINTE-COHIERE,,,51082,,,,,,,,,,,,,,,,,,,2008-01-01,A,,,,,43.32A,NAFRev2,N,4.829568,49.089647,0.93,housenumber,8 Rue des Marais 51800 Braux-Sainte-Cohière,51082_0020_00008,G,8 RUE DES MARAIS,
498138221,00011,49813822100011,O,2007-04-01,NN,,,2019-11-14T14:00:41,true,3,,3,,,GRAND'RUE,51800,BRAUX-SAINTE-COHIERE,,,51082,,,,,,,,,,,,,,,,,,,2013-03-01,A,,,,,01.61Z,NAFRev2,N,4.829658,49.090822,0.93,housenumber,3 Grand Rue 51800 Braux-Sainte-Cohière,51082_fs4kj8_00003,G,3 GRAND RUE,
499786705,00016,49978670500016,O,2007-09-01,00,2017,,2019-11-14T14:00:41,true,3,,,,,FERME DE PUISE,51800,BRAUX-SAINTE-COHIERE,,,51082,,,,,,,,,,,,,,,,,,,2014-12-31,A,,,,,01.50Z,NAFRev2,O,4.83917,49.08427,0.93,street,Ferme de Puise 51800 Braux-Sainte-Cohière,51082_b011,G,FERME DE PUISE,
530608082,00026,53060808200026,O,2018-06-15,,,4322AZ,2019-11-14T14:00:41,true,1,,6,,RUE,DES MARAIS,51800,BRAUX-SAINTE-COHIERE,,,51082,,,,,,,,,,,,,,,,,,,2018-06-15,A,,,,,43.22A,NAFRev2,N,4.829604,49.089975,0.93,housenumber,6 Rue des Marais 51800 Braux-Sainte-Cohière,51082_0020_00006,G,6 RUE DES MARAIS,
735510331,00011,73551033100011,O,,,,,2019-11-14T14:00:41,true,1,,,,,,51800,BRAUX-SAINTE-COHIERE,,,51082,,,,,,,,,,,,,,,,,,,1984-12-25,F,,,,,56.02,NAP,N,,,0,,,,,,
750393589,00015,75039358900015,O,2012-04-15,NN,,4391AZ,2019-11-14T14:00:41,true,1,,3,,,LOT LE GROS PRE,51800,BRAUX-SAINTE-COHIERE,,,51082,,,,,,,,,,,,,,,,,,,2012-04-15,A,,,,,43.91A,NAFRev2,N,4.836271,49.085895,0.87,housenumber,3 Lotissement le Gros Pre 51800 Braux-Sainte-Cohière,51082_al607u_00003,G,3 LOTISSEMENT LE GROS PRE,
751307968,00014,75130796800014,O,2012-05-02,,,,2019-11-14T14:00:41,true,2,,9,,,GRANDE RUE,51800,BRAUX-SAINTE-COHIERE,,,51082,,,,,,,,,,,,,,,,,,,2017-12-31,F,,,,,43.12A,NAFRev2,N,4.828434,49.092568,0.73,housenumber,9 Grand Rue 51800 Braux-Sainte-Cohière,51082_fs4kj8_00009,G,9 GRAND RUE,
780363354,00025,78036335400025,O,1985-10-10,NN,,,2019-11-14T14:00:41,true,3,,,,,,51800,BRAUX-SAINTE-COHIERE,,,51082,,,,,,,,,,,,,,,,,,,2008-01-01,A,,,,,01.11Z,NAFRev2,N,,,0,,,,,,
793245861,00018,79324586100018,O,2013-05-01,NN,,4399CZ,2020-01-16T08:38:38,true,5,,19,,,GRAND RUE,51800,BRAUX-SAINTE-COHIERE,,,51082,,,,,,,,,,,,,,,,,,,2019-02-01,F,,,,,43.99C,NAFRev2,O,4.826824,49.095089,0.93,housenumber,19 Grand Rue 51800 Braux-Sainte-Cohière,51082_fs4kj8_00019,G,19 GRAND RUE,
810294306,00016,81029430600016,O,2014-06-24,,,,2019-11-14T14:00:41,true,1,CHATEAU DE BRAUX SAINTE COHIERE,11,,,GRAND RUE,51800,BRAUX-SAINTE-COHIERE,,,51082,,,,,,,,,,,,,,,,,,,2014-06-24,A,,,,,94.99Z,NAFRev2,N,4.828434,49.092568,0.93,housenumber,11 Grand Rue 51800 Braux-Sainte-Cohière,51082_fs4kj8_00011,G,11 GRAND RUE,
828480566,00011,82848056600011,O,2017-03-01,,,4312AZ,2019-11-14T14:00:41,true,1,,,,,FERME DE PUISE,51800,BRAUX-SAINTE-COHIERE,,,51082,,,,,,,,,,,,,,,,,,,2017-03-01,A,,,,,01.61Z,NAFRev2,N,4.83917,49.08427,0.93,street,Ferme de Puise 51800 Braux-Sainte-Cohière,51082_b011,G,FERME DE PUISE,
833316847,00015,83331684700015,O,2017-11-15,,,,2019-11-14T14:00:41,true,1,,7,,,QUEUE DE L ETANG,51800,BRAUX-SAINTE-COHIERE,,,51082,,,,,,,,,,,,,,,,,,,2017-11-15,A,LA QUEUE DE L'ETANG,,,,93.29Z,NAFRev2,N,4.4833369,46.7928088,0.9,poi.water,La Queue de l'Étang (Eau) Le Breuil,https://osm.org/relation/4299486,G,,
