siren,nic,siret,statutDiffusionEtablissement,dateCreationEtablissement,trancheEffectifsEtablissement,anneeEffectifsEtablissement,activitePrincipaleRegistreMetiersEtablissement,dateDernierTraitementEtablissement,etablissementSiege,nombrePeriodesEtablissement,complementAdresseEtablissement,numeroVoieEtablissement,indiceRepetitionEtablissement,typeVoieEtablissement,libelleVoieEtablissement,codePostalEtablissement,libelleCommuneEtablissement,libelleCommuneEtrangerEtablissement,distributionSpecialeEtablissement,codeCommuneEtablissement,codeCedexEtablissement,libelleCedexEtablissement,codePaysEtrangerEtablissement,libellePaysEtrangerEtablissement,complementAdresse2Etablissement,numeroVoie2Etablissement,indiceRepetition2Etablissement,typeVoie2Etablissement,libelleVoie2Etablissement,codePostal2Etablissement,libelleCommune2Etablissement,libelleCommuneEtranger2Etablissement,distributionSpeciale2Etablissement,codeCommune2Etablissement,codeCedex2Etablissement,libelleCedex2Etablissement,codePaysEtranger2Etablissement,libellePaysEtranger2Etablissement,dateDebut,etatAdministratifEtablissement,enseigne1Etablissement,enseigne2Etablissement,enseigne3Etablissement,denominationUsuelleEtablissement,activitePrincipaleEtablissement,nomenclatureActivitePrincipaleEtablissement,caractereEmployeurEtablissement,longitude,latitude,geo_score,geo_type,geo_adresse,geo_id,geo_ligne,geo_l4,geo_l5
185704285,00013,18570428500013,O,1986-03-19,,,,2008-01-04T18:18:30,true,3,,,,,,57220,VARIZE-VAUDONCOURT,,,57695,,,,,,,,,,,,,,,,,,,2008-01-01,A,,,,,94.91Z,NAFRev2,N,,,0,,,,,,
215706953,00019,21570695300019,O,1983-03-01,02,2018,,2020-08-25T10:17:57,true,4,,14,,RTE,DE BANNAY,57220,VARIZE-VAUDONCOURT,,,57695,,,,,,,,,,,,,,,,,,,2008-01-01,A,MAIRIE,,,,84.11Z,NAFRev2,O,6.459368,49.134305,0.83,housenumber,14 Route de Bannay 57220 Varize-Vaudoncourt,57695_0002_00014,G,14 ROUTE DE BANNAY,
215706953,00027,21570695300027,O,1983-12-21,03,2018,,2020-08-25T10:17:57,false,3,,15,,RUE,DES ECOLES,57220,VARIZE-VAUDONCOURT,,,57695,,,,,,,,,,,,,,,,,,,2008-01-01,A,ECOLE PRIMAIRE PUBLIQUE,,,,85.20Z,NAFRev2,N,6.458007,49.134506,0.94,housenumber,15 Rue des Ecoles 57220 Varize-Vaudoncourt,57695_0009_00015,G,15 RUE DES ECOLES,
215706995,00010,21570699500010,O,1984-08-06,NN,,,2015-10-20T09:13:43,true,4,MAIRIE,14,,RTE,DE BANNAY,57220,VARIZE-VAUDONCOURT,,,57695,,,,,,,,,,,,,,,,,,,2014-04-01,F,,,,,84.11Z,NAFRev2,N,6.459368,49.134305,0.83,housenumber,14 Route de Bannay 57220 Varize-Vaudoncourt,57695_0002_00014,G,14 ROUTE DE BANNAY,
255705212,00017,25570521200017,O,2005-01-11,11,2018,,2020-08-25T10:20:30,true,3,MAIRIE,14,,RTE,DE BANNAY,57220,VARIZE-VAUDONCOURT,,,57695,,,,,,,,,,,,,,,,,,,2008-12-07,A,,,,,84.12Z,NAFRev2,O,6.459368,49.134305,0.83,housenumber,14 Route de Bannay 57220 Varize-Vaudoncourt,57695_0002_00014,G,14 ROUTE DE BANNAY,
295700157,00015,29570015700015,O,,NN,,,2006-11-25T09:10:51,true,1,,,,,MAIRIE,57220,VARIZE-VAUDONCOURT,,,57695,,,,,,,,,,,,,,,,,,,1990-12-25,F,,,,,90.12,NAP,N,3.0709671,50.6304695,0.92,poi.townhall,Hôtel de Ville Lille,https://osm.org/way/40917078,G,,
295700348,00010,29570034800010,O,,,,,2006-11-25T09:10:51,true,1,,,,,,57220,VARIZE-VAUDONCOURT,,,57695,,,,,,,,,,,,,,,,,,,,F,,,,,90.12,NAP,N,,,0,,,,,,
307322214,00098,30732221400098,O,1991-03-01,,,,2008-01-04T19:46:19,false,4,,,,,ZA SOUS L ECHANGEUR,57220,VARIZE-VAUDONCOURT,,,57695,,,,,,,,,,,,,,,,,,,2008-01-01,A,,,,,23.61Z,NAFRev2,N,6.468305,49.140862,0.48,street,Echangeur de Boulay 57220 Varize-Vaudoncourt,57695_jw4nfb,G,ECHANGEUR DE BOULAY,
313640948,00011,31364094800011,O,,NN,,,,true,1,,43,,RUE,NATIONALE,57220,VARIZE-VAUDONCOURT,,,57695,,,,,,,,,,,,,,,,,,,,F,,,,,77.14,NAP,N,6.456114,49.134775,0.5,housenumber,43 Rue Principale 57220 Varize-Vaudoncourt,57695_0024_00043,G,43 RUE PRINCIPALE,
315515221,00028,31551522100028,O,,NN,,,,true,1,,1,,RUE,PRINCIPALE,57220,VARIZE-VAUDONCOURT,,,57695,,,,,,,,,,,,,,,,,,,,F,,,,,55.71,NAP,N,6.459281,49.135471,0.94,housenumber,1 Rue Principale 57220 Varize-Vaudoncourt,57695_0024_00001,G,1 RUE PRINCIPALE,
317117752,00012,31711775200012,O,,NN,,,,true,1,,9,,,LOTISSEMENT LE CHATEAU,57220,VARIZE-VAUDONCOURT,,,57695,,,,,,,,,,,,,,,,,,,,F,,,,,77.05,NAP,N,6.44912,49.133231,0.51,street,Le Chateau 57220 Varize-Vaudoncourt,57695_68tkse,G,LE CHATEAU,
322060203,00039,32206020300039,O,2009-06-01,,,,2014-01-13T19:28:53,true,4,,12,,,LE PRE DU CHATEAU,57220,VARIZE-VAUDONCOURT,,,57695,,,,,,,,,,,,,,,,,,,2014-01-01,F,,,,,47.99A,NAFRev2,N,6.450352,49.132374,0.77,housenumber,12 Rue du Pre du Chateau 57220 Varize-Vaudoncourt,57695_0022_00012,G,12 RUE DU PRE DU CHATEAU,
323765727,00017,32376572700017,O,,NN,,,,true,1,,1,,RTE,DE BOULAY,57220,VARIZE-VAUDONCOURT,,,57695,,,,,,,,,,,,,,,,,,,1987-10-28,F,,,,,80.4A,NAF1993,N,6.468305,49.140862,0.65,housenumber,1 Echangeur de Boulay 57220 Varize-Vaudoncourt,57695_jw4nfb_00001,G,1 ECHANGEUR DE BOULAY,
326361482,00010,32636148200010,O,1983-01-03,NN,,,2014-12-10T10:42:14,true,4,,59,,RUE,PRINCIPALE,57220,VARIZE-VAUDONCOURT,,,57695,,,,,,,,,,,,,,,,,,,2014-11-18,F,,,,,96.09Z,NAFRev2,N,6.454202,49.134583,0.94,housenumber,59 Rue Principale 57220 Varize-Vaudoncourt,57695_0024_00059,G,59 RUE PRINCIPALE,
329081590,00013,32908159000013,O,1984-01-02,NN,,,,true,1,,6,,RUE,PRINCIPALE,57220,VARIZE-VAUDONCOURT,,,57695,,,,,,,,,,,,,,,,,,,1995-09-21,F,,,,,52.6G,NAF1993,N,6.45917,49.135206,0.94,interpolation,6 Rue Principale 57220 Varize-Vaudoncourt,,G,4 RUE PRINCIPALE,
329081608,00013,32908160800013,O,,NN,,,,true,1,,4,,RUE,DE LA FONTAINE,57220,VARIZE-VAUDONCOURT,,,57695,,,,,,,,,,,,,,,,,,,,F,,,,,64.43,NAP,N,6.454563,49.131238,0.86,street,Rue de la Fontaine 57220 Varize-Vaudoncourt,57695_exumql,G,RUE DE LA FONTAINE,
332829449,00039,33282944900039,O,1997-10-01,NN,,,2008-01-04T20:31:02,true,3,,37,,RUE,PRINCIPALE,57220,VARIZE-VAUDONCOURT,,,57695,,,,,,,,,,,,,,,,,,,2008-01-01,A,,,,,47.89Z,NAFRev2,N,6.456494,49.13485,0.94,housenumber,37 Rue Principale 57220 Varize-Vaudoncourt,57695_0024_00037,G,37 RUE PRINCIPALE,
338185846,00015,33818584600015,O,,NN,,,,true,1,,11,,RUE,DU CHATEAU,57220,VARIZE-VAUDONCOURT,,,57695,,,,,,,,,,,,,,,,,,,,F,,,,,51.10,NAP,N,6.450901,49.133412,0.94,housenumber,11 Rue du Château 57220 Varize-Vaudoncourt,57695_0006_00011,G,11 RUE DU CHATEAU,
338253081,11724,33825308111724,O,1999-09-01,NN,,,2010-04-18T04:43:08,false,5,CAT AFAEDAM,,,,MOULIN DU PONT DE PIERRE,57220,VARIZE-VAUDONCOURT,,,57695,,,,,,,,,,,,,,,,,,,2008-11-30,F,SODEXHO FRANCE HOTELLERIE ET SANTE,,,,56.29A,NAFRev2,O,6.444601,49.142593,0.93,street,Le Moulin du Pont de Pierre 57220 Varize-Vaudoncourt,57695_b091,G,LE MOULIN DU PONT DE PIERRE,
342210085,00011,34221008500011,O,,,,,,true,1,,7,,RUE,PRINCIPALE,57220,VARIZE-VAUDONCOURT,,,57695,,,,,,,,,,,,,,,,,,,1987-10-10,F,,,,,64.21,NAP,N,6.458828,49.135273,0.94,housenumber,7 Rue Principale 57220 Varize-Vaudoncourt,57695_0024_00007,G,7 RUE PRINCIPALE,
343233128,00028,34323312800028,O,1998-08-01,11,2018,1624ZA,2020-08-25T10:41:08,true,4,LIEU DIT SOUS L ECHANGEUR,,,,LIEU DIT SOUS L'ECHANGEUR,57220,VARIZE-VAUDONCOURT,,,57695,,,,,,,,,,,,,,,,,,,2008-01-01,A,,,,,16.24Z,NAFRev2,O,6.468305,49.140862,0.55,street,Echangeur de Boulay 57220 Varize-Vaudoncourt,57695_jw4nfb,G,ECHANGEUR DE BOULAY,
347961823,00015,34796182300015,O,,,,,,true,1,,,,,ZA SOUS L ECHANGEUR,57220,VARIZE-VAUDONCOURT,,,57695,,,,,,,,,,,,,,,,,,,1991-03-01,F,,,,,15.08,NAP,N,6.468305,49.140862,0.48,street,Echangeur de Boulay 57220 Varize-Vaudoncourt,57695_jw4nfb,G,ECHANGEUR DE BOULAY,
378327555,00025,37832755500025,O,,NN,,,,true,1,,,,,FERME DE PLAPPECOURT,57220,VARIZE-VAUDONCOURT,,,57695,,,,,,,,,,,,,,,,,,,1994-07-20,F,,,,,45.2U,NAF1993,O,6.439235,49.102024,0.94,street,Ferme de Plappecourt 57220 Varize-Vaudoncourt,57695_b087,G,FERME DE PLAPPECOURT,
381229913,00011,38122991300011,O,1990-06-01,NN,,,2008-11-08T00:38:56,false,3,,10,,CHE,DE LA CORNEE,57220,VARIZE-VAUDONCOURT,,,57695,,,,,,,,,,,,,,,,,,,1995-05-19,F,,,,,01.1A,NAF1993,N,6.460683,49.135312,0.66,housenumber,10 Chemin de la Grande Corvée 57220 Varize-Vaudoncourt,57695_0014_00010,G,10 CHEMIN DE LA GRANDE CORVEE,
381229913,00029,38122991300029,O,1995-05-19,NN,,,2008-01-04T21:53:09,true,3,FERME DES SOURCES,,,,,57220,VARIZE-VAUDONCOURT,,,57695,,,,,,,,,,,,,,,,,,,2008-01-01,A,,,,,01.50Z,NAFRev2,N,6.439235,49.102024,0.5,street,Ferme de Plappecourt 57220 Varize-Vaudoncourt,57695_b087,D,FERME DE PLAPPECOURT,
381695220,00032,38169522000032,O,2013-01-01,NN,,,2018-09-29T12:10:19,true,1,,,,,FERME DES SOURCES,57220,VARIZE-VAUDONCOURT,,,57695,,,,,,,,,,,,,,,,,,,2013-01-01,A,,,,,01.61Z,NAFRev2,N,6.439235,49.102024,0.5,street,Ferme de Plappecourt 57220 Varize-Vaudoncourt,57695_b087,G,FERME DE PLAPPECOURT,
381941798,00039,38194179800039,O,2012-02-20,,,,2017-08-08T08:22:13,true,2,VAUDONCOURT,8,,RUE,DE LA CHAPELLE,57220,VARIZE-VAUDONCOURT,,,57695,,,,,,,,,,,,,,,,,,,2016-12-31,F,,,,,62.02A,NAFRev2,N,6.453585,49.130311,0.94,housenumber,8 Rue de la Chapelle 57220 Varize-Vaudoncourt,57695_jv137o_00008,G,8 RUE DE LA CHAPELLE,
382909240,00014,38290924000014,O,1991-02-23,NN,,,,true,3,VAUDONCOURT,4,,RUE,DE LA CHAPELLE,57220,VARIZE-VAUDONCOURT,,,57695,,,,,,,,,,,,,,,,,,,1996-12-25,F,,,,,02.0B,NAF1993,N,6.458048,49.134684,0.94,housenumber,4 Rue de la Chapelle 57220 Varize-Vaudoncourt,57695_jv137o_00004,G,4 RUE DE LA CHAPELLE,
383606373,00017,38360637300017,O,1991-10-01,NN,,,2009-04-20T10:59:42,false,4,,26,,RUE,PRINCIPALE,57220,VARIZE-VAUDONCOURT,,,57695,,,,,,,,,,,,,,,,,,,2009-04-02,F,,,,,01.50Z,NAFRev2,N,6.456233,49.134701,0.94,housenumber,26 Rue Principale 57220 Varize-Vaudoncourt,57695_0024_00026,G,26 RUE PRINCIPALE,
383606373,00025,38360637300025,O,2009-04-02,01,2018,,2020-08-25T10:20:36,true,1,,43,,RUE,PRINCIPALE,57220,VARIZE-VAUDONCOURT,,,57695,,,,,,,,,,,,,,,,,,,2009-04-02,A,,,,,01.50Z,NAFRev2,N,6.456114,49.134775,0.94,housenumber,43 Rue Principale 57220 Varize-Vaudoncourt,57695_0024_00043,G,43 RUE PRINCIPALE,
388370256,00017,38837025600017,O,1992-07-01,NN,,,2006-10-28T01:21:28,true,4,,36,,RUE,PRINCIPALE,57220,VARIZE-VAUDONCOURT,,,57695,,,,,,,,,,,,,,,,,,,2004-08-31,F,,,,,01.3Z,NAFRev1,N,6.454678,49.134523,0.94,housenumber,36 Rue Principale 57220 Varize-Vaudoncourt,57695_0024_00036,G,36 RUE PRINCIPALE,
390433951,00014,39043395100014,O,1900-01-01,NN,,,2011-04-28T00:54:45,false,3,,,,,FERME DE PLAPPECOURT,57220,VARIZE-VAUDONCOURT,,,57695,,,,,,,,,,,,,,,,,,,1993-12-25,F,,,,,51.1R,NAF1993,N,6.439235,49.102024,0.94,street,Ferme de Plappecourt 57220 Varize-Vaudoncourt,57695_b087,G,FERME DE PLAPPECOURT,
390863157,00017,39086315700017,O,1993-03-23,NN,,,,true,1,,2,,RUE,DE LA CHAPELLE,57220,VARIZE-VAUDONCOURT,,,57695,,,,,,,,,,,,,,,,,,,2001-12-31,F,,,,,01.1A,NAF1993,N,6.458844,49.135071,0.94,housenumber,2 Rue de la Chapelle 57220 Varize-Vaudoncourt,57695_jv137o_00002,G,2 RUE DE LA CHAPELLE,
393239348,00013,39323934800013,O,1993-01-01,NN,,,,true,1,,,,,FERME DE LEOVILLER,57220,VARIZE-VAUDONCOURT,,,57695,,,,,,,,,,,,,,,,,,,1999-02-28,F,,,,,01.3Z,NAF1993,N,6.424651,49.116838,0.89,street,Ferme de Léovillers 57220 Varize-Vaudoncourt,57695_b092,G,FERME DE LEOVILLERS,
394199970,00010,39419997000010,O,1994-03-14,NN,,,2009-03-25T07:55:30,false,4,,2,,,FABRIQUE ST GEORGES,57220,VARIZE-VAUDONCOURT,,,57695,,,,,,,,,,,,,,,,,,,1995-12-25,F,,,,,01.4B,NAF1993,N,6.454133,49.132762,0.85,housenumber,2 Fabrique Saint Georges 57220 Varize-Vaudoncourt,57695_b090_00002,G,2 FABRIQUE SAINT GEORGES,
394749469,00018,39474946900018,O,1992-07-01,NN,,,,true,1,,,,,,57220,VARIZE-VAUDONCOURT,,,57695,,,,,,,,,,,,,,,,,,,1999-09-30,F,,,,,01.2A,NAF1993,N,,,0,,,,,,
395088792,00019,39508879200019,O,1994-05-19,NN,,,2008-11-08T01:02:00,false,3,,,,LD,LE HALLIER,57220,VARIZE-VAUDONCOURT,,,57695,,,,,,,,,,,,,,,,,,,1994-12-25,F,,,,,45.3F,NAF1993,O,6.46109,49.136451,0.67,street,Rue du Hallier 57220 Varize-Vaudoncourt,57695_461fcf,G,RUE DU HALLIER,
397693359,00028,39769335900028,O,2012-06-01,,,4332AA,2017-07-16T03:38:52,true,3,,1,,RUE,DES JARDINS,57220,VARIZE-VAUDONCOURT,,,57695,,,,,,,,,,,,,,,,,,,2017-05-22,A,,,,COPEAUX & CO,43.32A,NAFRev2,N,6.455534,49.136075,0.94,housenumber,1 Rue des Jardins 57220 Varize-Vaudoncourt,57695_s1zrqk_00001,G,1 RUE DES JARDINS,
398577890,00013,39857789000013,O,1994-01-14,NN,,,2008-01-04T18:52:53,true,5,VAUDONCOURT,10,,RUE,DE LA CHAPELLE,57220,VARIZE-VAUDONCOURT,,,57695,,,,,,,,,,,,,,,,,,,2008-01-01,A,,,,,70.22Z,NAFRev2,N,6.453451,49.130306,0.94,housenumber,10 Rue de la Chapelle 57220 Varize-Vaudoncourt,57695_jv137o_00010,G,10 RUE DE LA CHAPELLE,
400252946,00019,40025294600019,O,1995-04-01,NN,,,2008-11-08T01:08:40,true,4,,5,,IMP,CLEMENT KIEFFER,57220,VARIZE-VAUDONCOURT,,,57695,,,,,,,,,,,,,,,,,,,2003-06-30,F,,,,,45.4F,NAFRev1,N,6.451907,49.132841,0.85,housenumber,5 Impasse Clément Kieffer 57220 Varize-Vaudoncourt,57695_0015_00005,G,5 IMPASSE CLEMENT KIEFFER,
400800264,00022,40080026400022,O,1984-01-01,NN,,,2014-12-15T08:23:23,true,3,FERME DE PLAPPECOURT,,,,,57220,VARIZE-VAUDONCOURT,,,57695,,,,,,,,,,,,,,,,,,,2008-01-01,A,,,,,01.11Z,NAFRev2,N,6.439235,49.102024,0.94,street,Ferme de Plappecourt 57220 Varize-Vaudoncourt,57695_b087,D,FERME DE PLAPPECOURT,
404172280,00012,40417228000012,O,1996-04-01,NN,,,2014-07-08T01:36:30,true,5,,11,,RUE,DU CHATEAU,57220,VARIZE-VAUDONCOURT,,,57695,,,,,,,,,,,,,,,,,,,2011-01-01,F,,,,,43.22B,NAFRev2,O,6.450901,49.133412,0.94,housenumber,11 Rue du Château 57220 Varize-Vaudoncourt,57695_0006_00011,G,11 RUE DU CHATEAU,
405109935,00016,40510993500016,O,1996-04-30,NN,,,,true,3,,,,LD,LE HALLIER CD 19,57220,VARIZE-VAUDONCOURT,,,57695,,,,,,,,,,,,,,,,,,,1999-12-31,F,,,,,55.3A,NAF1993,O,6.46109,49.136451,0.45,street,Rue du Hallier 57220 Varize-Vaudoncourt,57695_461fcf,G,RUE DU HALLIER,
408933448,00016,40893344800016,O,1980-01-01,NN,,,,true,1,,59,,RUE,PRINCIPALE,57220,VARIZE-VAUDONCOURT,,,57695,,,,,,,,,,,,,,,,,,,1999-12-31,F,,,,,01.1F,NAF1993,N,6.454202,49.134583,0.94,housenumber,59 Rue Principale 57220 Varize-Vaudoncourt,57695_0024_00059,G,59 RUE PRINCIPALE,
410403232,00011,41040323200011,O,1993-09-01,NN,,,2006-10-28T03:47:52,true,3,,,,,FERME DES SOURCES,57220,VARIZE-VAUDONCOURT,,,57695,,,,,,,,,,,,,,,,,,,2004-12-31,F,,,,,01.1A,NAFRev1,N,6.439235,49.102024,0.5,street,Ferme de Plappecourt 57220 Varize-Vaudoncourt,57695_b087,G,FERME DE PLAPPECOURT,
411225444,00016,41122544400016,O,1996-11-06,NN,,,2008-01-04T21:55:31,true,3,MME SCHOUMACHER,36,,RUE,PRINCIPALE,57220,VARIZE-VAUDONCOURT,,,57695,,,,,,,,,,,,,,,,,,,2008-01-01,A,,,,,93.12Z,NAFRev2,O,6.454678,49.134523,0.94,housenumber,36 Rue Principale 57220 Varize-Vaudoncourt,57695_0024_00036,G,36 RUE PRINCIPALE,
412852352,00019,41285235200019,O,1997-01-01,NN,,,2009-10-16T09:20:29,false,3,,,,,FERME DES SOURCES,57220,VARIZE-VAUDONCOURT,,,57695,,,,,,,,,,,,,,,,,,,2008-01-01,A,,,,,01.50Z,NAFRev2,N,6.439235,49.102024,0.5,street,Ferme de Plappecourt 57220 Varize-Vaudoncourt,57695_b087,G,FERME DE PLAPPECOURT,
412932600,00015,41293260000015,O,1997-06-18,NN,,,2008-01-04T22:24:52,true,3,MR LEMAL PIERRE,3,,,LA BASSE COUR,57220,VARIZE-VAUDONCOURT,,,57695,,,,,,,,,,,,,,,,,,,2008-01-01,A,,,,,68.20A,NAFRev2,N,6.448949,49.134665,0.94,housenumber,3 La Basse Cour 57220 Varize-Vaudoncourt,57695_b003_00003,G,3 LA BASSE COUR,
420557720,00018,42055772000018,O,1998-10-01,NN,,,,true,1,,11,,RUE,PRINCIPALE,57220,VARIZE-VAUDONCOURT,,,57695,,,,,,,,,,,,,,,,,,,2000-07-05,F,,,,,28.3C,NAF1993,O,6.458535,49.135227,0.94,housenumber,11 Rue Principale 57220 Varize-Vaudoncourt,57695_0024_00011,G,11 RUE PRINCIPALE,
422023986,00017,42202398600017,O,1999-03-01,NN,,,2008-01-05T00:15:21,true,4,,,,,FERME DE LEOVILLERS,57220,VARIZE-VAUDONCOURT,,,57695,,,,,,,,,,,,,,,,,,,2008-01-01,A,,,,,68.20B,NAFRev2,N,6.424651,49.116838,0.94,street,Ferme de Léovillers 57220 Varize-Vaudoncourt,57695_b092,G,FERME DE LEOVILLERS,
423423136,00013,42342313600013,O,1999-06-22,NN,,,2008-01-05T00:37:10,true,3,MR MECKLER GERARD,,,,MOULIN PONT DE PIERRE,57220,VARIZE-VAUDONCOURT,,,57695,,,,,,,,,,,,,,,,,,,2008-01-01,A,,,,,94.99Z,NAFRev2,N,6.444601,49.142593,0.89,street,Le Moulin du Pont de Pierre 57220 Varize-Vaudoncourt,57695_b091,G,LE MOULIN DU PONT DE PIERRE,
424999241,00013,42499924100013,O,1999-10-01,,,,2016-04-26T01:57:41,false,5,,36,,RUE,PRINCIPALE,57220,VARIZE-VAUDONCOURT,,,57695,,,,,,,,,,,,,,,,,,,2014-04-30,F,,,,,01.50Z,NAFRev2,O,6.454678,49.134523,0.94,housenumber,36 Rue Principale 57220 Varize-Vaudoncourt,57695_0024_00036,G,36 RUE PRINCIPALE,
428631030,00015,42863103000015,O,2000-01-01,NN,,,2006-10-31T00:37:32,true,3,,59,,RUE,PRINCIPALE,57220,VARIZE-VAUDONCOURT,,,57695,,,,,,,,,,,,,,,,,,,2005-05-31,F,,,,,01.3Z,NAFRev1,N,6.454202,49.134583,0.94,housenumber,59 Rue Principale 57220 Varize-Vaudoncourt,57695_0024_00059,G,59 RUE PRINCIPALE,
431217546,00016,43121754600016,O,2000-04-26,NN,,,2015-01-13T19:33:29,true,4,,10,,RLE,RLE DU MOULIN,57220,VARIZE-VAUDONCOURT,,,57695,,,,,,,,,,,,,,,,,,,2014-08-22,F,,,,,71.12B,NAFRev2,N,6.456035,49.133701,0.78,housenumber,10 Ruelle du Moulin 57220 Varize-Vaudoncourt,57695_0017_00010,G,10 RUELLE DU MOULIN,
431575380,00016,43157538000016,O,1999-10-01,NN,,,2008-01-04T18:13:20,true,3,,36,,RUE,PRINCIPALE,57220,VARIZE-VAUDONCOURT,,,57695,,,,,,,,,,,,,,,,,,,2008-01-01,A,,,,,68.20B,NAFRev2,N,6.454678,49.134523,0.94,housenumber,36 Rue Principale 57220 Varize-Vaudoncourt,57695_0024_00036,G,36 RUE PRINCIPALE,
431942135,00028,43194213500028,O,2003-05-18,NN,,,2008-11-08T01:55:05,true,4,,19,,RUE,DU CHATEAU,57220,VARIZE-VAUDONCOURT,,,57695,,,,,,,,,,,,,,,,,,,2005-12-31,F,,,,,45.3A,NAFRev1,N,6.44899,49.133277,0.94,housenumber,19 Rue du Château 57220 Varize-Vaudoncourt,57695_0006_00019,G,19 RUE DU CHATEAU,
432222115,00011,43222211500011,O,2000-04-26,NN,,,2006-11-25T17:01:01,true,1,,10,,,RLE DU MOULIN,57220,VARIZE-VAUDONCOURT,,,57695,,,,,,,,,,,,,,,,,,,2001-12-31,F,,,,,74.1J,NAF1993,N,6.456035,49.133701,0.83,housenumber,10 Ruelle du Moulin 57220 Varize-Vaudoncourt,57695_0017_00010,G,10 RUELLE DU MOULIN,
432535672,00013,43253567200013,O,2000-05-02,NN,,,2007-04-17T16:30:20,true,3,,,,RTE,D HELSTROFF,57220,VARIZE-VAUDONCOURT,,,57695,,,,,,,,,,,,,,,,,,,2006-06-30,F,,,,,70.2A,NAFRev1,N,6.461964,49.136388,0.7,street,Sur le Chemin d'Helstroff 57220 Varize-Vaudoncourt,57695_b013,G,SUR LE CHEMIN D HELSTROFF,
432641751,00016,43264175100016,O,2000-06-20,NN,,,2007-04-03T06:39:04,true,4,,,,RTE,D'HELSTROFF,57220,VARIZE-VAUDONCOURT,,,57695,,,,,,,,,,,,,,,,,,,2004-04-01,F,,,,,55.3A,NAFRev1,N,6.461964,49.136388,0.7,street,Sur le Chemin d'Helstroff 57220 Varize-Vaudoncourt,57695_b013,G,SUR LE CHEMIN D HELSTROFF,
432689669,00013,43268966900013,O,2000-07-01,NN,,,2006-10-31T01:20:41,false,3,SARL LES TROIS MARGUERITES,,,RTE,D HELSTROFF,57220,VARIZE-VAUDONCOURT,,,57695,,,,,,,,,,,,,,,,,,,2004-04-01,F,,,,,74.1J,NAFRev1,N,6.461964,49.136388,0.7,street,Sur le Chemin d'Helstroff 57220 Varize-Vaudoncourt,57695_b013,G,SUR LE CHEMIN D HELSTROFF,
432689669,00021,43268966900021,O,2004-04-01,,,,2012-02-14T08:54:36,true,5,,43,,RUE,PRINCIPALE,57220,VARIZE-VAUDONCOURT,,,57695,,,,,,,,,,,,,,,,,,,2011-09-01,A,,,,,01.49Z,NAFRev2,N,6.456114,49.134775,0.94,housenumber,43 Rue Principale 57220 Varize-Vaudoncourt,57695_0024_00043,G,43 RUE PRINCIPALE,
432689826,00019,43268982600019,O,2000-07-01,NN,,,2006-11-25T17:03:52,true,3,SARL LES TROIS MARGUERITES,,,RTE,D HELSTROFF,57220,VARIZE-VAUDONCOURT,,,57695,,,,,,,,,,,,,,,,,,,2004-03-31,F,,,,,74.1J,NAFRev1,N,6.461964,49.136388,0.7,street,Sur le Chemin d'Helstroff 57220 Varize-Vaudoncourt,57695_b013,G,SUR LE CHEMIN D HELSTROFF,
438780710,00028,43878071000028,O,2018-04-27,01,2018,,2020-08-25T10:25:34,true,1,,43,,RUE,PRINCIPALE,57220,VARIZE-VAUDONCOURT,,,57695,,,,,,,,,,,,,,,,,,,2018-04-27,A,,,,,77.31Z,NAFRev2,N,6.456114,49.134775,0.94,housenumber,43 Rue Principale 57220 Varize-Vaudoncourt,57695_0024_00043,G,43 RUE PRINCIPALE,
439282237,00023,43928223700023,O,2003-11-25,NN,,,2014-07-08T02:18:05,false,5,,57,,RUE,PRINCIPALE,57220,VARIZE-VAUDONCOURT,,,57695,,,,,,,,,,,,,,,,,,,2011-12-01,F,,,,,43.91B,NAFRev2,O,6.454704,49.134584,0.94,housenumber,57 Rue Principale 57220 Varize-Vaudoncourt,57695_0024_00057,G,57 RUE PRINCIPALE,
440325405,00015,44032540500015,O,2002-01-01,NN,,,2008-01-04T20:54:21,true,3,,6,,,PRE DU CHATEAU,57220,VARIZE-VAUDONCOURT,,,57695,,,,,,,,,,,,,,,,,,,2008-01-01,A,,,,,74.30Z,NAFRev2,N,6.450273,49.13257,0.88,housenumber,6 Rue du Pre du Chateau 57220 Varize-Vaudoncourt,57695_0022_00006,G,6 RUE DU PRE DU CHATEAU,
441728664,00034,44172866400034,O,2015-04-13,,,4932ZA,2015-04-12T03:30:34,true,1,,,,,LIEU DIT FERME DE LEOVILLERS,57220,VARIZE-VAUDONCOURT,,,57695,,,,,,,,,,,,,,,,,,,2015-04-13,A,,,,,49.32Z,NAFRev2,N,6.424651,49.116838,0.94,street,Ferme de Léovillers 57220 Varize-Vaudoncourt,57695_b092,G,FERME DE LEOVILLERS,
443561006,00026,44356100600026,O,2008-09-05,,,,2010-10-27T11:43:45,true,2,,8,,RUE,DE LA CHAPELLE,57220,VARIZE-VAUDONCOURT,,,57695,,,,,,,,,,,,,,,,,,,2010-06-30,F,GROUPE LE CONSERVATEUR,,,,65.12Z,NAFRev2,N,6.453585,49.130311,0.94,housenumber,8 Rue de la Chapelle 57220 Varize-Vaudoncourt,57695_jv137o_00008,G,8 RUE DE LA CHAPELLE,
444665939,00013,44466593900013,O,2003-01-02,NN,,,,false,3,,41,,RUE,PRINCIPALE,57220,VARIZE-VAUDONCOURT,,,57695,,,,,,,,,,,,,,,,,,,2003-12-25,F,,,,,85.1G,NAFRev1,N,6.45632,49.134814,0.94,housenumber,41 Rue Principale 57220 Varize-Vaudoncourt,57695_0024_00041,G,41 RUE PRINCIPALE,
451262836,00021,45126283600021,O,2010-09-04,,,,2011-09-01T11:22:48,true,1,,3,,RTE,DE VAUDONCOURT,57220,VARIZE-VAUDONCOURT,,,57695,,,,,,,,,,,,,,,,,,,2010-09-04,A,,,,,68.20B,NAFRev2,N,6.453935,49.132924,0.85,housenumber,3 Route de Vaudoncourt 57220 Varize-Vaudoncourt,57695_0036_00003,G,3 ROUTE DE VAUDONCOURT,
452147689,00015,45214768900015,O,2004-02-15,,,,2008-01-05T02:38:56,true,3,,5,,RUE,DU PRE DU CHATEAU,57220,VARIZE-VAUDONCOURT,,,57695,,,,,,,,,,,,,,,,,,,2008-01-01,A,,,,,47.79Z,NAFRev2,N,6.450187,49.132569,0.94,housenumber,5 Rue du Pre du Chateau 57220 Varize-Vaudoncourt,57695_0022_00005,G,5 RUE DU PRE DU CHATEAU,
453184269,00018,45318426900018,O,2004-04-01,00,2017,1085ZZ,2019-06-24T13:11:39,false,5,,,,,ROUTE D'HELSTROFF,57220,VARIZE-VAUDONCOURT,,,57695,,,,,,,,,,,,,,,,,,,2017-12-21,F,RESTAURANT A L'ANGLE,,,L'AUBERGE DE VARIZE,56.10A,NAFRev2,O,6.461964,49.136388,0.63,street,Sur le Chemin d'Helstroff 57220 Varize-Vaudoncourt,57695_b013,G,SUR LE CHEMIN D HELSTROFF,
453650863,00013,45365086300013,O,2004-05-17,NN,,,2009-06-27T11:23:37,false,4,VAUDONCOURT,2,,,FERME DE PLAPPECOURT,57220,VARIZE-VAUDONCOURT,,,57695,,,,,,,,,,,,,,,,,,,2007-01-02,F,,,,,28.1C,NAFRev1,O,6.438276,49.100932,0.94,housenumber,2 Ferme de Plappecourt 57220 Varize-Vaudoncourt,57695_b087_00002,G,2 FERME DE PLAPPECOURT,
480522044,00019,48052204400019,O,2005-01-01,,,,2007-02-06T06:51:25,true,2,,,,,FERME DES SOURCES,57220,VARIZE-VAUDONCOURT,,,57695,,,,,,,,,,,,,,,,,,,2006-12-31,F,,,,,01.1A,NAFRev1,N,6.439235,49.102024,0.5,street,Ferme de Plappecourt 57220 Varize-Vaudoncourt,57695_b087,G,FERME DE PLAPPECOURT,
481535094,00017,48153509400017,O,2005-03-09,,,,2011-12-29T18:07:54,true,2,,,,RTE,D'HELSTROFF,57220,VARIZE-VAUDONCOURT,,,57695,,,,,,,,,,,,,,,,,,,2008-01-01,A,,,,,68.20B,NAFRev2,N,6.461964,49.136388,0.7,street,Sur le Chemin d'Helstroff 57220 Varize-Vaudoncourt,57695_b013,G,SUR LE CHEMIN D HELSTROFF,
482007770,00019,48200777000019,O,2005-04-01,NN,,,2014-07-10T00:10:34,true,4,,,,,SORTIE ECHANGEUR DE BOULAY,57220,VARIZE-VAUDONCOURT,,,57695,,,,,,,,,,,,,,,,,,,2009-03-27,F,,,,,47.52B,NAFRev2,N,6.468305,49.140862,0.73,street,Echangeur de Boulay 57220 Varize-Vaudoncourt,57695_jw4nfb,G,ECHANGEUR DE BOULAY,
483951851,00011,48395185100011,O,2005-06-01,NN,,,2011-04-23T14:34:22,false,3,,59,,RUE,PRINCIPALE,57220,VARIZE-VAUDONCOURT,,,57695,,,,,,,,,,,,,,,,,,,2011-02-01,F,,,,,01.41Z,NAFRev2,N,6.454202,49.134583,0.94,housenumber,59 Rue Principale 57220 Varize-Vaudoncourt,57695_0024_00059,G,59 RUE PRINCIPALE,
483951851,00029,48395185100029,O,2011-02-01,,,,2011-03-21T08:37:05,true,1,,,,,59 BIS RUE PRINCIPALE,57220,VARIZE-VAUDONCOURT,,,57695,,,,,,,,,,,,,,,,,,,2011-02-01,A,,,,,01.41Z,NAFRev2,N,6.454008,49.134557,0.94,housenumber,59 bis Rue Principale 57220 Varize-Vaudoncourt,57695_0024_00059_bis,G,59 BIS RUE PRINCIPALE,