siren,nic,siret,statutDiffusionEtablissement,dateCreationEtablissement,trancheEffectifsEtablissement,anneeEffectifsEtablissement,activitePrincipaleRegistreMetiersEtablissement,dateDernierTraitementEtablissement,etablissementSiege,nombrePeriodesEtablissement,complementAdresseEtablissement,numeroVoieEtablissement,indiceRepetitionEtablissement,typeVoieEtablissement,libelleVoieEtablissement,codePostalEtablissement,libelleCommuneEtablissement,libelleCommuneEtrangerEtablissement,distributionSpecialeEtablissement,codeCommuneEtablissement,codeCedexEtablissement,libelleCedexEtablissement,codePaysEtrangerEtablissement,libellePaysEtrangerEtablissement,complementAdresse2Etablissement,numeroVoie2Etablissement,indiceRepetition2Etablissement,typeVoie2Etablissement,libelleVoie2Etablissement,codePostal2Etablissement,libelleCommune2Etablissement,libelleCommuneEtranger2Etablissement,distributionSpeciale2Etablissement,codeCommune2Etablissement,codeCedex2Etablissement,libelleCedex2Etablissement,codePaysEtranger2Etablissement,libellePaysEtranger2Etablissement,dateDebut,etatAdministratifEtablissement,enseigne1Etablissement,enseigne2Etablissement,enseigne3Etablissement,denominationUsuelleEtablissement,activitePrincipaleEtablissement,nomenclatureActivitePrincipaleEtablissement,caractereEmployeurEtablissement,longitude,latitude,geo_score,geo_type,geo_adresse,geo_id,geo_ligne,geo_l4,geo_l5
215800541,00017,21580054100017,O,1983-03-01,01,2018,,2020-08-25T10:17:57,true,3,,,,,,58700,CHAMPLIN,,,58054,,,,,,,,,,,,,,,,,,,2008-01-01,A,MAIRIE,,,,84.11Z,NAFRev2,N,,,0,,,,,,
265800540,00014,26580054000014,O,1983-03-01,NN,,,2016-07-23T12:15:42,true,4,,,,,MAIRIE,58700,CHAMPLIN,,,58054,,,,,,,,,,,,,,,,,,,2015-09-12,F,CCAS,,,,88.99B,NAFRev2,N,3.0709671,50.6304695,0.92,poi.townhall,Hôtel de Ville Lille,https://osm.org/way/40917078,G,,
295800544,00013,29580054400013,O,,NN,,,,true,1,,,,,MAIRIE,58700,CHAMPLIN,,,58054,,,,,,,,,,,,,,,,,,,1990-11-19,F,,,,,70.1C,NAF1993,N,3.0709671,50.6304695,0.92,poi.townhall,Hôtel de Ville Lille,https://osm.org/way/40917078,G,,
314500281,00014,31450028100014,O,1978-01-01,NN,,,2010-04-18T03:42:42,true,5,,,,LD,LESRUES,58700,CHAMPLIN,,,58054,,,,,,,,,,,,,,,,,,,2008-04-30,F,,,,,01.50Z,NAFRev2,N,3.452615,47.245761,0.69,street,Les Rues 58700 Champlin,58054_719sym,G,LES RUES,
315289496,00012,31528949600012,O,,NN,,,2010-04-18T03:44:28,true,1,,,,,,58700,CHAMPLIN,,,58054,,,,,,,,,,,,,,,,,,,1988-09-02,F,,,,,01.3Z,NAF1993,N,,,0,,,,,,
339770760,00017,33977076000017,O,1987-01-01,NN,,,2020-01-08T03:56:37,true,4,,,,,FERME DE PRIEZ,58700,CHAMPLIN,,,58054,,,,,,,,,,,,,,,,,,,2008-01-01,A,,,,,01.50Z,NAFRev2,N,3.451616,47.244223,0.45,street,Rue du Priez 58700 Champlin,58054_0055,G,RUE DU PRIEZ,
383800430,00019,38380043000019,O,1991-10-18,NN,,,2015-11-27T03:18:34,true,3,MAIRIE,,,,,58700,CHAMPLIN,,,58054,,,,,,,,,,,,,,,,,,,2008-01-01,A,,,,,77.31Z,NAFRev2,N,,,0,,,,,,
393322193,00029,39332219300029,O,1993-01-01,NN,,,,false,3,,,,,,58700,CHAMPLIN,,,58054,,,,,,,,,,,,,,,,,,,2002-12-31,F,,,,,01.3Z,NAF1993,N,,,0,,,,,,
491838587,00021,49183858700021,O,2017-02-28,,,,2017-04-14T14:48:23,true,1,MAIRIE DE CHAMPLIN,22,,RTE,DE BRINON,58700,CHAMPLIN,,,58054,,,,,,,,,,,,,,,,,,,2017-02-28,A,,,,,77.31Z,NAFRev2,N,3.446945,47.241519,0.82,housenumber,22 Route de Brinon 58700 Champlin,58054_0005_00022,G,22 ROUTE DE BRINON,
530864719,00022,53086471900022,O,2012-02-25,01,2018,4932ZA,2020-08-25T10:43:42,true,2,LA BAVESLE SAINT BENOIT,46,,RTE,DE BRINON,58700,CHAMPLIN,,,58054,,,,,,,,,,,,,,,,,,,2017-10-16,A,,,,TAXI BORIES,49.32Z,NAFRev2,O,3.453084,47.247522,0.82,housenumber,46 Route de Brinon 58700 Champlin,58054_0005_00046,G,46 ROUTE DE BRINON,
601875529,00013,60187552900013,O,,NN,,,,true,1,,,,,,58700,CHAMPLIN,,,58054,,,,,,,,,,,,,,,,,,,,F,,,,,21.01,NAP,N,,,0,,,,,,
809891591,00012,80989159100012,O,2006-05-01,,,,2015-04-09T17:07:39,true,1,,53,,RUE,DU PRIEZ,58700,CHAMPLIN,,,58054,,,,,,,,,,,,,,,,,,,2006-05-01,A,,,,,68.20A,NAFRev2,N,3.451482,47.243977,0.92,housenumber,53 Rue du Priez 58700 Champlin,58054_0055_00053,G,53 RUE DU PRIEZ,
832540702,00012,83254070200012,O,2016-10-17,,,,2017-10-11T10:17:54,true,1,,45,,RTE,DE BRINON-SUR-BEUVRON,58700,CHAMPLIN,,,58054,,,,,,,,,,,,,,,,,,,2016-10-17,A,,,,,94.12Z,NAFRev2,N,3.452038,47.24584,0.53,housenumber,45 Route de Brinon 58700 Champlin,58054_0005_00045,G,45 ROUTE DE BRINON,
