siren,nic,siret,statutDiffusionEtablissement,dateCreationEtablissement,trancheEffectifsEtablissement,anneeEffectifsEtablissement,activitePrincipaleRegistreMetiersEtablissement,dateDernierTraitementEtablissement,etablissementSiege,nombrePeriodesEtablissement,complementAdresseEtablissement,numeroVoieEtablissement,indiceRepetitionEtablissement,typeVoieEtablissement,libelleVoieEtablissement,codePostalEtablissement,libelleCommuneEtablissement,libelleCommuneEtrangerEtablissement,distributionSpecialeEtablissement,codeCommuneEtablissement,codeCedexEtablissement,libelleCedexEtablissement,codePaysEtrangerEtablissement,libellePaysEtrangerEtablissement,complementAdresse2Etablissement,numeroVoie2Etablissement,indiceRepetition2Etablissement,typeVoie2Etablissement,libelleVoie2Etablissement,codePostal2Etablissement,libelleCommune2Etablissement,libelleCommuneEtranger2Etablissement,distributionSpeciale2Etablissement,codeCommune2Etablissement,codeCedex2Etablissement,libelleCedex2Etablissement,codePaysEtranger2Etablissement,libellePaysEtranger2Etablissement,dateDebut,etatAdministratifEtablissement,enseigne1Etablissement,enseigne2Etablissement,enseigne3Etablissement,denominationUsuelleEtablissement,activitePrincipaleEtablissement,nomenclatureActivitePrincipaleEtablissement,caractereEmployeurEtablissement,longitude,latitude,geo_score,geo_type,geo_adresse,geo_id,geo_ligne,geo_l4,geo_l5
200005429,00010,20000542900010,O,2006-10-16,NN,,,2015-05-14T03:24:29,true,4,,,,,LA GUINIERE,79390,AUBIGNY,,,79019,,,,,,,,,,,,,,,,,,,2014-01-01,F,,,,,84.13Z,NAFRev2,O,-0.121499,46.735862,0.91,street,Rue de la Guiniere 79390 Aubigny,79019_0050,G,RUE DE LA GUINIERE,
200041416,00120,20004141600120,O,2014-01-01,03,2018,,2020-08-25T10:14:51,false,1,,1,,RUE,DE LA GUINIERE,79390,AUBIGNY,,,79019,,,,,,,,,,,,,,,,,,,2014-01-01,A,CHEVALERIE DU THOUET,,,,84.13Z,NAFRev2,N,-0.121499,46.735862,0.93,housenumber,1 Rue de la Guiniere 79390 Aubigny,79019_0050_00001,G,1 RUE DE LA GUINIERE,
217900190,00018,21790019000018,O,1983-03-01,01,2018,,2020-08-25T10:19:13,true,4,,,,,,79390,AUBIGNY,,,79019,,,,,,,,,,,,,,,,,,,2008-01-01,A,MAIRIE,,,,84.11Z,NAFRev2,N,,,0,,,,,,
257901900,00015,25790190000015,O,1993-06-01,NN,,,2006-12-05T03:43:10,true,4,MAIRIE,,,,,79390,AUBIGNY,,,79019,,,,,,,,,,,,,,,,,,,2006-10-16,F,,,,,75.1A,NAFRev1,N,-0.126808,46.734075,0.5,street,Impasse de la Marauderie 79390 Aubigny,79019_0060,D,IMPASSE DE LA MARAUDERIE,
267902518,00013,26790251800013,O,1995-12-25,NN,,,2017-08-06T14:18:26,true,3,MAIRIE,,,,,79390,AUBIGNY,,,79019,,,,,,,,,,,,,,,,,,,2017-08-01,F,CCAS,,,,88.99B,NAFRev2,N,-0.126808,46.734075,0.5,street,Impasse de la Marauderie 79390 Aubigny,79019_0060,D,IMPASSE DE LA MARAUDERIE,
297900136,00013,29790013600013,O,,NN,,,2006-11-25T09:11:07,true,1,,,,,MAIRIE,79390,AUBIGNY,,,79019,,,,,,,,,,,,,,,,,,,1991-03-14,F,,,,,90.12,NAP,N,-0.126808,46.734075,0.5,street,Impasse de la Marauderie 79390 Aubigny,79019_0060,G,IMPASSE DE LA MARAUDERIE,
303888366,00018,30388836600018,O,,NN,,,,true,1,,,,,BOURG D'AUBIGNY,79390,AUBIGNY,,,79019,,,,,,,,,,,,,,,,,,,,F,,,,,38.40,NAP,N,-0.129035,46.738061,0.64,street,Rue du Bourneu 79390 Aubigny,79019_j2tig5,G,RUE DU BOURNEU,
307353730,00012,30735373000012,O,1976-01-01,NN,,4399CZ,2015-03-17T00:11:55,true,5,,,,,,79390,AUBIGNY,,,79019,,,,,,,,,,,,,,,,,,,2005-03-31,F,,,,,45.1A,NAFRev1,N,,,0,,,,,,
309254803,00013,30925480300013,O,,NN,,9999ZZ,2015-03-17T00:12:09,true,1,,,,,,79390,AUBIGNY,,,79019,,,,,,,,,,,,,,,,,,,1987-12-31,F,,,,,47.04,NAP,N,,,0,,,,,,
309525343,00013,30952534300013,O,1977-01-01,NN,,4333ZZ,2015-03-17T00:12:13,true,1,,,,,LA COUDRELLE,79390,AUBIGNY,,,79019,,,,,,,,,,,,,,,,,,,2001-12-31,F,,,,,45.4F,NAF1993,O,-0.128008,46.73508,0.36,street,Rue de la Clé des Champs 79390 Aubigny,79019_0030,G,RUE DE LA CLE DES CHAMPS,
310124177,00018,31012417700018,O,,NN,,,,true,1,,,,,AUBIGNY,79390,AUBIGNY,,,79019,,,,,,,,,,,,,,,,,,,1989-06-15,F,,,,,60.01,NAP,N,-0.103568,46.738045,0.93,municipality,Aubigny,79019,G,AUBIGNY,
320130453,00014,32013045300014,O,1980-10-01,01,2018,,2020-08-25T10:28:33,true,3,,,,,LE GRAND BOIS,79390,AUBIGNY,,,79019,,,,,,,,,,,,,,,,,,,2008-01-01,A,,,,,01.50Z,NAFRev2,N,-0.09743,46.72943,0.93,locality,Le Grand Bois 79390 Aubigny,79019_b034,G,LE GRAND BOIS,
330286394,00011,33028639400011,O,1984-06-27,NN,,,,true,1,,,,LD,LE VALLON,79390,AUBIGNY,,,79019,,,,,,,,,,,,,,,,,,,1999-11-05,F,,,,,70.3A,NAF1993,N,-0.124226,46.738445,0.46,street,Rue Germain Rallon 79390 Aubigny,79019_0048,G,RUE GERMAIN RALLON,
330366683,00010,33036668300010,O,1984-01-14,NN,,,2008-04-26T09:57:08,true,4,,,,,,79390,AUBIGNY,,,79019,,,,,,,,,,,,,,,,,,,2006-10-16,F,,,,,91.3E,NAFRev1,O,,,0,,,,,,
331840389,00018,33184038900018,O,1985-02-01,NN,,,,true,1,,,,,LE BOURG,79390,AUBIGNY,,,79019,,,,,,,,,,,,,,,,,,,1999-06-30,F,,,,,55.3A,NAF1993,N,-0.095746,46.730038,0.51,locality,Le Bois du Guy 79390 Aubigny,79019_b006,G,LE BOIS DU GUY,
334364155,00013,33436415500013,O,,NN,,9999ZZ,2015-03-17T00:22:33,true,1,,,,,FONDECHIEN,79390,AUBIGNY,,,79019,,,,,,,,,,,,,,,,,,,1991-12-31,F,,,,,55.71,NAP,N,-0.126635,46.737314,0.42,street,Rue du Fief des Fonderies 79390 Aubigny,79019_0038,G,RUE DU FIEF DES FONDERIES,
334623394,00015,33462339400015,O,,NN,,,,true,1,,,,,LE GRAND BOIS,79390,AUBIGNY,,,79019,,,,,,,,,,,,,,,,,,,,F,,,,,55.60,NAP,N,-0.09743,46.72943,0.93,locality,Le Grand Bois 79390 Aubigny,79019_b034,G,LE GRAND BOIS,
339309296,00012,33930929600012,O,,NN,,,,true,1,,,,,BOURG D'AUBIGNY,79390,AUBIGNY,,,79019,,,,,,,,,,,,,,,,,,,1987-03-31,F,,,,,38.40,NAP,N,-0.129035,46.738061,0.64,street,Rue du Bourneu 79390 Aubigny,79019_j2tig5,G,RUE DU BOURNEU,
390251544,00016,39025154400016,O,,NN,,,,true,1,,,,,LA COUDRELLE,79390,AUBIGNY,,,79019,,,,,,,,,,,,,,,,,,,1992-10-31,F,,,,,01.2A,NAF1993,N,-0.128008,46.73508,0.36,street,Rue de la Clé des Champs 79390 Aubigny,79019_0030,G,RUE DE LA CLE DES CHAMPS,
392166757,00014,39216675700014,O,1992-12-25,NN,,,,true,1,,,,,LA COUDRELLE,79390,AUBIGNY,,,79019,,,,,,,,,,,,,,,,,,,2002-03-31,F,,,,,01.1A,NAF1993,N,-0.128008,46.73508,0.36,street,Rue de la Clé des Champs 79390 Aubigny,79019_0030,G,RUE DE LA CLE DES CHAMPS,
392237673,00018,39223767300018,O,1992-12-25,NN,,,,true,2,,,,,RIGOURDAINE,79390,AUBIGNY,,,79019,,,,,,,,,,,,,,,,,,,1998-12-25,F,,,,,01.3Z,NAF1993,N,-0.1312861,46.7387742,0.89,poi.track,Chemin de Rigourdaine Aubigny,https://osm.org/way/550262604,G,,
397665951,00018,39766595100018,O,1994-04-01,NN,,,,true,1,,,,,RIGOURDAINE,79390,AUBIGNY,,,79019,,,,,,,,,,,,,,,,,,,1999-03-28,F,,,,,70.2A,NAF1993,N,-0.1312861,46.7387742,0.89,poi.track,Chemin de Rigourdaine Aubigny,https://osm.org/way/550262604,G,,
403775331,00016,40377533100016,O,1900-01-01,NN,,4776ZP,2015-03-17T00:46:29,false,3,,,,,LA BOUQUETIERE,79390,AUBIGNY,,,79019,,,,,,,,,,,,,,,,,,,1996-12-25,F,,,,,52.4X,NAF1993,N,-0.121499,46.735862,0.37,street,Rue de la Guiniere 79390 Aubigny,79019_0050,G,RUE DE LA GUINIERE,
403775331,00024,40377533100024,O,2004-06-01,,,,2008-01-04T20:28:48,true,3,LA BOUQUETIERE,11,,RUE,DES PARANCHES,79390,AUBIGNY,,,79019,,,,,,,,,,,,,,,,,,,2008-01-01,A,,,,,01.49Z,NAFRev2,N,-0.078545,46.728685,0.93,housenumber,11 Rue des Paranches 79390 Aubigny,79019_0068_00011,G,11 RUE DES PARANCHES,
410428676,00010,41042867600010,O,1996-12-16,NN,,,2018-09-13T08:08:42,true,3,,,,,RIGOUDAINE,79390,AUBIGNY,,,79019,,,,,,,,,,,,,,,,,,,2008-01-01,A,,,,,01.42Z,NAFRev2,N,,,0,,,,,,
414823799,00013,41482379900013,O,1989-09-29,NN,,,2008-01-04T22:54:36,true,3,,,,,LE BOURG,79390,AUBIGNY,,,79019,,,,,,,,,,,,,,,,,,,2008-01-01,A,,,,,01.50Z,NAFRev2,N,-0.095746,46.730038,0.51,locality,Le Bois du Guy 79390 Aubigny,79019_b006,G,LE BOIS DU GUY,
418582656,00025,41858265600025,O,1999-12-20,NN,,4399CZ,2015-03-17T00:53:08,false,3,,,,,LE BOURG,79390,AUBIGNY,,,79019,,,,,,,,,,,,,,,,,,,2004-08-04,F,,,,,45.2V,NAFRev1,N,-0.095746,46.730038,0.51,locality,Le Bois du Guy 79390 Aubigny,79019_b006,G,LE BOIS DU GUY,
424865061,00024,42486506100024,O,2002-08-27,NN,,,2006-11-25T16:38:44,false,3,,,,,LA COUDRELLE,79390,AUBIGNY,,,79019,,,,,,,,,,,,,,,,,,,2005-03-01,F,,,,,51.1T,NAFRev1,N,-0.128008,46.73508,0.36,street,Rue de la Clé des Champs 79390 Aubigny,79019_0030,G,RUE DE LA CLE DES CHAMPS,
424865061,00032,42486506100032,O,2008-03-28,,,,2015-05-21T05:00:27,true,4,LA COUDRELLE,5,,,LA RUETTE,79390,AUBIGNY,,,79019,,,,,,,,,,,,,,,,,,,2015-04-30,F,,,,,46.19B,NAFRev2,N,-0.125786,46.736412,0.93,housenumber,5 La Ruette 79390 Aubigny,79019_axerkv_00005,G,5 LA RUETTE,
429802671,00017,42980267100017,O,2000-03-06,NN,,,,true,1,,,,,LA BOUQUETIERE,79390,AUBIGNY,,,79019,,,,,,,,,,,,,,,,,,,2001-05-31,F,,,,,52.6E,NAF1993,N,-0.121499,46.735862,0.37,street,Rue de la Guiniere 79390 Aubigny,79019_0050,G,RUE DE LA GUINIERE,
431004233,00018,43100423300018,O,1989-01-01,NN,,,,true,3,,,,,RIGOURDAINE,79390,AUBIGNY,,,79019,,,,,,,,,,,,,,,,,,,2001-12-31,F,,,,,67.2Z,NAF1993,N,-0.1312861,46.7387742,0.89,poi.track,Chemin de Rigourdaine Aubigny,https://osm.org/way/550262604,G,,
432089142,00025,43208914200025,O,2007-01-01,,,4399CZ,2015-03-17T01:00:39,true,2,,7,,CHE,DE BOUCHET,79390,AUBIGNY,,,79019,,,,,,,,,,,,,,,,,,,2008-01-01,A,,,,,43.99C,NAFRev2,N,-0.120117,46.742649,0.48,housenumber,7 Chemin du Bauchet 79390 Aubigny,79019_i45pkk_00007,G,7 CHEMIN DU BAUCHET,
444653257,00014,44465325700014,O,2003-01-06,NN,,4399CZ,2017-12-07T03:21:07,true,4,,,,,LA COUDRELLE,79390,AUBIGNY,,,79019,,,,,,,,,,,,,,,,,,,2017-11-30,F,,,,,81.30Z,NAFRev2,N,-0.128008,46.73508,0.36,street,Rue de la Clé des Champs 79390 Aubigny,79019_0030,G,RUE DE LA CLE DES CHAMPS,
449306018,00044,44930601800044,O,2018-03-06,,,,2018-03-09T12:06:43,true,1,LA COUDRELLE,1,,RUE,RUE DU PARADIS,79390,AUBIGNY,,,79019,,,,,,,,,,,,,,,,,,,2018-03-06,A,,,,,45.20A,NAFRev2,N,-0.126327,46.735811,0.89,housenumber,1 Rue du Paradis 79390 Aubigny,79019_0065_00001,G,1 RUE DU PARADIS,
452347289,00012,45234728900012,O,2004-03-01,NN,,,2006-11-25T19:03:26,true,2,LA COUDRELLE,4,,RUE,DU FIEF DES FONDERIES,79390,AUBIGNY,,,79019,,,,,,,,,,,,,,,,,,,2004-12-25,F,,,,,74.8K,NAFRev1,N,-0.127097,46.737803,0.93,housenumber,4 Rue du Fief des Fonderies 79390 Aubigny,79019_0038_00004,G,4 RUE DU FIEF DES FONDERIES,
478362700,00013,47836270000013,O,2004-07-07,NN,,7420ZR,2015-03-17T01:20:08,true,4,,,,LD,LE PETIT BOIS,79390,AUBIGNY,,,79019,,,,,,,,,,,,,,,,,,,2008-01-01,F,,,,,74.20Z,NAFRev2,N,-0.09743,46.72943,0.46,locality,Le Grand Bois 79390 Aubigny,79019_b034,G,LE GRAND BOIS,
483119681,00011,48311968100011,O,1972-01-01,NN,,,2011-11-22T15:47:35,true,4,,,,,LA COUDRELLE,79390,AUBIGNY,,,79019,,,,,,,,,,,,,,,,,,,2011-11-04,F,,,,,01.11Z,NAFRev2,N,-0.128008,46.73508,0.36,street,Rue de la Clé des Champs 79390 Aubigny,79019_0030,G,RUE DE LA CLE DES CHAMPS,
500513346,00014,50051334600014,O,2007-10-09,,,,2020-04-02T03:37:04,false,3,LE GRAND BOIS,,,,,79390,AUBIGNY,,,79019,,,,,,,,,,,,,,,,,,,2020-02-08,F,,,,,68.20B,NAFRev2,N,-0.09743,46.72943,0.93,locality,Le Grand Bois 79390 Aubigny,79019_b034,D,LE GRAND BOIS,
511045221,00013,51104522100013,O,2009-03-16,,,,2020-02-25T10:12:45,false,2,LE PETIT BOIS,3,,RUE,DE BRANGEARD,79390,AUBIGNY,,,79019,,,,,,,,,,,,,,,,,,,2019-07-13,F,,,,,81.30Z,NAFRev2,N,-0.100449,46.732171,0.79,housenumber,3 Rue du Brangeard 79390 Aubigny,79019_0023_00003,G,3 RUE DU BRANGEARD,
511045221,00021,51104522100021,O,2019-07-13,,,,2020-02-25T10:12:45,true,1,LE PETIT BOIS,2,,RUE,DE BRANGEARD,79390,AUBIGNY,,,79019,,,,,,,,,,,,,,,,,,,2019-07-13,A,,,,,81.30Z,NAFRev2,N,-0.100904,46.731643,0.79,housenumber,2 Rue du Brangeard 79390 Aubigny,79019_0023_00002,G,2 RUE DU BRANGEARD,
519479000,00019,51947900000019,O,2010-01-01,,,2561ZB,2015-10-23T03:28:30,true,1,,7,,RUE,ANDRE GANNE,79390,AUBIGNY,,,79019,,,,,,,,,,,,,,,,,,,2010-01-01,A,,,,,47.89Z,NAFRev2,N,-0.119372,46.741247,0.93,housenumber,7 Rue André Ganne 79390 Aubigny,79019_0010_00007,G,7 RUE ANDRE GANNE,
521210450,00016,52121045000016,O,2010-04-01,,,4520AB,2014-06-27T01:07:50,true,1,,5,,,LE PETIT BOIS,79390,AUBIGNY,,,79019,,,,,,,,,,,,,,,,,,,2010-04-01,A,,,,,45.20A,NAFRev2,N,-0.09743,46.72943,0.41,locality,Le Grand Bois 79390 Aubigny,79019_b034,G,LE GRAND BOIS,
527635650,00015,52763565000015,O,2010-11-01,,,9511ZZ,2016-04-03T03:32:10,true,2,LA BOUQUETIERE,11,,RUE,DES PARANCHES,79390,AUBIGNY,,,79019,,,,,,,,,,,,,,,,,,,2013-12-31,F,,,,,62.09Z,NAFRev2,N,-0.078545,46.728685,0.93,housenumber,11 Rue des Paranches 79390 Aubigny,79019_0068_00011,G,11 RUE DES PARANCHES,
775715592,01130,77571559201130,O,2015-12-10,,,,2016-03-22T14:17:34,false,1,,,,,GRANDE PLAINE D'AUBIGNY,79390,AUBIGNY,,,79019,,,,,,,,,,,,,,,,,,,2015-12-10,A,,,,,46.21Z,NAFRev2,N,-0.09743,46.72943,0.47,locality,Le Grand Bois 79390 Aubigny,79019_b034,G,LE GRAND BOIS,
781405642,00013,78140564200013,O,,NN,,,,true,1,,,,,,79390,AUBIGNY,,,79019,,,,,,,,,,,,,,,,,,,,F,,,,,55.60,NAP,N,,,0,,,,,,
781405683,00017,78140568300017,O,,NN,,,,true,1,,,,,,79390,AUBIGNY,,,79019,,,,,,,,,,,,,,,,,,,,F,,,,,67.04,NAP,N,,,0,,,,,,
781405709,00010,78140570900010,O,,NN,,,,true,1,,,,,,79390,AUBIGNY,,,79019,,,,,,,,,,,,,,,,,,,,F,,,,,81.21,NAP,N,,,0,,,,,,
781441449,00266,78144144900266,O,1990-11-21,NN,,,2006-11-25T22:13:32,false,3,,,,,,79390,AUBIGNY,,,79019,,,,,,,,,,,,,,,,,,,2003-12-11,F,,,,,51.2A,NAFRev1,N,,,0,,,,,,
804417103,00012,80441710300012,O,1973-10-18,,,,2014-09-08T14:46:36,true,1,MAIRE,,,,,79390,AUBIGNY,,,79019,,,,,,,,,,,,,,,,,,,1973-10-18,A,,,,,93.19Z,NAFRev2,N,-0.124812,46.746253,0.74,street,Route de Lamairé 79390 Aubigny,79019_0055,D,ROUTE DE LAMAIRE,
820199016,00016,82019901600016,O,2016-05-09,,,,2019-10-15T19:33:56,true,1,,5,,PL,DU PARC,79390,AUBIGNY,,,79019,,,,,,,,,,,,,,,,,,,2016-05-09,A,,,,MAPIE ANIMATION - LES BALLONS REVEURS,47.89Z,NAFRev2,N,-0.116278,46.739657,0.79,housenumber,5 Place du Parc 79390 Aubigny,79019_0072_00005,G,5 PLACE DU PARC,
820791572,00010,82079157200010,O,2016-06-06,,,,2017-02-14T03:31:36,true,2,LA COUDRELLE,2,,RUE,DU PUITS,79390,AUBIGNY,,,79019,,,,,,,,,,,,,,,,,,,2017-02-08,F,,,,,01.49Z,NAFRev2,N,-0.12732,46.735151,0.93,housenumber,2 Rue du Puits 79390 Aubigny,79019_0078_00002,G,2 RUE DU PUITS,
829954965,00010,82995496500010,O,2016-04-19,,,,2017-05-31T11:15:29,true,1,,5,,CHE,DES PLANTES,79390,AUBIGNY,,,79019,,,,,,,,,,,,,,,,,,,2016-04-19,A,,,,,47.99A,NAFRev2,N,-0.117322,46.740343,0.82,housenumber,5 Chemin des Plantes 79390 Aubigny,79019_0075_00005,G,5 CHEMIN DES PLANTES,
842644270,00014,84264427000014,O,2018-10-08,,,1419ZE,2018-09-27T10:47:36,true,1,LA COUDRELLE,11,,RUE,GERMAIN RALLON,79390,AUBIGNY,,,79019,,,,,,,,,,,,,,,,,,,2018-10-08,A,,,,MANAELLE COUTURE,14.19Z,NAFRev2,N,-0.125436,46.737666,0.93,housenumber,11 Rue Germain Rallon 79390 Aubigny,79019_0048_00011,G,11 RUE GERMAIN RALLON,
883466039,00012,88346603900012,O,2020-05-18,,,,2020-06-23T04:08:27,true,2,RIGOURDAINE,1,,CHE,DU BOURNEU,79390,AUBIGNY,,,79019,,,,,,,,,,,,,,,,,,,2020-06-19,F,,,,,01.49Z,NAFRev2,N,-0.128464,46.7378,0.82,housenumber,1 Cheminement du Bourneu 79390 Aubigny,79019_0020_00001,G,1 CHEMINEMENT DU BOURNEU,
