siren,nic,siret,statutDiffusionEtablissement,dateCreationEtablissement,trancheEffectifsEtablissement,anneeEffectifsEtablissement,activitePrincipaleRegistreMetiersEtablissement,dateDernierTraitementEtablissement,etablissementSiege,nombrePeriodesEtablissement,complementAdresseEtablissement,numeroVoieEtablissement,indiceRepetitionEtablissement,typeVoieEtablissement,libelleVoieEtablissement,codePostalEtablissement,libelleCommuneEtablissement,libelleCommuneEtrangerEtablissement,distributionSpecialeEtablissement,codeCommuneEtablissement,codeCedexEtablissement,libelleCedexEtablissement,codePaysEtrangerEtablissement,libellePaysEtrangerEtablissement,complementAdresse2Etablissement,numeroVoie2Etablissement,indiceRepetition2Etablissement,typeVoie2Etablissement,libelleVoie2Etablissement,codePostal2Etablissement,libelleCommune2Etablissement,libelleCommuneEtranger2Etablissement,distributionSpeciale2Etablissement,codeCommune2Etablissement,codeCedex2Etablissement,libelleCedex2Etablissement,codePaysEtranger2Etablissement,libellePaysEtranger2Etablissement,dateDebut,etatAdministratifEtablissement,enseigne1Etablissement,enseigne2Etablissement,enseigne3Etablissement,denominationUsuelleEtablissement,activitePrincipaleEtablissement,nomenclatureActivitePrincipaleEtablissement,caractereEmployeurEtablissement,longitude,latitude,geo_score,geo_type,geo_adresse,geo_id,geo_ligne,geo_l4,geo_l5
218903276,00010,21890327600010,O,1983-03-01,01,2018,,2020-08-25T10:19:36,true,4,,,,,,89500,ROUSSON,,,89327,,,,,,,,,,,,,,,,,,,2008-01-01,A,MAIRIE,,,,84.11Z,NAFRev2,O,,,0,,,,,,
218903276,00028,21890327600028,O,1983-12-21,NN,,,,false,4,,,,RUE,DE LA MAISON D ECOLE,89500,ROUSSON,,,89327,,,,,,,,,,,,,,,,,,,1996-12-25,F,ECOLE PRIMAIRE PUBLIQUE,,,,80.1Z,NAF1993,N,3.261067,48.094791,0.87,street,Rue de la Maison de l'Ecole 89500 Rousson,89327_0180,G,RUE DE LA MAISON DE L ECOLE,
218903276,00036,21890327600036,O,1993-09-27,01,2018,,2020-08-25T10:19:36,false,3,,,,RUE,DU MOULIN,89500,ROUSSON,,,89327,,,,,,,,,,,,,,,,,,,2008-01-01,A,ECOLE MATERNELLE PUBLIQUE,,,,85.10Z,NAFRev2,N,3.263588,48.096293,0.93,street,Rue du Moulin 89500 Rousson,89327_0190,G,RUE DU MOULIN,
218903276,00044,21890327600044,O,1997-01-01,NN,,,2008-01-04T18:45:11,false,3,MAIRIE,,,,,89500,ROUSSON,,,89327,,,,,,,,,,,,,,,,,,,2008-01-01,A,SERVICE DES EAUX,,,,36.00Z,NAFRev2,N,3.261067,48.094791,0.37,street,Rue de la Maison de l'Ecole 89500 Rousson,89327_0180,D,RUE DE LA MAISON DE L ECOLE,
268903283,00011,26890328300011,O,1983-03-01,NN,,,2016-07-23T12:07:57,true,4,,,,,MAIRIE,89500,ROUSSON,,,89327,,,,,,,,,,,,,,,,,,,2016-01-01,F,CCAS,,,,88.99B,NAFRev2,N,3.261067,48.094791,0.37,street,Rue de la Maison de l'Ecole 89500 Rousson,89327_0180,G,RUE DE LA MAISON DE L ECOLE,
298903279,00016,29890327900016,O,,NN,,,,true,1,,,,,MAIRIE,89500,ROUSSON,,,89327,,,,,,,,,,,,,,,,,,,1997-06-11,F,,,,,70.1C,NAF1993,N,3.261067,48.094791,0.37,street,Rue de la Maison de l'Ecole 89500 Rousson,89327_0180,G,RUE DE LA MAISON DE L ECOLE,
303374466,00066,30337446600066,O,2016-12-01,00,2018,,2020-08-25T10:22:33,true,2,,27,,RUE,DE LA CHATELAINE,89500,ROUSSON,,,89327,,,,,,,,,,,,,,,,,,,2018-08-31,A,,,,,46.21Z,NAFRev2,N,3.273404,48.099817,0.93,housenumber,27 Rue de la Châtelaine 89500 Rousson,89327_0035_00027,G,27 RUE DE LA CHATELAINE,
303677702,00027,30367770200027,O,,NN,,,,true,1,,20,,RUE,DE VILLENEUVE,89500,ROUSSON,,,89327,,,,,,,,,,,,,,,,,,,1992-04-30,F,,,,,45.2V,NAF1993,N,3.264429,48.094693,0.8,housenumber,20 Route de Villeneuve sur Yonne 89500 Rousson,89327_0260_00020,G,20 ROUTE DE VILLENEUVE SUR YONNE,
309551422,00020,30955142200020,O,,NN,,,,true,1,,,,RUE,DE VILLENEUVE SUR YONNE,89500,ROUSSON,,,89327,,,,,,,,,,,,,,,,,,,,F,,,,,67.01,NAP,N,3.270371,48.090628,0.84,street,Route de Villeneuve sur Yonne 89500 Rousson,89327_0260,G,ROUTE DE VILLENEUVE SUR YONNE,
310302369,00015,31030236900015,O,,,,,,true,1,,,,,,89500,ROUSSON,,,89327,,,,,,,,,,,,,,,,,,,1984-12-25,F,,,,,55.60,NAP,N,,,0,,,,,,
315444802,00047,31544480200047,O,1989-02-01,,,,2007-02-06T02:00:26,false,4,,23,,RUE,DE LA CHATELAINE,89500,ROUSSON,,,89327,,,,,,,,,,,,,,,,,,,2006-12-04,F,,,,,01.1C,NAFRev1,N,3.271618,48.09798,0.93,housenumber,23 Rue de la Châtelaine 89500 Rousson,89327_0035_00023,G,23 RUE DE LA CHATELAINE,
316913219,00044,31691321900044,O,1990-01-09,NN,,,2006-12-15T00:19:08,false,4,,9,,RUE,DU MOULIN,89500,ROUSSON,,,89327,,,,,,,,,,,,,,,,,,,1992-03-16,F,,,,,52.4Z,NAF1993,N,3.261663,48.095453,0.93,housenumber,9 Rue du Moulin 89500 Rousson,89327_0190_00009,G,9 RUE DU MOULIN,
316913219,00051,31691321900051,O,1994-07-01,NN,,,2008-11-07T00:32:28,true,4,,9,,RUE,DU MOULIN,89500,ROUSSON,,,89327,,,,,,,,,,,,,,,,,,,1996-03-31,F,,,,,20.5A,NAF1993,N,3.261663,48.095453,0.93,housenumber,9 Rue du Moulin 89500 Rousson,89327_0190_00009,G,9 RUE DU MOULIN,
316932748,00015,31693274800015,O,,NN,,,,true,1,,,,,LES CAVES,89500,ROUSSON,,,89327,,,,,,,,,,,,,,,,,,,,F,,,,,55.40,NAP,N,3.249719,48.085821,0.93,street,Les Caves 89500 Rousson,89327_5ba91h,G,LES CAVES,
317237402,00019,31723740200019,O,,NN,,,,true,1,,,,RUE,LA CROIX BRESSINE,89500,ROUSSON,,,89327,,,,,,,,,,,,,,,,,,,,F,,,,,64.11,NAP,N,3.260355,48.094701,0.77,street,Rue de la Croix Broisine 89500 Rousson,89327_0040,G,RUE DE LA CROIX BROISINE,
320087661,00015,32008766100015,O,,,,,,true,1,,,,PL,DE LA MAIRIE,89500,ROUSSON,,,89327,,,,,,,,,,,,,,,,,,,1985-12-25,F,,,,,55.60,NAP,N,3.261067,48.094791,0.53,street,Rue de la Maison de l'Ecole 89500 Rousson,89327_0180,G,RUE DE LA MAISON DE L ECOLE,
324413251,00012,32441325100012,O,,NN,,,,true,1,,,,RUE,DE VILLENEUVE SUR YONNE,89500,ROUSSON,,,89327,,,,,,,,,,,,,,,,,,,1986-05-14,F,,,,,55.60,NAP,N,3.270371,48.090628,0.84,street,Route de Villeneuve sur Yonne 89500 Rousson,89327_0260,G,ROUTE DE VILLENEUVE SUR YONNE,
324858547,00015,32485854700015,O,,,,,,true,1,,,,RUE,DE LA CHATELAINE,89500,ROUSSON,,,89327,,,,,,,,,,,,,,,,,,,1984-12-25,F,,,,,55.60,NAP,N,3.264131,48.096225,0.93,street,Rue de la Châtelaine 89500 Rousson,89327_0035,G,RUE DE LA CHATELAINE,
326517687,00017,32651768700017,O,1983-01-31,NN,,,2016-04-26T02:50:08,true,6,,5,,RTE,DE CHAUMOT,89500,ROUSSON,,,89327,,,,,,,,,,,,,,,,,,,2014-08-01,F,,,,,43.22A,NAFRev2,N,3.259432,48.09677,0.83,housenumber,5 Route de Chaumot 89500 Rousson,89327_0037_00005,G,5 ROUTE DE CHAUMOT,
331415778,00017,33141577800017,O,,,,,,true,1,,6,,RUE,DE LA CHATELAINE,89500,ROUSSON,,,89327,,,,,,,,,,,,,,,,,,,1988-12-28,F,,,,,77.05,NAP,N,3.264844,48.096285,0.93,housenumber,6 Rue de la Châtelaine 89500 Rousson,89327_0035_00006,G,6 RUE DE LA CHATELAINE,
332197342,00014,33219734200014,O,,NN,,,,true,1,,6,,RUE,DU MOULIN,89500,ROUSSON,,,89327,,,,,,,,,,,,,,,,,,,1993-03-01,F,,,,,02.0B,NAF1993,N,3.261691,48.095574,0.93,housenumber,6 Rue du Moulin 89500 Rousson,89327_0190_00006,G,6 RUE DU MOULIN,
333534121,00020,33353412100020,O,2014-06-30,,,,2018-04-27T03:48:15,true,1,LES QUATRE VENTS,,,,,89500,ROUSSON,,,89327,,,,,,,,,,,,,,,,,,,2014-06-30,A,,,,,01.11Z,NAFRev2,N,,,0,,,,,,
334036381,00021,33403638100021,O,,NN,,,,true,1,,34,,RTE,DE VILLENEUVE SUR YONNE,89500,ROUSSON,,,89327,,,,,,,,,,,,,,,,,,,1997-06-30,F,,,,,55.3A,NAF1993,N,3.264167,48.096037,0.88,housenumber,34 Route de Villeneuve sur Yonne 89500 Rousson,89327_0260_00034,G,34 ROUTE DE VILLENEUVE SUR YONNE,
334160736,00099,33416073600099,O,1985-12-17,NN,,,,false,4,,,,,USINE DU PORT BRULE,89500,ROUSSON,,,89327,,,,,,,,,,,,,,,,,,,1994-12-25,F,,,,,24.1J,NAF1993,N,3.285555,48.091094,0.56,street,Le Port Brûlé 89500 Rousson,89327_b036,G,LE PORT BRULE,
339333809,00012,33933380900012,O,1986-11-04,NN,,,2008-11-07T00:58:59,true,4,,5,,PL,DE LA MAIRIE,89500,ROUSSON,,,89327,,,,,,,,,,,,,,,,,,,1996-02-14,F,,,,,45.2V,NAF1993,N,3.260821,48.095024,0.53,housenumber,5 Rue de la Maison de l'Ecole 89500 Rousson,89327_0180_00005,G,5 RUE DE LA MAISON DE L ECOLE,
341700441,00015,34170044100015,O,,NN,,,,true,1,,1,,RUE,DE VILLENEUVE,89500,ROUSSON,,,89327,,,,,,,,,,,,,,,,,,,1987-12-16,F,,,,,64.24,NAP,N,3.270371,48.090628,0.79,housenumber,1 Route de Villeneuve sur Yonne 89500 Rousson,89327_0260_00001,G,1 ROUTE DE VILLENEUVE SUR YONNE,
344201306,00018,34420130600018,O,1988-03-15,NN,,,,false,4,,23,,RUE,DE VILLENEUVE,89500,ROUSSON,,,89327,,,,,,,,,,,,,,,,,,,2000-07-18,F,,,,,70.2A,NAF1993,N,3.264272,48.095018,0.8,housenumber,23 Route de Villeneuve sur Yonne 89500 Rousson,89327_0260_00023,G,23 ROUTE DE VILLENEUVE SUR YONNE,
344412549,00018,34441254900018,O,,NN,,,,true,1,,,,RTE,DE VILLENEUVE,89500,ROUSSON,,,89327,,,,,,,,,,,,,,,,,,,1990-06-30,F,,,,,64.23,NAP,N,3.270371,48.090628,0.82,street,Route de Villeneuve sur Yonne 89500 Rousson,89327_0260,G,ROUTE DE VILLENEUVE SUR YONNE,
348756685,00023,34875668500023,O,1991-01-10,NN,,,2011-04-28T00:39:11,false,4,,3,,RUE,CROIX BROISINE,89500,ROUSSON,,,89327,,,,,,,,,,,,,,,,,,,1999-11-30,F,,,,,51.1R,NAF1993,N,3.260349,48.094688,0.88,housenumber,3 Rue de la Croix Broisine 89500 Rousson,89327_0040_00003,G,3 RUE DE LA CROIX BROISINE,
351685433,00028,35168543300028,O,2016-03-10,,,,2016-08-23T15:24:28,true,1,LES QUATRE VENTS,,,,CHEZ VINCENT JOUAN,89500,ROUSSON,,,89327,,,,,,,,,,,,,,,,,,,2016-03-10,A,,,,,01.61Z,NAFRev2,N,,,0,,,,,,
352479877,00016,35247987700016,O,1989-11-13,NN,,,2006-04-12T07:04:37,true,4,,23,,RUE,DE VILLENEUVE,89500,ROUSSON,,,89327,,,,,,,,,,,,,,,,,,,1999-07-28,F,,,,,74.1J,NAF1993,N,3.264272,48.095018,0.8,housenumber,23 Route de Villeneuve sur Yonne 89500 Rousson,89327_0260_00023,G,23 ROUTE DE VILLENEUVE SUR YONNE,
353674161,00016,35367416100016,O,1990-02-21,NN,,,2008-01-28T12:00:50,false,4,,,,,LA LONGUE RAIE,89500,ROUSSON,,,89327,,,,,,,,,,,,,,,,,,,2008-01-01,F,,,,,68.20A,NAFRev2,N,3.282423,48.093485,0.93,street,La Longue Raie 89500 Rousson,89327_b027,G,LA LONGUE RAIE,
379130917,00014,37913091700014,O,1990-09-01,NN,,,,true,3,,,,RTE,DE VILLENEUVE,89500,ROUSSON,,,89327,,,,,,,,,,,,,,,,,,,1995-12-25,F,,,,,52.4N,NAF1993,O,3.270371,48.090628,0.82,street,Route de Villeneuve sur Yonne 89500 Rousson,89327_0260,G,ROUTE DE VILLENEUVE SUR YONNE,
379131725,00028,37913172500028,O,1994-01-15,NN,,,2017-05-04T01:57:23,false,5,,,,,LES LANIERES,89500,ROUSSON,,,89327,,,,,,,,,,,,,,,,,,,2015-01-19,F,,,,,35.11Z,NAFRev2,N,3.26529,48.096756,0.47,street,Les Pres de la Chatelaine 89500 Rousson,89327_b039,G,LES PRES DE LA CHATELAINE,
379956121,00014,37995612100014,O,1990-01-02,NN,,,2006-11-25T11:28:25,true,1,,23,,RUE,DE VILLENEUVE,89500,ROUSSON,,,89327,,,,,,,,,,,,,,,,,,,1999-07-01,F,,,,,74.1J,NAF1993,N,3.264272,48.095018,0.8,housenumber,23 Route de Villeneuve sur Yonne 89500 Rousson,89327_0260_00023,G,23 ROUTE DE VILLENEUVE SUR YONNE,
380775825,00017,38077582500017,O,1991-01-20,NN,,,2009-08-05T12:56:14,false,4,,25,,RUE,DE LA CHATELAINE,89500,ROUSSON,,,89327,,,,,,,,,,,,,,,,,,,2001-01-11,F,,,,,01.1C,NAF1993,N,3.271796,48.098052,0.93,housenumber,25 Rue de la Châtelaine 89500 Rousson,89327_0035_00025,G,25 RUE DE LA CHATELAINE,
380775825,00025,38077582500025,O,2001-01-11,01,2018,,2020-08-25T10:17:47,true,4,,27,,RUE,DE LA CHATELAINE,89500,ROUSSON,,,89327,,,,,,,,,,,,,,,,,,,2008-01-01,A,,,,,01.13Z,NAFRev2,O,3.273404,48.099817,0.93,housenumber,27 Rue de la Châtelaine 89500 Rousson,89327_0035_00027,G,27 RUE DE LA CHATELAINE,
381122027,00018,38112202700018,O,,NN,,,,true,1,,25,,RUE,DE LA CHATELAINE,89500,ROUSSON,,,89327,,,,,,,,,,,,,,,,,,,1997-09-25,F,,,,,60.2M,NAF1993,O,3.271796,48.098052,0.93,housenumber,25 Rue de la Châtelaine 89500 Rousson,89327_0035_00025,G,25 RUE DE LA CHATELAINE,
382510741,00012,38251074100012,O,1991-07-01,NN,,,,true,3,,26,,RTE,DE VILLENEUVE,89500,ROUSSON,,,89327,,,,,,,,,,,,,,,,,,,1993-12-25,F,,,,,45.4M,NAF1993,N,3.264503,48.095595,0.84,housenumber,26 Route de Villeneuve sur Yonne 89500 Rousson,89327_0260_00026,G,26 ROUTE DE VILLENEUVE SUR YONNE,
391049871,00018,39104987100018,O,1975-01-01,NN,,,,true,1,,18,,RUE,DES GARNISSONS,89500,ROUSSON,,,89327,,,,,,,,,,,,,,,,,,,2002-12-31,F,,,,,01.1A,NAF1993,N,3.263034,48.09363,0.88,housenumber,18 Rue des Garnisons 89500 Rousson,89327_0090_00018,G,18 RUE DES GARNISONS,
392205431,00019,39220543100019,O,1993-07-07,NN,,,,false,3,,7,,RUE,DU MOULIN,89500,ROUSSON,,,89327,,,,,,,,,,,,,,,,,,,1994-01-05,F,,,,,85.1G,NAF1993,N,3.261996,48.095203,0.93,housenumber,7 Rue du Moulin 89500 Rousson,89327_0190_00007,G,7 RUE DU MOULIN,
392482568,00012,39248256800012,O,,NN,,,,true,1,,2,,RUE,DE LA MAISON DE L'ECOLE,89500,ROUSSON,,,89327,,,,,,,,,,,,,,,,,,,1994-12-31,F,,,,,52.6E,NAF1993,N,3.261246,48.094655,0.93,housenumber,2 Rue de la Maison de l'Ecole 89500 Rousson,89327_0180_00002,G,2 RUE DE LA MAISON DE L ECOLE,
392726287,00015,39272628700015,O,1980-01-01,NN,,,2008-01-05T00:08:15,true,3,,13,,RUE,DES GARNISONS,89500,ROUSSON,,,89327,,,,,,,,,,,,,,,,,,,2008-01-01,A,,,,,68.20B,NAFRev2,N,3.261985,48.094062,0.93,housenumber,13 Rue des Garnisons 89500 Rousson,89327_0090_00013,G,13 RUE DES GARNISONS,
392982146,00012,39298214600012,O,1993-11-01,NN,,,,false,4,,25,,RUE,DE LA CHATELAINE,89500,ROUSSON,,,89327,,,,,,,,,,,,,,,,,,,2001-07-10,F,,,,,51.6N,NAF1993,O,3.271796,48.098052,0.93,housenumber,25 Rue de la Châtelaine 89500 Rousson,89327_0035_00025,G,25 RUE DE LA CHATELAINE,
393496682,00013,39349668200013,O,1994-01-01,01,2018,4322AZ,2020-08-25T10:28:14,true,5,,19,,RUE,DE LA CROIX BROISINE,89500,ROUSSON,,,89327,,,,,,,,,,,,,,,,,,,2019-12-31,F,,,,,43.22A,NAFRev2,O,3.260275,48.095274,0.93,housenumber,19 Rue de la Croix Broisine 89500 Rousson,89327_0040_00019,G,19 RUE DE LA CROIX BROISINE,
394665533,00011,39466553300011,O,1994-04-05,NN,,,2014-07-08T01:23:52,true,5,,3,,RUE,DE LA PLAINE,89500,ROUSSON,,,89327,,,,,,,,,,,,,,,,,,,2012-12-31,F,,,,,43.99C,NAFRev2,O,3.264554,48.095291,0.93,housenumber,3 Rue de la Plaine 89500 Rousson,89327_0235_00003,G,3 RUE DE LA PLAINE,
394865166,00034,39486516600034,O,2010-06-02,NN,,,2020-02-26T03:37:16,true,3,8 BIS CHEMIN DES BOULINS,,,,LA HAUTE EPINE,89500,ROUSSON,,,89327,,,,,,,,,,,,,,,,,,,2019-06-30,F,,,,,02.40Z,NAFRev2,N,3.252524,48.079415,0.93,street,La Haute Epine 89500 Rousson,89327_b057,G,LA HAUTE EPINE,
399296086,00016,39929608600016,O,1994-12-21,NN,,,,false,4,,2,,RUE,DU MOULIN,89500,ROUSSON,,,89327,,,,,,,,,,,,,,,,,,,1998-06-11,F,,,,,92.3A,NAF1993,N,3.263211,48.096221,0.93,housenumber,2 Rue du Moulin 89500 Rousson,89327_0190_00002,G,2 RUE DU MOULIN,
402140842,00012,40214084200012,O,1995-09-07,NN,,,2008-01-04T19:58:59,true,3,,,,RTE,DE VILLENEUVE,89500,ROUSSON,,,89327,,,,,,,,,,,,,,,,,,,2008-01-01,A,,,,,68.20A,NAFRev2,N,3.270371,48.090628,0.82,street,Route de Villeneuve sur Yonne 89500 Rousson,89327_0260,G,ROUTE DE VILLENEUVE SUR YONNE,
403350648,00016,40335064800016,O,,NN,,,,true,1,,7,,RUE,ST PIERRE,89500,ROUSSON,,,89327,,,,,,,,,,,,,,,,,,,1996-12-31,F,,,,,01.1D,NAF1993,O,3.265648,48.09779,0.82,housenumber,7 Rue Saint Pierre 89500 Rousson,89327_0250_00007,G,7 RUE SAINT PIERRE,
411710916,00015,41171091600015,O,1997-04-09,,,,2008-11-08T01:25:43,true,3,,,,RUE,DU CHATEAU D'EAU,89500,ROUSSON,,,89327,,,,,,,,,,,,,,,,,,,1997-12-25,F,,,,,20.5A,NAF1993,N,3.259485,48.094544,0.93,street,Rue du Château d'Eau 89500 Rousson,89327_0032,G,RUE DU CHATEAU D EAU,
412118440,00038,41211844000038,O,2011-04-02,,,,2015-12-04T05:24:38,true,1,(T 11),,,,LE PORT BRULE,89500,ROUSSON,,,89327,,,,,,,,,,,,,,,,,,,2011-04-02,A,,,,,45.11Z,NAFRev2,N,3.285555,48.091094,0.93,street,Le Port Brûlé 89500 Rousson,89327_b036,G,LE PORT BRULE,
412728115,00020,41272811500020,O,1998-08-01,,,,2008-11-08T01:27:27,true,3,,,,LD,LE PORT BRULE,89500,ROUSSON,,,89327,,,,,,,,,,,,,,,,,,,1999-04-28,F,,,,,50.3A,NAF1993,N,3.285555,48.091094,0.93,street,Le Port Brûlé 89500 Rousson,89327_b036,G,LE PORT BRULE,
413151119,00018,41315111900018,O,1997-07-15,NN,,,,true,1,,34,,RTE,DE VILLENEUVE SUR YONNE,89500,ROUSSON,,,89327,,,,,,,,,,,,,,,,,,,2001-02-09,F,,,,,55.3A,NAF1993,N,3.264167,48.096037,0.88,housenumber,34 Route de Villeneuve sur Yonne 89500 Rousson,89327_0260_00034,G,34 ROUTE DE VILLENEUVE SUR YONNE,
414866434,00015,41486643400015,O,1998-01-15,NN,,,2020-04-08T11:38:20,true,7,,7,,RUE,SAINT PIERRE,89500,ROUSSON,,,89327,,,,,,,,,,,,,,,,,,,2020-04-06,A,,,,,71.12B,NAFRev2,O,3.265648,48.09779,0.93,housenumber,7 Rue Saint Pierre 89500 Rousson,89327_0250_00007,G,7 RUE SAINT PIERRE,
419071303,00012,41907130300012,O,1998-06-05,,,,2015-01-28T10:16:26,false,3,,2,,RUE,DE LA MAISON D'ECOLE,89500,ROUSSON,,,89327,,,,,,,,,,,,,,,,,,,1998-12-25,F,,,,,52.6E,NAF1993,N,3.261246,48.094655,0.87,housenumber,2 Rue de la Maison de l'Ecole 89500 Rousson,89327_0180_00002,G,2 RUE DE LA MAISON DE L ECOLE,
422446401,00016,42244640100016,O,1999-04-08,NN,,,2008-01-05T00:21:35,true,3,,24,,RTE,DE VILLENEUVE SUR YONNE,89500,ROUSSON,,,89327,,,,,,,,,,,,,,,,,,,2008-01-01,A,,,,,56.10C,NAFRev2,N,3.264571,48.095455,0.88,housenumber,24 Route de Villeneuve sur Yonne 89500 Rousson,89327_0260_00024,G,24 ROUTE DE VILLENEUVE SUR YONNE,
429495203,00011,42949520300011,O,2000-01-20,,,,,true,1,,13,,RUE,DES GARNISONS,89500,ROUSSON,,,89327,,,,,,,,,,,,,,,,,,,2000-03-18,F,,,,,01.1A,NAF1993,N,3.261985,48.094062,0.93,housenumber,13 Rue des Garnisons 89500 Rousson,89327_0090_00013,G,13 RUE DES GARNISONS,
430242727,00013,43024272700013,O,2000-03-18,NN,,,2019-03-06T08:13:10,true,3,,13,,RUE,DES GARNISONS,89500,ROUSSON,,,89327,,,,,,,,,,,,,,,,,,,2008-01-01,A,,,,,01.11Z,NAFRev2,N,3.261985,48.094062,0.93,housenumber,13 Rue des Garnisons 89500 Rousson,89327_0090_00013,G,13 RUE DES GARNISONS,
431965250,00019,43196525000019,O,2000-07-03,,,,,true,1,,17,,RUE,DE LA CROIX BROISINE,89500,ROUSSON,,,89327,,,,,,,,,,,,,,,,,,,2000-07-03,F,,,,,74.6Z,NAF1993,N,3.26045,48.095269,0.93,housenumber,17 Rue de la Croix Broisine 89500 Rousson,89327_0040_00017,G,17 RUE DE LA CROIX BROISINE,
438885873,00010,43888587300010,O,2001-06-22,NN,,,2017-03-30T03:14:43,true,3,M MME JANECZKO,,,RTE,DE CHAUMOT,89500,ROUSSON,,,89327,,,,,,,,,,,,,,,,,,,2008-01-01,A,,,,,68.20B,NAFRev2,N,3.261637,48.097383,0.81,street,Route de Chaumot 89500 Rousson,89327_0037,G,ROUTE DE CHAUMOT,
439226317,00055,43922631700055,O,2015-01-19,,,,2015-02-06T15:14:13,false,1,,,,RUE,DE LA PLAINE,89500,ROUSSON,,,89327,,,,,,,,,,,,,,,,,,,2015-01-19,A,,,,,35.11Z,NAFRev2,N,3.264433,48.095319,0.93,street,Rue de la Plaine 89500 Rousson,89327_0235,G,RUE DE LA PLAINE,
443487244,00016,44348724400016,O,2001-01-01,NN,,,2016-01-12T00:24:17,true,3,,3,,RTE,DE VILLEUVE,89500,ROUSSON,,,89327,,,,,,,,,,,,,,,,,,,2008-01-01,A,,,,,02.20Z,NAFRev2,N,3.270371,48.090628,0.67,street,Route de Villeneuve sur Yonne 89500 Rousson,89327_0260,G,ROUTE DE VILLENEUVE SUR YONNE,
444390991,00016,44439099100016,O,2003-01-01,NN,,,2013-12-03T04:12:02,true,4,,18,,RUE,DES GARNISONS,89500,ROUSSON,,,89327,,,,,,,,,,,,,,,,,,,2013-11-30,F,,,,,01.11Z,NAFRev2,N,3.263034,48.09363,0.93,housenumber,18 Rue des Garnisons 89500 Rousson,89327_0090_00018,G,18 RUE DES GARNISONS,
450535158,00015,45053515800015,O,2003-10-01,NN,,,2010-06-06T18:44:58,true,4,,13,,RTE,DE VILLENEUVE SUR YONNE,89500,ROUSSON,,,89327,,,,,,,,,,,,,,,,,,,2010-03-23,F,,,,,70.10Z,NAFRev2,N,3.264323,48.094324,0.88,housenumber,13 Route de Villeneuve sur Yonne 89500 Rousson,89327_0260_00013,G,13 ROUTE DE VILLENEUVE SUR YONNE,
453602492,00028,45360249200028,O,2011-04-07,,,4329AZ,2020-01-22T11:24:00,false,4,,4,,RUE,DU MOULIN,89500,ROUSSON,,,89327,,,,,,,,,,,,,,,,,,,2013-03-31,F,,,,ISOLEXTER,43.29A,NAFRev2,N,3.262605,48.095848,0.93,housenumber,4 Rue du Moulin 89500 Rousson,89327_0190_00004,G,4 RUE DU MOULIN,
478461825,00018,47846182500018,O,2004-10-01,NN,,,2014-07-08T02:54:22,true,6,,3,,,GRANDE RUE,89500,ROUSSON,,,89327,,,,,,,,,,,,,,,,,,,2012-12-31,F,,,,,43.21A,NAFRev2,N,3.263399,48.095174,0.93,housenumber,3 Grande Rue 89500 Rousson,89327_0100_00003,G,3 GRANDE RUE,
479751596,00012,47975159600012,O,2004-12-02,NN,,,2008-01-05T04:09:04,true,3,CHEZ MR VILDY JOHNNY,16,,RTE,DE VILLENEUVE,89500,ROUSSON,,,89327,,,,,,,,,,,,,,,,,,,2008-01-01,A,,,,,93.12Z,NAFRev2,N,3.264651,48.094301,0.84,housenumber,16 Route de Villeneuve sur Yonne 89500 Rousson,89327_0260_00016,G,16 ROUTE DE VILLENEUVE SUR YONNE,
489298240,00016,48929824000016,O,2001-09-05,,,,2006-11-25T21:06:30,false,2,,16,,RUE,DES GANISONS,89500,ROUSSON,,,89327,,,,,,,,,,,,,,,,,,,2006-09-04,F,,,,,92.6C,NAFRev1,N,3.263269,48.093508,0.85,housenumber,16 Rue des Garnisons 89500 Rousson,89327_0090_00016,G,16 RUE DES GARNISONS,
489800433,00018,48980043300018,O,2006-04-21,,,,2014-07-10T00:29:26,false,3,,8,,RUE,DE LA CROIX BROISINE,89500,ROUSSON,,,89327,,,,,,,,,,,,,,,,,,,2014-01-01,F,,,,,81.30Z,NAFRev2,N,3.260751,48.095336,0.93,housenumber,8 Rue de la Croix Broisine 89500 Rousson,89327_0040_00008,G,8 RUE DE LA CROIX BROISINE,
489982702,00016,48998270200016,O,1995-08-11,,,,2008-01-05T03:19:07,true,2,MAIRIE,,,RUE,DE LA MAISON DE L ECOLE,89500,ROUSSON,,,89327,,,,,,,,,,,,,,,,,,,2008-01-01,A,,,,,94.99Z,NAFRev2,N,3.261067,48.094791,0.93,street,Rue de la Maison de l'Ecole 89500 Rousson,89327_0180,G,RUE DE LA MAISON DE L ECOLE,
491994646,00017,49199464600017,O,2006-09-18,,,4520AA,2015-03-18T01:23:18,true,3,,18,B,,GRANDE RUE,89500,ROUSSON,,,89327,,,,,,,,,,,,,,,,,,,2008-01-29,A,,,,,45.20A,NAFRev2,O,3.2608,48.094836,0.75,housenumber,18 bis Grande Rue 89500 Rousson,89327_0100_00018_bis,G,18 BIS GRANDE RUE,
500087739,00016,50008773900016,O,2007-09-14,,,9511ZZ,2018-03-06T09:10:46,true,3,RUE DE BUSSY LE REPOS,4,,CHE,DE FRIERES,89500,ROUSSON,,,89327,,,,,,,,,,,,,,,,,,,2016-12-31,A,,,,,47.41Z,NAFRev2,N,3.258012,48.092895,0.72,housenumber,4 Chemin des Frieres 89500 Rousson,89327_0080_00004,G,4 CHEMIN DES FRIERES,
501055024,00019,50105502400019,O,2007-11-26,00,2018,,2020-08-25T10:12:14,true,3,,10,,RUE,DES GARNISONS,89500,ROUSSON,,,89327,,,,,,,,,,,,,,,,,,,2012-12-31,A,,,,,81.30Z,NAFRev2,O,3.263898,48.093111,0.93,housenumber,10 Rue des Garnisons 89500 Rousson,89327_0090_00010,G,10 RUE DES GARNISONS,
505750125,00013,50575012500013,O,,NN,,,,true,1,,,,,,89500,ROUSSON,,,89327,,,,,,,,,,,,,,,,,,,1991-06-30,F,,,,,57.01,NAP,N,,,0,,,,,,
506041417,00011,50604141700011,O,,,,,,true,1,,,,,,89500,ROUSSON,,,89327,,,,,,,,,,,,,,,,,,,1985-12-25,F,,,,,62.42,NAP,N,,,0,,,,,,
506440379,00010,50644037900010,O,,,,,,true,1,,,,,,89500,ROUSSON,,,89327,,,,,,,,,,,,,,,,,,,1980-07-01,F,,,,,54.08,NAP,N,,,0,,,,,,
506642057,00018,50664205700018,O,,,,,,true,1,,7,,RUE,ST PIERRE,89500,ROUSSON,,,89327,,,,,,,,,,,,,,,,,,,1994-08-02,F,,,,,01.1D,NAF1993,N,3.265648,48.09779,0.82,housenumber,7 Rue Saint Pierre 89500 Rousson,89327_0250_00007,G,7 RUE SAINT PIERRE,
506841584,00010,50684158400010,O,,NN,,,,true,1,,,,,,89500,ROUSSON,,,89327,,,,,,,,,,,,,,,,,,,,F,,,,,55.60,NAP,N,,,0,,,,,,
507041721,00014,50704172100014,O,,,,,,true,1,,16,,RUE,DE LA CROIX BROISINE,89500,ROUSSON,,,89327,,,,,,,,,,,,,,,,,,,1995-06-30,F,,,,,45.2V,NAF1993,N,3.259704,48.096346,0.93,housenumber,16 Rue de la Croix Broisine 89500 Rousson,89327_0040_00016,G,16 RUE DE LA CROIX BROISINE,
507242048,00019,50724204800019,O,,NN,,,,true,1,,,,,,89500,ROUSSON,,,89327,,,,,,,,,,,,,,,,,,,1992-07-12,F,,,,,70.02,NAP,N,,,0,,,,,,
507673010,00025,50767301000025,O,2010-07-30,,,,2012-10-26T04:43:42,true,2,,23,,RUE,DE LA CHATELAINE,89500,ROUSSON,,,89327,,,,,,,,,,,,,,,,,,,2012-10-22,F,,,,,68.20B,NAFRev2,N,3.271618,48.09798,0.93,housenumber,23 Rue de la Châtelaine 89500 Rousson,89327_0035_00023,G,23 RUE DE LA CHATELAINE,
509265245,00019,50926524500019,O,2008-10-02,,,,2008-12-03T08:47:31,true,1,,23,,RTE,DE VILLENEUVE SUR YONNE,89500,ROUSSON,,,89327,,,,,,,,,,,,,,,,,,,2008-10-02,A,,,,,68.20B,NAFRev2,N,3.264272,48.095018,0.88,housenumber,23 Route de Villeneuve sur Yonne 89500 Rousson,89327_0260_00023,G,23 ROUTE DE VILLENEUVE SUR YONNE,
514717859,00011,51471785900011,O,2009-10-01,,,,2012-11-10T01:14:37,true,2,LE PRIEURE,,,,4 RUE DE L'EGLISE,89500,ROUSSON,,,89327,,,,,,,,,,,,,,,,,,,2011-08-31,F,,,,,96.09Z,NAFRev2,N,3.263726,48.097894,0.93,housenumber,4 Rue de l'Eglise 89500 Rousson,89327_0073_00004,G,4 RUE DE L EGLISE,
518466578,00011,51846657800011,O,2009-08-12,00,2018,,2020-08-25T10:32:21,true,2,,10,,RUE,DES GARNISONS,89500,ROUSSON,,,89327,,,,,,,,,,,,,,,,,,,2012-12-31,A,,,,,81.30Z,NAFRev2,O,3.263898,48.093111,0.93,housenumber,10 Rue des Garnisons 89500 Rousson,89327_0090_00010,G,10 RUE DES GARNISONS,