siren,nic,siret,statutDiffusionEtablissement,dateCreationEtablissement,trancheEffectifsEtablissement,anneeEffectifsEtablissement,activitePrincipaleRegistreMetiersEtablissement,dateDernierTraitementEtablissement,etablissementSiege,nombrePeriodesEtablissement,complementAdresseEtablissement,numeroVoieEtablissement,indiceRepetitionEtablissement,typeVoieEtablissement,libelleVoieEtablissement,codePostalEtablissement,libelleCommuneEtablissement,libelleCommuneEtrangerEtablissement,distributionSpecialeEtablissement,codeCommuneEtablissement,codeCedexEtablissement,libelleCedexEtablissement,codePaysEtrangerEtablissement,libellePaysEtrangerEtablissement,complementAdresse2Etablissement,numeroVoie2Etablissement,indiceRepetition2Etablissement,typeVoie2Etablissement,libelleVoie2Etablissement,codePostal2Etablissement,libelleCommune2Etablissement,libelleCommuneEtranger2Etablissement,distributionSpeciale2Etablissement,codeCommune2Etablissement,codeCedex2Etablissement,libelleCedex2Etablissement,codePaysEtranger2Etablissement,libellePaysEtranger2Etablissement,dateDebut,etatAdministratifEtablissement,enseigne1Etablissement,enseigne2Etablissement,enseigne3Etablissement,denominationUsuelleEtablissement,activitePrincipaleEtablissement,nomenclatureActivitePrincipaleEtablissement,caractereEmployeurEtablissement,longitude,latitude,geo_score,geo_type,geo_adresse,geo_id,geo_ligne,geo_l4,geo_l5
278902069,00014,27890206900014,O,,,,,2019-01-14T16:34:56,true,1,,,,,,89420,SCEAUX,,,89381,,,,,,,,,,,,,,,,,,,1995-12-25,F,,,,,41.0Z,NAF1993,N,,,0,,,,,,
307020768,00049,30702076800049,O,,NN,,,2019-01-14T16:34:56,true,1,,,,,AUTOROUTE A6,89420,SCEAUX,,,89381,,,,,,,,,,,,,,,,,,,2001-01-09,F,,,,,50.5Z,NAF1993,O,4.8276451,47.055701,0.88,poi.memorial,Plaque de l'inauguration de l'autoroute A6 (Mémorial) Savigny-lès-Beaune,https://osm.org/node/4165671285,G,,
312240278,00027,31224027800027,O,1998-01-27,,,,2019-01-14T16:34:56,true,1,,3,,RUE,DE BRECY,89420,SCEAUX,,,89381,,,,,,,,,,,,,,,,,,,1998-01-30,F,,,,,50.5Z,NAF1993,N,4.032128,47.507565,0.93,housenumber,3 Rue de Brecy 89420 Guillon-Terre-Plaine,89381_0027_00003,G,3 RUE DE BRECY,
315664508,00019,31566450800019,O,,NN,,,2019-01-14T16:34:56,true,1,,,,,,89420,SCEAUX,,,89381,,,,,,,,,,,,,,,,,,,1990-09-30,F,,,,,55.60,NAP,N,,,0,,,,,,
385260500,00017,38526050000017,O,,NN,,,2019-01-14T16:34:56,true,1,,,,,MAISON DIEU,89420,SCEAUX,,,89381,,,,,,,,,,,,,,,,,,,1992-06-15,F,,,,,52.7H,NAF1993,N,1.0707467,45.8003767,0.89,poi.track,Chemin de Maison Dieu Saint-Priest-sous-Aixe,https://osm.org/way/245476474,G,,
411687320,00019,41168732000019,O,1997-02-11,,,,2019-01-14T16:34:56,true,1,,40,,RUE,HENRI SANNEJOUAND,89420,SCEAUX,,,89381,,,,,,,,,,,,,,,,,,,1999-06-30,F,,,,,74.1J,NAF1993,N,4.037325,47.50986,0.93,housenumber,40 Rue Henri Sannejouand 89420 Guillon-Terre-Plaine,89381_0083_00040,G,40 RUE HENRI SANNEJOUAND,
426711123,00015,42671112300015,O,,NN,,,2019-01-14T16:34:56,true,1,,,,LD,LE VELLEROT,89420,SCEAUX,,,89381,,,,,,,,,,,,,,,,,,,1993-01-22,F,,,,,92.3F,NAF1993,N,6.60023,47.3510755,0.88,poi.townhall,(Hôtel de ville) Vellerot-lès-Belvoir,https://osm.org/way/209511729,G,,
426711131,00018,42671113100018,O,,NN,,,2019-01-14T16:34:56,true,1,,,,LD,LE VELLEROT,89420,SCEAUX,,,89381,,,,,,,,,,,,,,,,,,,1993-01-21,F,,,,,92.7C,NAF1993,N,6.60023,47.3510755,0.88,poi.townhall,(Hôtel de ville) Vellerot-lès-Belvoir,https://osm.org/way/209511729,G,,
427011945,00016,42701194500016,O,,,,,2019-01-14T16:34:56,true,1,,,,LD,MAISON DIEU,89420,SCEAUX,,,89381,,,,,,,,,,,,,,,,,,,,F,,,,,65.02,NAP,N,1.0707467,45.8003767,0.89,poi.track,Chemin de Maison Dieu Saint-Priest-sous-Aixe,https://osm.org/way/245476474,G,,
778686915,00019,77868691500019,O,,NN,,,2019-01-14T16:34:56,true,1,,,,LD,MAISON DIEU,89420,SCEAUX,,,89381,,,,,,,,,,,,,,,,,,,2000-12-31,F,,,,,01.1A,NAF1993,N,1.0707467,45.8003767,0.89,poi.track,Chemin de Maison Dieu Saint-Priest-sous-Aixe,https://osm.org/way/245476474,G,,
778686931,00016,77868693100016,O,,NN,,,2019-01-14T16:34:56,true,1,,,,,MAISON DIEU,89420,SCEAUX,,,89381,,,,,,,,,,,,,,,,,,,,F,,,,,55.71,NAP,N,1.0707467,45.8003767,0.89,poi.track,Chemin de Maison Dieu Saint-Priest-sous-Aixe,https://osm.org/way/245476474,G,,
778686949,00018,77868694900018,O,,,,,2019-01-14T16:34:56,true,1,,,,LD,LE VELLEROT,89420,SCEAUX,,,89381,,,,,,,,,,,,,,,,,,,1992-12-31,F,,,,,92.3F,NAF1993,N,6.60023,47.3510755,0.88,poi.townhall,(Hôtel de ville) Vellerot-lès-Belvoir,https://osm.org/way/209511729,G,,
