siren,nic,siret,statutDiffusionEtablissement,dateCreationEtablissement,trancheEffectifsEtablissement,anneeEffectifsEtablissement,activitePrincipaleRegistreMetiersEtablissement,dateDernierTraitementEtablissement,etablissementSiege,nombrePeriodesEtablissement,complementAdresseEtablissement,numeroVoieEtablissement,indiceRepetitionEtablissement,typeVoieEtablissement,libelleVoieEtablissement,codePostalEtablissement,libelleCommuneEtablissement,libelleCommuneEtrangerEtablissement,distributionSpecialeEtablissement,codeCommuneEtablissement,codeCedexEtablissement,libelleCedexEtablissement,codePaysEtrangerEtablissement,libellePaysEtrangerEtablissement,complementAdresse2Etablissement,numeroVoie2Etablissement,indiceRepetition2Etablissement,typeVoie2Etablissement,libelleVoie2Etablissement,codePostal2Etablissement,libelleCommune2Etablissement,libelleCommuneEtranger2Etablissement,distributionSpeciale2Etablissement,codeCommune2Etablissement,codeCedex2Etablissement,libelleCedex2Etablissement,codePaysEtranger2Etablissement,libellePaysEtranger2Etablissement,dateDebut,etatAdministratifEtablissement,enseigne1Etablissement,enseigne2Etablissement,enseigne3Etablissement,denominationUsuelleEtablissement,activitePrincipaleEtablissement,nomenclatureActivitePrincipaleEtablissement,caractereEmployeurEtablissement,longitude,latitude,geo_score,geo_type,geo_adresse,geo_id,geo_ligne,geo_l4,geo_l5
210103586,00017,21010358600017,O,1983-03-01,02,2018,,2020-08-25T10:15:26,true,4,HOTEL DE VILLE,,,,,01300,SAINT-GERMAIN-LES-PAROISSES,,,01358,,,,,,,,,,,,,,,,,,,2008-01-01,A,MAIRIE,,,,84.11Z,NAFRev2,O,5.621876,45.770499,0.39,street,Route de Champdoreille 01300 Saint-Germain-les-Paroisses,01358_0014,D,ROUTE DE CHAMPDOREILLE,
210103586,00025,21010358600025,O,1983-12-21,02,2018,,2020-08-25T10:15:26,false,3,,,,,,01300,SAINT-GERMAIN-LES-PAROISSES,,,01358,,,,,,,,,,,,,,,,,,,2008-01-01,A,ECOLE PRIMAIRE PUBLIQUE,,,,85.20Z,NAFRev2,N,,,0,,,,,,
210103586,00033,21010358600033,O,1997-01-01,NN,,,2008-01-04T18:23:27,false,3,MAIRIE,,,,,01300,SAINT-GERMAIN-LES-PAROISSES,,,01358,,,,,,,,,,,,,,,,,,,2008-01-01,A,SERVICE EAU DE ST GERMAIN LES PAROISSES,,,,36.00Z,NAFRev2,N,5.636051,45.765765,0.38,locality,Molard Buirin 01300 Saint-Germain-les-Paroisses,01358_b169,D,MOLARD BUIRIN,
210103586,00041,21010358600041,O,1997-01-01,NN,,,2013-10-05T12:23:35,false,4,MAIRIE,,,,,01300,SAINT-GERMAIN-LES-PAROISSES,,,01358,,,,,,,,,,,,,,,,,,,2012-12-25,F,SCE ASSAINISSEMENT,,,,37.00Z,NAFRev2,N,5.636051,45.765765,0.38,locality,Molard Buirin 01300 Saint-Germain-les-Paroisses,01358_b169,D,MOLARD BUIRIN,
240100917,00014,24010091700014,O,,,,,,true,1,,,,,MAIRIE,01300,SAINT-GERMAIN-LES-PAROISSES,,,01358,,,,,,,,,,,,,,,,,,,2003-01-20,F,,,,,75.1A,NAFRev1,N,5.636051,45.765765,0.38,locality,Molard Buirin 01300 Saint-Germain-les-Paroisses,01358_b169,G,MOLARD BUIRIN,
250102415,00016,25010241500016,O,2003-01-20,02,2018,,2020-08-25T10:20:11,true,5,,,,,MAIRIE,01300,SAINT-GERMAIN-LES-PAROISSES,,,01358,,,,,,,,,,,,,,,,,,,2008-01-01,A,,,,,84.11Z,NAFRev2,O,5.636051,45.765765,0.38,locality,Molard Buirin 01300 Saint-Germain-les-Paroisses,01358_b169,G,MOLARD BUIRIN,
260103197,00018,26010319700018,O,1987-01-01,NN,,,2016-07-23T12:31:03,true,4,MAIRIE,,,,,01300,SAINT-GERMAIN-LES-PAROISSES,,,01358,,,,,,,,,,,,,,,,,,,2016-01-01,F,CCAS,,,,88.99B,NAFRev2,N,5.636051,45.765765,0.38,locality,Molard Buirin 01300 Saint-Germain-les-Paroisses,01358_b169,D,MOLARD BUIRIN,
270100571,00016,27010057100016,O,,,,,,true,1,,,,,,01300,SAINT-GERMAIN-LES-PAROISSES,,,01358,,,,,,,,,,,,,,,,,,,1995-12-25,F,,,,,41.0Z,NAF1993,N,,,0,,,,,,
270100589,00018,27010058900018,O,,,,,,true,1,,,,,,01300,SAINT-GERMAIN-LES-PAROISSES,,,01358,,,,,,,,,,,,,,,,,,,1995-12-25,F,,,,,41.0Z,NAF1993,N,,,0,,,,,,
270101223,00013,27010122300013,O,,NN,,,,true,1,,,,,MAIRIE,01300,SAINT-GERMAIN-LES-PAROISSES,,,01358,,,,,,,,,,,,,,,,,,,1995-12-25,F,,,,,41.0Z,NAF1993,N,5.636051,45.765765,0.38,locality,Molard Buirin 01300 Saint-Germain-les-Paroisses,01358_b169,G,MOLARD BUIRIN,
300502804,00028,30050280400028,O,1900-01-01,NN,,,2008-01-04T19:10:32,true,3,,,,,MARCHAMP,01300,SAINT-GERMAIN-LES-PAROISSES,,,01358,,,,,,,,,,,,,,,,,,,2008-01-01,A,,,,,01.11Z,NAFRev2,N,5.626482,45.767792,0.5,locality,Champ Morey 01300 Saint-Germain-les-Paroisses,01358_b051,G,CHAMP MOREY,
303359707,00013,30335970700013,O,1965-01-01,NN,,,,true,1,,,,,HAMEAU DE BROGNIN,01300,SAINT-GERMAIN-LES-PAROISSES,,,01358,,,,,,,,,,,,,,,,,,,2000-12-31,F,,,,,45.4C,NAF1993,O,,,0,,,,,,
314613019,00020,31461301900020,O,1988-04-20,NN,,,2010-01-15T19:50:26,true,4,,,,,,01300,SAINT-GERMAIN-LES-PAROISSES,,,01358,,,,,,,,,,,,,,,,,,,2008-12-31,F,,,,,47.62Z,NAFRev2,N,,,0,,,,,,
316623735,00016,31662373500016,O,1900-01-01,NN,,,2017-07-16T05:20:11,true,7,,,,,BROGNIN,01300,SAINT-GERMAIN-LES-PAROISSES,,,01358,,,,,,,,,,,,,,,,,,,2016-12-30,F,OKKO,,,,90.03B,NAFRev2,N,5.6327166,45.7717902,0.88,poi.wetland,Marais de Brognin (Zone humide) Saint-Germain-les-Paroisses,https://osm.org/way/115290200,G,,
316972041,00016,31697204100016,O,1979-01-01,NN,,,2019-12-10T19:39:16,true,3,,323,,MTE,DU VIGNOBLE - APPREGNIN,01300,SAINT-GERMAIN-LES-PAROISSES,,,01358,,,,,,,,,,,,,,,,,,,2008-01-01,A,,,,,68.20A,NAFRev2,N,5.606217,45.764938,0.58,housenumber,323 Montée du Vignoble 01300 Saint-Germain-les-Paroisses,01358_0095_00323,G,323 MONTEE DU VIGNOBLE,
321855231,00031,32185523100031,O,,NN,,,,true,1,,,,,APPREGNIN,01300,SAINT-GERMAIN-LES-PAROISSES,,,01358,,,,,,,,,,,,,,,,,,,1993-05-29,F,,,,,52.7D,NAF1993,N,5.608306,45.765339,0.93,street,Appregnin 01300 Saint-Germain-les-Paroisses,01358_5v0b9i,G,APPREGNIN,
322708355,00027,32270835500027,O,,NN,,,,true,1,,,,,APREGNIN,01300,SAINT-GERMAIN-LES-PAROISSES,,,01358,,,,,,,,,,,,,,,,,,,1981-11-25,F,,,,,49.05,NAP,N,5.608306,45.765339,0.83,street,Appregnin 01300 Saint-Germain-les-Paroisses,01358_5v0b9i,G,APPREGNIN,
323024422,00012,32302442200012,O,1981-10-01,,,,,true,4,,,,,,01300,SAINT-GERMAIN-LES-PAROISSES,,,01358,,,,,,,,,,,,,,,,,,,1992-12-25,F,,,,,28.3C,NAF1993,N,,,0,,,,,,
325772887,00015,32577288700015,O,1981-11-10,NN,,,2008-04-05T00:26:08,true,3,,,,,BOISE,01300,SAINT-GERMAIN-LES-PAROISSES,,,01358,,,,,,,,,,,,,,,,,,,2008-01-01,A,,,,,68.20B,NAFRev2,N,5.615198,45.772322,0.91,locality,Boise Ouest 01300 Saint-Germain-les-Paroisses,01358_b025,G,BOISE OUEST,
326893187,00012,32689318700012,O,1983-04-01,NN,,,2008-11-07T00:44:19,true,3,,,,LD,SOUS LA COTE,01300,SAINT-GERMAIN-LES-PAROISSES,,,01358,,,,,,,,,,,,,,,,,,,2005-04-30,F,,,,,52.6D,NAFRev1,N,5.620166,45.773288,0.37,street,Route de Cote Bourdon 01300 Saint-Germain-les-Paroisses,01358_0021,G,ROUTE DE COTE BOURDON,
332582303,00043,33258230300043,O,2006-04-03,,,,2012-07-24T11:50:13,false,3,CHANTEREINE,,,,LE BOURG,01300,SAINT-GERMAIN-LES-PAROISSES,,,01358,,,,,,,,,,,,,,,,,,,2012-03-01,F,,,,,85.59A,NAFRev2,N,5.617172,45.773293,0.7,street,Au Bourg 01300 Saint-Germain-les-Paroisses,01358_5qtw9g,G,AU BOURG,
343275236,00010,34327523600010,O,1987-12-31,NN,,,2018-09-29T12:35:28,true,4,APPREGNIN,52,,CHE,DE CLAIRON,01300,SAINT-GERMAIN-LES-PAROISSES,,,01358,,,,,,,,,,,,,,,,,,,2012-12-31,A,,,,,01.50Z,NAFRev2,O,5.609674,45.763979,0.83,housenumber,52 Chemin de Clairon 01300 Saint-Germain-les-Paroisses,01358_0015_00052,G,52 CHEMIN DE CLAIRON,
344622204,00016,34462220400016,O,1988-04-01,01,2018,4391BZ,2020-08-25T10:42:08,true,4,,,,,,01300,SAINT-GERMAIN-LES-PAROISSES,,,01358,,,,,,,,,,,,,,,,,,,2008-01-01,A,,,,,43.91B,NAFRev2,O,,,0,,,,,,
344637715,00014,34463771500014,O,1988-04-25,NN,,,,true,1,,,,,,01300,SAINT-GERMAIN-LES-PAROISSES,,,01358,,,,,,,,,,,,,,,,,,,1999-11-30,F,,,,,52.4R,NAF1993,N,,,0,,,,,,
350081907,00015,35008190700015,O,1989-03-11,NN,,,2019-05-08T03:48:07,true,3,,208,,RUE,DE L'EGLISE,01300,SAINT-GERMAIN-LES-PAROISSES,,,01358,,,,,,,,,,,,,,,,,,,2008-01-01,A,,,,,68.20A,NAFRev2,N,5.61771,45.772973,0.93,housenumber,208 Rue de l'Eglise 01300 Saint-Germain-les-Paroisses,01358_0031_00208,G,208 RUE DE L EGLISE,
351819826,00014,35181982600014,O,1989-09-01,NN,,,,false,4,,,,,QUARTIER BOISES,01300,SAINT-GERMAIN-LES-PAROISSES,,,01358,,,,,,,,,,,,,,,,,,,2002-11-21,F,,,,,70.2A,NAF1993,N,5.615198,45.772322,0.42,locality,Boise Ouest 01300 Saint-Germain-les-Paroisses,01358_b025,G,BOISE OUEST,
351998596,00024,35199859600024,O,2009-03-01,,,,2012-11-09T00:42:28,true,2,,,,,LE PRE SAINT GERMAIN,01300,SAINT-GERMAIN-LES-PAROISSES,,,01358,,,,,,,,,,,,,,,,,,,2009-06-30,F,,,,,68.20A,NAFRev2,N,5.614811,45.776963,0.78,street,Pre Briset 01300 Saint-Germain-les-Paroisses,01358_b196,G,PRE BRISET,
352162457,00019,35216245700019,O,1988-04-20,NN,,,2006-11-25T11:11:12,true,4,,,,,,01300,SAINT-GERMAIN-LES-PAROISSES,,,01358,,,,,,,,,,,,,,,,,,,2003-01-14,F,,,,,74.1J,NAFRev1,N,,,0,,,,,,
378302772,00041,37830277200041,O,1996-01-03,NN,,,2008-11-08T00:33:51,false,4,,,,,BROGNIN,01300,SAINT-GERMAIN-LES-PAROISSES,,,01358,,,,,,,,,,,,,,,,,,,1998-09-30,F,,,,,29.4C,NAF1993,N,5.6327166,45.7717902,0.88,poi.wetland,Marais de Brognin (Zone humide) Saint-Germain-les-Paroisses,https://osm.org/way/115290200,G,,
378302772,00066,37830277200066,O,1999-05-20,NN,,2841ZZ,2015-03-17T00:32:27,true,3,,,,,ESSIEUX,01300,SAINT-GERMAIN-LES-PAROISSES,,,01358,,,,,,,,,,,,,,,,,,,2008-01-01,A,,,,,33.12Z,NAFRev2,N,2.648765,49.4276182,0.89,poi.track,Chemin des Essieux Estrées-Saint-Denis,https://osm.org/way/42955827,G,,
379991680,00016,37999168000016,O,1938-01-01,01,2018,,2020-08-25T10:16:54,true,5,,,,,LOCAL COOPERATIVE,01300,SAINT-GERMAIN-LES-PAROISSES,,,01358,,,,,,,,,,,,,,,,,,,2008-01-01,A,,,,,77.31Z,NAFRev2,O,,,0,,,,,,
379991797,00018,37999179700018,O,1976-02-19,NN,,,2008-01-04T21:36:16,true,3,,,,,MAIRIE,01300,SAINT-GERMAIN-LES-PAROISSES,,,01358,,,,,,,,,,,,,,,,,,,2008-01-01,A,,,,,77.31Z,NAFRev2,N,5.636051,45.765765,0.38,locality,Molard Buirin 01300 Saint-Germain-les-Paroisses,01358_b169,G,MOLARD BUIRIN,
380276170,00012,38027617000012,O,1990-12-01,NN,,,2008-01-04T21:40:41,true,3,,,,,QUARTIER BOISES,01300,SAINT-GERMAIN-LES-PAROISSES,,,01358,,,,,,,,,,,,,,,,,,,2008-01-01,A,,,,,41.10D,NAFRev2,N,5.615198,45.772322,0.42,locality,Boise Ouest 01300 Saint-Germain-les-Paroisses,01358_b025,G,BOISE OUEST,
380985044,00045,38098504400045,O,2019-05-01,,,4520BB,2020-03-17T03:56:29,true,2,,58,,CHE,DU PRE BIZET,01300,SAINT-GERMAIN-LES-PAROISSES,,,01358,,,,,,,,,,,,,,,,,,,2019-12-31,A,,,,,45.20A,NAFRev2,N,5.614103,45.777457,0.58,housenumber,58 Rue du Pre Briset 01300 Saint-Germain-les-Paroisses,01358_6sogu1_00058,G,58 RUE DU PRE BRISET,
385228754,00011,38522875400011,O,1992-04-22,NN,,,,true,1,,,,,APREGNIN,01300,SAINT-GERMAIN-LES-PAROISSES,,,01358,,,,,,,,,,,,,,,,,,,1999-02-28,F,,,,,26.1C,NAF1993,N,5.608306,45.765339,0.83,street,Appregnin 01300 Saint-Germain-les-Paroisses,01358_5v0b9i,G,APPREGNIN,
388258642,00015,38825864200015,O,,NN,,,,true,1,,,,,APPREGNIN,01300,SAINT-GERMAIN-LES-PAROISSES,,,01358,,,,,,,,,,,,,,,,,,,1994-12-31,F,,,,,36.6A,NAF1993,N,5.608306,45.765339,0.93,street,Appregnin 01300 Saint-Germain-les-Paroisses,01358_5v0b9i,G,APPREGNIN,
388413403,00022,38841340300022,O,1992-09-23,NN,,,2008-11-08T00:48:53,true,3,,,,,ESSIEU,01300,SAINT-GERMAIN-LES-PAROISSES,,,01358,,,,,,,,,,,,,,,,,,,1994-12-25,F,,,,,28.3B,NAF1993,N,3.2920923,49.6625552,0.88,poi.industrial,Espace Essieu TechniCentre Tergnier (Zone industrielle) Tergnier,https://osm.org/way/379524236,G,,
390502821,00015,39050282100015,O,1993-04-01,NN,,,,false,4,,,,QUAI,BOISES,01300,SAINT-GERMAIN-LES-PAROISSES,,,01358,,,,,,,,,,,,,,,,,,,2001-08-01,F,,,,,70.2C,NAF1993,N,5.615198,45.772322,0.54,locality,Boise Ouest 01300 Saint-Germain-les-Paroisses,01358_b025,G,BOISE OUEST,
393051677,00010,39305167700010,O,,NN,,,,true,1,,,,,APPREGNIN,01300,SAINT-GERMAIN-LES-PAROISSES,,,01358,,,,,,,,,,,,,,,,,,,1994-10-31,F,,,,,80.4D,NAF1993,N,5.608306,45.765339,0.93,street,Appregnin 01300 Saint-Germain-les-Paroisses,01358_5v0b9i,G,APPREGNIN,
393796271,00020,39379627100020,O,1996-03-03,NN,,,,false,4,,,,HAM,ESSIEU,01300,SAINT-GERMAIN-LES-PAROISSES,,,01358,,,,,,,,,,,,,,,,,,,2000-01-01,F,,,,,85.1C,NAF1993,N,3.2920923,49.6625552,0.88,poi.industrial,Espace Essieu TechniCentre Tergnier (Zone industrielle) Tergnier,https://osm.org/way/379524236,G,,
394280291,00011,39428029100011,O,,NN,,,,true,1,,,,,APPREGNIN,01300,SAINT-GERMAIN-LES-PAROISSES,,,01358,,,,,,,,,,,,,,,,,,,1995-05-31,F,,,,,74.1A,NAF1993,O,5.608306,45.765339,0.93,street,Appregnin 01300 Saint-Germain-les-Paroisses,01358_5v0b9i,G,APPREGNIN,
398619718,00016,39861971800016,O,1994-08-01,NN,,,2008-11-08T01:05:04,true,4,,,,,ESSIEU,01300,SAINT-GERMAIN-LES-PAROISSES,,,01358,,,,,,,,,,,,,,,,,,,2003-05-15,F,,,,,28.1A,NAFRev1,O,3.2920923,49.6625552,0.88,poi.industrial,Espace Essieu TechniCentre Tergnier (Zone industrielle) Tergnier,https://osm.org/way/379524236,G,,
399281005,00013,39928100500013,O,,NN,,,,true,1,,,,,BROGNIN,01300,SAINT-GERMAIN-LES-PAROISSES,,,01358,,,,,,,,,,,,,,,,,,,1996-12-30,F,,,,,51.1R,NAF1993,N,5.6327166,45.7717902,0.88,poi.wetland,Marais de Brognin (Zone humide) Saint-Germain-les-Paroisses,https://osm.org/way/115290200,G,,
400622148,00015,40062214800015,O,1995-04-10,NN,,,2008-11-08T01:09:26,false,3,,,,,,01300,SAINT-GERMAIN-LES-PAROISSES,,,01358,,,,,,,,,,,,,,,,,,,2004-02-28,F,,,,,50.2Z,NAFRev1,N,,,0,,,,,,
400622148,00023,40062214800023,O,2005-05-02,,,4520AB,2018-03-08T15:11:17,true,3,,119,,RTE,DE COTE BOURDON,01300,SAINT-GERMAIN-LES-PAROISSES,,,01358,,,,,,,,,,,,,,,,,,,2018-02-15,A,,,,D C 7,45.20A,NAFRev2,N,5.620178,45.773201,0.86,housenumber,119 Route de Cote Bourdon 01300 Saint-Germain-les-Paroisses,01358_0021_00119,G,119 ROUTE DE COTE BOURDON,
400799656,00014,40079965600014,O,,NN,,,,true,1,,,,,,01300,SAINT-GERMAIN-LES-PAROISSES,,,01358,,,,,,,,,,,,,,,,,,,1996-08-31,F,,,,,55.4A,NAF1993,N,,,0,,,,,,
402851331,00015,40285133100015,O,,NN,,,,true,1,,,,,APPREGNIN,01300,SAINT-GERMAIN-LES-PAROISSES,,,01358,,,,,,,,,,,,,,,,,,,1996-08-31,F,,,,,72.1Z,NAF1993,N,5.608306,45.765339,0.93,street,Appregnin 01300 Saint-Germain-les-Paroisses,01358_5v0b9i,G,APPREGNIN,
418312922,00010,41831292200010,O,1998-01-17,NN,,,2016-03-16T03:54:44,true,3,,,,,,01300,SAINT-GERMAIN-LES-PAROISSES,,,01358,,,,,,,,,,,,,,,,,,,2008-01-01,A,,,,,68.20B,NAFRev2,N,,,0,,,,,,
418432654,00014,41843265400014,O,1998-04-08,NN,,,2008-01-05T20:34:49,true,3,,,,,,01300,SAINT-GERMAIN-LES-PAROISSES,,,01358,,,,,,,,,,,,,,,,,,,2008-01-01,A,,,,,68.20B,NAFRev2,N,,,0,,,,,,
418855391,00011,41885539100011,O,1982-12-31,NN,,,,true,4,,,,,APPREGNIN,01300,SAINT-GERMAIN-LES-PAROISSES,,,01358,,,,,,,,,,,,,,,,,,,2003-02-07,F,,,,,01.1G,NAFRev1,N,5.608306,45.765339,0.93,street,Appregnin 01300 Saint-Germain-les-Paroisses,01358_5v0b9i,G,APPREGNIN,
418855409,00011,41885540900011,O,1982-12-31,NN,,,,true,4,,,,,CESSIEU,01300,SAINT-GERMAIN-LES-PAROISSES,,,01358,,,,,,,,,,,,,,,,,,,2001-04-13,F,,,,,01.1G,NAF1993,N,5.3759907,45.5661178,0.9,poi.park,Parc Cessieu,https://osm.org/way/124220183,G,,
418855417,00014,41885541700014,O,1989-11-01,NN,,,2009-05-15T05:03:03,true,4,,,,,ESSIEU,01300,SAINT-GERMAIN-LES-PAROISSES,,,01358,,,,,,,,,,,,,,,,,,,2008-12-31,F,,,,,01.42Z,NAFRev2,N,3.2920923,49.6625552,0.88,poi.industrial,Espace Essieu TechniCentre Tergnier (Zone industrielle) Tergnier,https://osm.org/way/379524236,G,,
421274226,00016,42127422600016,O,1982-12-31,,,,,true,3,,,,,,01300,SAINT-GERMAIN-LES-PAROISSES,,,01358,,,,,,,,,,,,,,,,,,,2000-03-16,F,,,,,01.1A,NAF1993,N,,,0,,,,,,
428653026,00016,42865302600016,O,2000-01-01,NN,,,2008-11-08T01:49:44,true,3,,,,,,01300,SAINT-GERMAIN-LES-PAROISSES,,,01358,,,,,,,,,,,,,,,,,,,2004-09-30,F,,,,,74.1J,NAFRev1,O,,,0,,,,,,
429879612,00019,42987961200019,O,2000-03-01,NN,,,2013-06-14T03:18:44,true,4,,,,,,01300,SAINT-GERMAIN-LES-PAROISSES,,,01358,,,,,,,,,,,,,,,,,,,2013-07-01,A,,,,,68.20B,NAFRev2,N,,,0,,,,,,
439658691,00019,43965869100019,O,2001-10-01,NN,,,,true,1,,,,,AU BOURG,01300,SAINT-GERMAIN-LES-PAROISSES,,,01358,,,,,,,,,,,,,,,,,,,2002-04-16,F,,,,,74.6Z,NAF1993,N,5.617172,45.773293,0.93,street,Au Bourg 01300 Saint-Germain-les-Paroisses,01358_5qtw9g,G,AU BOURG,
441955895,00012,44195589500012,O,2002-05-15,NN,,,,false,4,,,,,AU BOURG,01300,SAINT-GERMAIN-LES-PAROISSES,,,01358,,,,,,,,,,,,,,,,,,,2003-01-24,F,,,,,60.2L,NAFRev1,N,5.617172,45.773293,0.93,street,Au Bourg 01300 Saint-Germain-les-Paroisses,01358_5qtw9g,G,AU BOURG,
442744843,00016,44274484300016,O,2002-05-15,NN,,,2006-11-25T18:01:19,true,4,,,,,AU BOURG,01300,SAINT-GERMAIN-LES-PAROISSES,,,01358,,,,,,,,,,,,,,,,,,,2003-01-24,F,,,,,74.1J,NAFRev1,N,5.617172,45.773293,0.93,street,Au Bourg 01300 Saint-Germain-les-Paroisses,01358_5qtw9g,G,AU BOURG,
450791413,00013,45079141300013,O,1990-01-01,NN,,,2008-01-05T02:14:28,true,3,,,,,,01300,SAINT-GERMAIN-LES-PAROISSES,,,01358,,,,,,,,,,,,,,,,,,,2008-01-01,A,,,,,01.11Z,NAFRev2,N,,,0,,,,,,
453349052,00036,45334905200036,O,2018-03-13,,,8129BP,2018-02-14T12:49:40,true,1,,88,,RUE,DU MARTERET,01300,SAINT-GERMAIN-LES-PAROISSES,,,01358,,,,,,,,,,,,,,,,,,,2018-03-13,A,,,,STOP MOUSSE,96.03Z,NAFRev2,N,5.617253,45.773517,0.93,housenumber,88 Rue du Marteret 01300 Saint-Germain-les-Paroisses,01358_0063_00088,G,88 RUE DU MARTERET,
478761414,00018,47876141400018,O,2004-10-01,NN,,,2014-07-08T02:55:07,false,6,,,,,ESSIEU,01300,SAINT-GERMAIN-LES-PAROISSES,,,01358,,,,,,,,,,,,,,,,,,,2010-11-17,F,,,,,33.20A,NAFRev2,N,3.2920923,49.6625552,0.88,poi.industrial,Espace Essieu TechniCentre Tergnier (Zone industrielle) Tergnier,https://osm.org/way/379524236,G,,
480637115,00027,48063711500027,O,2010-12-16,,,,2012-07-31T14:25:53,true,1,,343,,RUE,DE L EGLISE,01300,SAINT-GERMAIN-LES-PAROISSES,,,01358,,,,,,,,,,,,,,,,,,,2010-12-16,A,,,,,94.99Z,NAFRev2,N,5.618917,45.773941,0.93,housenumber,343 Rue de l'Eglise 01300 Saint-Germain-les-Paroisses,01358_0031_00343,G,343 RUE DE L EGLISE,
488352394,00032,48835239400032,O,2020-06-01,,,,2020-06-19T03:58:25,true,1,,119,,RTE,DE COTE BOURDON,01300,SAINT-GERMAIN-LES-PAROISSES,,,01358,,,,,,,,,,,,,,,,,,,2020-06-01,A,,,,,82.30Z,NAFRev2,O,5.620178,45.773201,0.86,housenumber,119 Route de Cote Bourdon 01300 Saint-Germain-les-Paroisses,01358_0021_00119,G,119 ROUTE DE COTE BOURDON,
488705328,00034,48870532800034,O,2014-02-03,,,,2018-01-19T07:31:10,false,2,CHEMIN DE LA BATTEUSE,,,,MEYRIEU,01300,SAINT-GERMAIN-LES-PAROISSES,,,01358,,,,,,,,,,,,,,,,,,,2015-08-31,F,,,,,47.89Z,NAFRev2,N,5.613366,45.777809,0.72,street,Chemin de la Batteuse 01300 Saint-Germain-les-Paroisses,01358_0006,D,CHEMIN DE LA BATTEUSE,
488705328,00042,48870532800042,O,2018-01-01,,,,2018-11-08T04:39:44,true,2,MEYRIEU,,,CHE,DE LA BATTEUSE,01300,SAINT-GERMAIN-LES-PAROISSES,,,01358,,,,,,,,,,,,,,,,,,,2018-09-30,F,L'OBJET ANCIEN,,,,47.89Z,NAFRev2,N,5.613366,45.777809,0.84,street,Chemin de la Batteuse 01300 Saint-Germain-les-Paroisses,01358_0006,G,CHEMIN DE LA BATTEUSE,
491631222,00016,49163122200016,O,2006-09-01,,,,2008-01-05T04:00:37,true,2,,,,,CESSIEU,01300,SAINT-GERMAIN-LES-PAROISSES,,,01358,,,,,,,,,,,,,,,,,,,2008-01-01,A,,,,,01.21Z,NAFRev2,N,5.3759907,45.5661178,0.9,poi.park,Parc Cessieu,https://osm.org/way/124220183,G,,
491631222,00024,49163122200024,O,2016-07-01,,,,2016-11-03T14:18:44,false,1,,145,,,HAMEAU CESSIEU,01300,SAINT-GERMAIN-LES-PAROISSES,,,01358,,,,,,,,,,,,,,,,,,,2016-07-01,A,,,,,70.22Z,NAFRev2,N,,,0,,,,,,
491858502,00025,49185850200025,O,2007-02-15,,,,2019-06-27T10:49:39,false,5,,,,,MEYRIEU,01300,SAINT-GERMAIN-LES-PAROISSES,,,01358,,,,,,,,,,,,,,,,,,,2010-09-30,F,,,,,43.22A,NAFRev2,N,5.1994269,45.5134321,0.88,poi.townhall,Mairie (Hôtel de ville) Meyrieu-les-Étangs,https://osm.org/way/219186770,G,,
498800051,00019,49880005100019,O,2007-06-19,NN,,,2015-05-14T08:51:32,false,4,,,,,MEYRIEU,01300,SAINT-GERMAIN-LES-PAROISSES,,,01358,,,,,,,,,,,,,,,,,,,2014-01-01,F,,,,,77.32Z,NAFRev2,O,5.1994269,45.5134321,0.88,poi.townhall,Mairie (Hôtel de ville) Meyrieu-les-Étangs,https://osm.org/way/219186770,G,,
499119527,00012,49911952700012,O,2007-07-01,,,,2009-05-28T05:38:46,false,2,,,,,LE TRAPPON,01300,SAINT-GERMAIN-LES-PAROISSES,,,01358,,,,,,,,,,,,,,,,,,,2008-01-01,A,,,,,68.20B,NAFRev2,N,5.640453,45.76567,0.93,street,Le Trappon 01300 Saint-Germain-les-Paroisses,01358_nd7hyf,G,LE TRAPPON,
499969715,00014,49996971500014,O,2007-09-07,,,,2008-03-28T14:19:47,true,3,CHEF LIEU,,,,,01300,SAINT-GERMAIN-LES-PAROISSES,,,01358,,,,,,,,,,,,,,,,,,,2008-01-01,F,,,,,46.19B,NAFRev2,N,5.619384,45.766505,0.37,street,Chemin de Chailliere 01300 Saint-Germain-les-Paroisses,01358_0013,D,CHEMIN DE CHAILLIERE,
502539968,00011,50253996800011,O,2008-02-05,00,2018,4391AZ,2020-08-25T10:15:08,false,4,,,,,,01300,SAINT-GERMAIN-LES-PAROISSES,,,01358,,,,,,,,,,,,,,,,,,,2018-03-01,F,SARL GOUMAZ,,,,43.91A,NAFRev2,N,,,0,,,,,,
508160595,00015,50816059500015,O,2008-09-01,NN,,,2014-06-14T01:53:26,true,5,,,,,ESSIEU,01300,SAINT-GERMAIN-LES-PAROISSES,,,01358,,,,,,,,,,,,,,,,,,,2012-09-07,F,,,,,62.01Z,NAFRev2,O,3.2920923,49.6625552,0.88,poi.industrial,Espace Essieu TechniCentre Tergnier (Zone industrielle) Tergnier,https://osm.org/way/379524236,G,,
511544009,00018,51154400900018,O,2009-03-01,,,,2012-11-10T00:42:39,true,2,NEANT,,,,LE PRE SAINT GERMAIN,01300,SAINT-GERMAIN-LES-PAROISSES,,,01358,,,,,,,,,,,,,,,,,,,2009-06-30,F,,,,,68.20A,NAFRev2,N,5.614811,45.776963,0.78,street,Pre Briset 01300 Saint-Germain-les-Paroisses,01358_b196,G,PRE BRISET,
520785643,00013,52078564300013,O,2010-03-02,,,,2018-09-22T04:18:55,true,2,,,,,,01300,SAINT-GERMAIN-LES-PAROISSES,,,01358,,,,,,,,,,,,,,,,,,,2018-01-01,F,,,,,81.30Z,NAFRev2,N,,,0,,,,,,
524372489,00012,52437248900012,O,2010-07-21,,,,2016-01-12T00:29:18,false,2,,21,,RUE,DU TRAPPON,01300,SAINT-GERMAIN-LES-PAROISSES,,,01358,,,,,,,,,,,,,,,,,,,2015-09-21,F,,,,,81.30Z,NAFRev2,N,5.636908,45.764409,0.68,housenumber,21 Chemin du Trappon 01300 Saint-Germain-les-Paroisses,01358_0077_00021,G,21 CHEMIN DU TRAPPON,
527674451,00010,52767445100010,O,2010-09-17,,,,2016-04-20T04:12:26,true,1,,,,,MEYRIEU,01300,SAINT-GERMAIN-LES-PAROISSES,,,01358,,,,,,,,,,,,,,,,,,,2010-09-17,A,,,,,68.20B,NAFRev2,N,5.1994269,45.5134321,0.88,poi.townhall,Mairie (Hôtel de ville) Meyrieu-les-Étangs,https://osm.org/way/219186770,G,,
528544919,00020,52854491900020,O,2011-11-26,,,,2015-01-26T12:23:49,true,2,LE BOURG,321,,RUE,DE L EGLISE,01300,SAINT-GERMAIN-LES-PAROISSES,,,01358,,,,,,,,,,,,,,,,,,,2014-12-31,F,,,,,96.09Z,NAFRev2,N,5.618654,45.773846,0.93,housenumber,321 Rue de l'Eglise 01300 Saint-Germain-les-Paroisses,01358_0031_00321,G,321 RUE DE L EGLISE,
532470903,00016,53247090300016,O,2011-05-18,,,,2011-05-20T06:36:37,true,1,,,,,ESSIEU,01300,SAINT-GERMAIN-LES-PAROISSES,,,01358,,,,,,,,,,,,,,,,,,,2011-05-18,A,,,,,01.49Z,NAFRev2,N,3.2920923,49.6625552,0.88,poi.industrial,Espace Essieu TechniCentre Tergnier (Zone industrielle) Tergnier,https://osm.org/way/379524236,G,,
533799425,00012,53379942500012,O,2011-02-05,,,,2011-07-27T08:22:33,true,1,,1,,CHE,DE PRE BRISET,01300,SAINT-GERMAIN-LES-PAROISSES,,,01358,,,,,,,,,,,,,,,,,,,2011-02-05,A,,,,,47.99A,NAFRev2,N,5.614344,45.777703,0.58,street,Rue du Pre Briset 01300 Saint-Germain-les-Paroisses,01358_6sogu1,G,RUE DU PRE BRISET,
538560319,00013,53856031900013,O,2011-12-01,,,,2018-11-10T04:27:35,true,2,MEYRIEU,129,,CHE,DE LA RIGOLETTE,01300,SAINT-GERMAIN-LES-PAROISSES,,,01358,,,,,,,,,,,,,,,,,,,2018-11-06,F,LE JARDIN DE LA RIGOLETTE,,,,01.13Z,NAFRev2,N,5.6145,45.778548,0.86,housenumber,129 Chemin de la Rigolette 01300 Saint-Germain-les-Paroisses,01358_0078_00129,G,129 CHEMIN DE LA RIGOLETTE,
546011925,00015,54601192500015,O,,,,,,true,1,,,,,,01300,SAINT-GERMAIN-LES-PAROISSES,,,01358,,,,,,,,,,,,,,,,,,,1985-12-25,F,,,,,62.43,NAP,N,,,0,,,,,,
546310947,00017,54631094700017,O,,,,,,true,1,,,,,,01300,SAINT-GERMAIN-LES-PAROISSES,,,01358,,,,,,,,,,,,,,,,,,,1984-12-25,F,,,,,22.02,NAP,N,,,0,,,,,,
547210658,00019,54721065800019,O,,NN,,,,true,1,,,,,,01300,SAINT-GERMAIN-LES-PAROISSES,,,01358,,,,,,,,,,,,,,,,,,,1995-03-31,F,,,,,52.1B,NAF1993,N,,,0,,,,,,
547220152,00011,54722015200011,O,1972-01-01,NN,,,2011-08-04T17:47:54,true,5,,,,,,01300,SAINT-GERMAIN-LES-PAROISSES,,,01358,,,,,,,,,,,,,,,,,,,2009-10-26,F,,,,,43.32A,NAFRev2,O,,,0,,,,,,