siren,nic,siret,statutDiffusionEtablissement,dateCreationEtablissement,trancheEffectifsEtablissement,anneeEffectifsEtablissement,activitePrincipaleRegistreMetiersEtablissement,dateDernierTraitementEtablissement,etablissementSiege,nombrePeriodesEtablissement,complementAdresseEtablissement,numeroVoieEtablissement,indiceRepetitionEtablissement,typeVoieEtablissement,libelleVoieEtablissement,codePostalEtablissement,libelleCommuneEtablissement,libelleCommuneEtrangerEtablissement,distributionSpecialeEtablissement,codeCommuneEtablissement,codeCedexEtablissement,libelleCedexEtablissement,codePaysEtrangerEtablissement,libellePaysEtrangerEtablissement,complementAdresse2Etablissement,numeroVoie2Etablissement,indiceRepetition2Etablissement,typeVoie2Etablissement,libelleVoie2Etablissement,codePostal2Etablissement,libelleCommune2Etablissement,libelleCommuneEtranger2Etablissement,distributionSpeciale2Etablissement,codeCommune2Etablissement,codeCedex2Etablissement,libelleCedex2Etablissement,codePaysEtranger2Etablissement,libellePaysEtranger2Etablissement,dateDebut,etatAdministratifEtablissement,enseigne1Etablissement,enseigne2Etablissement,enseigne3Etablissement,denominationUsuelleEtablissement,activitePrincipaleEtablissement,nomenclatureActivitePrincipaleEtablissement,caractereEmployeurEtablissement,longitude,latitude,geo_score,geo_type,geo_adresse,geo_id,geo_ligne,geo_l4,geo_l5
210501110,00014,21050111000014,O,1983-03-01,01,2018,,2020-08-25T10:15:34,true,3,HOTEL DE VILLE,,,,,05200,PUY-SANIERES,,,05111,,,,,,,,,,,,,,,,,,,2008-01-01,A,MAIRIE,,,,84.11Z,NAFRev2,O,,,0,,,,,,
210501110,00022,21050111000022,O,2001-04-06,NN,,,2019-11-14T14:00:15,false,3,HOTEL DE VILLE,,,,,05200,PUY-SANIERES,,,05111,,,,,,,,,,,,,,,,,,,2008-01-01,A,SERVICE EAU ET ASSAINISSEMENT,,,,36.00Z,NAFRev2,N,,,0,,,,,,
250501228,00028,25050122800028,O,2018-10-29,,,,2019-11-14T14:00:15,false,1,,,,,MAIRIE DE PUY SANIERES,05200,PUY-SANIERES,,,05111,,,,,,,,,,,,,,,,,,,2018-10-29,F,,,,,84.12Z,NAFRev2,O,6.423789,44.548408,0.69,street,Rue de la Pierre Blanche 05200 Puy-Sanières,05111_0070,G,RUE DE LA PIERRE BLANCHE,
260501184,00014,26050118400014,O,1983-03-01,NN,,,2019-11-14T14:00:15,true,3,,,,,HOTEL DE VILLE,05200,PUY-SANIERES,,,05111,,,,,,,,,,,,,,,,,,,2008-01-01,A,CCAS,,,,88.99B,NAFRev2,N,3.0709671,50.6304695,0.92,poi.townhall,Hôtel de Ville Lille,https://osm.org/way/40917078,G,,
260503404,00014,26050340400014,O,1994-01-01,NN,,,2019-11-14T14:00:15,true,3,,,,,,05200,PUY-SANIERES,,,05111,,,,,,,,,,,,,,,,,,,2005-01-14,F,CDE,,,,85.3K,NAFRev1,N,,,0,,,,,,
290502418,00012,29050241800012,O,1983-08-10,NN,,,2019-11-14T14:00:15,true,3,,,,,HOTEL DE VILLE,05200,PUY-SANIERES,,,05111,,,,,,,,,,,,,,,,,,,2008-01-01,A,,,,,42.99Z,NAFRev2,N,3.0709671,50.6304695,0.92,poi.townhall,Hôtel de Ville Lille,https://osm.org/way/40917078,G,,
305080178,00216,30508017800216,O,1988-06-15,01,2018,,2020-08-25T10:23:03,false,4,,,,,LIEU DIT CHADENAS,05200,PUY-SANIERES,,,05111,,,,,,,,,,,,,,,,,,,2008-01-01,A,CTRE DE VACANCES DU MEB,,,,55.20Z,NAFRev2,O,6.416698,44.548931,0.31,street,Rue Pierre Chaumaure 05200 Puy-Sanières,05111_0220,G,RUE PIERRE CHAUMAURE,
305806911,00064,30580691100064,O,1995-01-01,NN,,,2019-11-14T14:00:15,true,4,,,,LD,LES TRUCHETS,05200,PUY-SANIERES,,,05111,,,,,,,,,,,,,,,,,,,2002-11-22,F,,,,,72.2Z,NAF1993,N,6.428321,44.562725,0.3,locality,Les Clauseards et Chp Cons 05200 Puy-Sanières,05111_b024,G,LES CLAUSEARDS ET CHP CONS,
306120478,00012,30612047800012,O,,NN,,,2019-11-14T14:00:15,true,1,,,,,,05200,PUY-SANIERES,,,05111,,,,,,,,,,,,,,,,,,,,F,,,,,55.60,NAP,N,,,0,,,,,,
312952708,00021,31295270800021,O,1995-04-05,12,2018,,2020-08-25T10:25:34,true,5,,,,,,05200,PUY-SANIERES,,,05111,,,,,,,,,,,,,,,,,,,2008-01-01,A,CHADENAS,,,,55.20Z,NAFRev2,O,,,0,,,,,,
318011822,00026,31801182200026,O,,NN,,,2019-11-14T14:00:15,true,1,,,,,LOT PIBOU BAS,05200,PUY-SANIERES,,,05111,,,,,,,,,,,,,,,,,,,1987-09-30,F,,,,,55.73,NAP,N,6.417842,44.546632,0.68,street,Le Pibou Bas 05200 Puy-Sanières,05111_b112,G,LE PIBOU BAS,
319830501,00049,31983050100049,O,2003-09-01,NN,,,2019-11-14T14:00:15,true,4,HAUT PIBOU,,,RUE,DE MORGON,05200,PUY-SANIERES,,,05111,,,,,,,,,,,,,,,,,,,2008-01-01,F,,,,,90.03A,NAFRev2,N,6.419156,44.547311,0.74,street,Rue du Morgon 05200 Puy-Sanières,05111_mcd1tt,G,RUE DU MORGON,
327142873,00071,32714287300071,O,1999-01-01,NN,,,2019-11-14T14:00:15,true,5,,,,,PIERRE CHAUMAURE,05200,PUY-SANIERES,,,05111,,,,,,,,,,,,,,,,,,,2012-12-31,F,,,,,74.10Z,NAFRev2,N,6.41638,44.548995,0.93,street,Pierre Chaumaure 05200 Puy-Sanières,05111_b114,G,PIERRE CHAUMAURE,
327361796,00029,32736179600029,O,1983-04-27,NN,,,2020-07-01T03:48:05,false,3,,,,LD,LES TRUCHET,05200,PUY-SANIERES,,,05111,,,,,,,,,,,,,,,,,,,1993-11-15,F,,,,,52.4C,NAF1993,N,6.428321,44.562725,0.39,locality,Les Clauseards et Chp Cons 05200 Puy-Sanières,05111_b024,G,LES CLAUSEARDS ET CHP CONS,
327440046,00016,32744004600016,O,,,,,2019-11-14T14:00:15,true,1,,,,LD,TRUCHETS,05200,PUY-SANIERES,,,05111,,,,,,,,,,,,,,,,,,,1984-12-25,F,,,,,64.49,NAP,N,,,0,,,,,,
328270145,00050,32827014500050,O,2020-02-20,,,,2020-08-04T11:58:40,true,2,,1,,RUE,DU MORGON,05200,PUY-SANIERES,,,05111,,,,,,,,,,,,,,,,,,,2020-06-15,A,,,,,01.61Z,NAFRev2,N,6.419156,44.547311,0.93,housenumber,1 Rue du Morgon 05200 Puy-Sanières,05111_mcd1tt_00001,G,1 RUE DU MORGON,
332643832,00071,33264383200071,O,2016-10-01,,,,2019-11-14T14:00:15,true,1,,,,,LE PIBOU BAS,05200,PUY-SANIERES,,,05111,,,,,,,,,,,,,,,,,,,2016-10-01,A,,,,,71.11Z,NAFRev2,N,6.417842,44.546632,0.93,street,Le Pibou Bas 05200 Puy-Sanières,05111_b112,G,LE PIBOU BAS,
338154321,00016,33815432100016,O,,NN,,,2019-11-14T14:00:15,true,1,,,,,LES TRUCHETS,05200,PUY-SANIERES,,,05111,,,,,,,,,,,,,,,,,,,,F,,,,,38.50,NAP,N,6.428321,44.562725,0.3,locality,Les Clauseards et Chp Cons 05200 Puy-Sanières,05111_b024,G,LES CLAUSEARDS ET CHP CONS,
339895674,00010,33989567400010,O,1986-12-18,NN,,,2019-11-14T14:00:15,true,3,,,,,LES TRUCHETS,05200,PUY-SANIERES,,,05111,,,,,,,,,,,,,,,,,,,2008-01-01,A,,,,,41.10D,NAFRev2,N,6.428321,44.562725,0.3,locality,Les Clauseards et Chp Cons 05200 Puy-Sanières,05111_b024,G,LES CLAUSEARDS ET CHP CONS,
349230250,00046,34923025000046,O,2012-10-08,,,4332AA,2019-11-14T14:00:15,true,2,,2,,RUE,DU MORGON,05200,PUY-SANIERES,,,05111,,,,,,,,,,,,,,,,,,,2016-03-30,F,AGENCEMENT BOIS SERVICE,,,AGENCEMENT BOIS SERVICE,43.32A,NAFRev2,N,6.419156,44.547311,0.83,street,Rue du Morgon 05200 Puy-Sanières,05111_mcd1tt,G,RUE DU MORGON,
349713149,00038,34971314900038,O,2014-09-15,,,,2019-11-14T14:00:15,true,2,,,,,LES TRUCHETS,05200,PUY-SANIERES,,,05111,,,,,,,,,,,,,,,,,,,2015-12-26,F,,,,,85.51Z,NAFRev2,N,6.428321,44.562725,0.3,locality,Les Clauseards et Chp Cons 05200 Puy-Sanières,05111_b024,G,LES CLAUSEARDS ET CHP CONS,
377668371,00018,37766837100018,O,,NN,,,2019-11-14T14:00:15,true,1,,,,,CENTRE EQUESTRE DES 3 SOLE,05200,PUY-SANIERES,,,05111,,,,,,,,,,,,,,,,,,,1991-12-30,F,,,,,86.10,NAP,N,5.3134292,46.2996678,0.72,poi.sports_centre,Domaine Équestre des 3 Monts (Centre sportif) Saint-Étienne-du-Bois,https://osm.org/way/409441062,G,,
392523486,00018,39252348600018,O,1993-08-24,NN,,,2019-11-14T14:00:15,true,3,,,,,LE PIBOU HAUT,05200,PUY-SANIERES,,,05111,,,,,,,,,,,,,,,,,,,2008-01-01,A,,,,,68.20A,NAFRev2,N,6.420915,44.548016,0.77,street,Lieu Dit le Haut Pibou 05200 Puy-Sanières,05111_b108,G,LIEU DIT LE HAUT PIBOU,
393443619,00027,39344361900027,O,2002-10-01,,,,2019-11-14T14:00:15,true,1,,,,,MAIRIE DE PUY SANIERES,05200,PUY-SANIERES,,,05111,,,,,,,,,,,,,,,,,,,2002-10-01,F,,,,,80.4D,NAF1993,O,6.423789,44.548408,0.69,street,Rue de la Pierre Blanche 05200 Puy-Sanières,05111_0070,G,RUE DE LA PIERRE BLANCHE,
394679195,00021,39467919500021,O,2018-06-01,,,,2020-03-17T03:46:26,false,2,LES VIGNETS,,,CHE,DE MOUNET,05200,PUY-SANIERES,,,05111,,,,,,,,,,,,,,,,,,,2019-12-31,F,,,,AU FIL DE L'EAU,55.20Z,NAFRev2,N,6.423789,44.548408,0.41,street,Rue de la Pierre Blanche 05200 Puy-Sanières,05111_0070,G,RUE DE LA PIERRE BLANCHE,
400334421,00015,40033442100015,O,1995-02-24,NN,,,2019-11-14T14:00:15,false,3,,,,,LES TRUCHETS,05200,PUY-SANIERES,,,05111,,,,,,,,,,,,,,,,,,,2007-06-17,F,,,,,01.4D,NAFRev1,N,6.428321,44.562725,0.3,locality,Les Clauseards et Chp Cons 05200 Puy-Sanières,05111_b024,G,LES CLAUSEARDS ET CHP CONS,
401384086,00013,40138408600013,O,1995-06-12,NN,,,2019-11-14T14:00:15,false,4,,,,,LE SERRE,05200,PUY-SANIERES,,,05111,,,,,,,,,,,,,,,,,,,1997-09-30,F,,,,,15.8C,NAF1993,O,6.419845,44.547053,0.6,street,Rue du Serre Lombard 05200 Puy-Sanières,05111_0420,G,RUE DU SERRE LOMBARD,
402229298,00011,40222929800011,O,1984-01-01,NN,,,2019-11-14T14:00:15,true,4,,,,,,05200,PUY-SANIERES,,,05111,,,,,,,,,,,,,,,,,,,2008-05-01,A,,,,,68.20B,NAFRev2,N,,,0,,,,,,
403005911,00017,40300591100017,O,1989-01-01,NN,,,2019-11-14T14:00:15,true,3,,,,,LE SERRE,05200,PUY-SANIERES,,,05111,,,,,,,,,,,,,,,,,,,2008-01-01,A,,,,,01.45Z,NAFRev2,N,6.419845,44.547053,0.6,street,Rue du Serre Lombard 05200 Puy-Sanières,05111_0420,G,RUE DU SERRE LOMBARD,
403800501,00013,40380050100013,O,1900-01-01,NN,,,2019-11-14T14:00:15,false,3,,,,,LE SERRE,05200,PUY-SANIERES,,,05111,,,,,,,,,,,,,,,,,,,1997-09-22,F,,,,,92.6C,NAF1993,N,6.419845,44.547053,0.6,street,Rue du Serre Lombard 05200 Puy-Sanières,05111_0420,G,RUE DU SERRE LOMBARD,
404389306,00014,40438930600014,O,1995-04-10,NN,,,2019-11-14T14:00:15,true,4,CHEZ MR RASTOUIL,,,,LES 3 SOLEILS,05200,PUY-SANIERES,,,05111,,,,,,,,,,,,,,,,,,,2008-01-01,A,,,,,94.99Z,NAFRev2,N,4.8158126,43.9476435,0.9,poi.theatre,Les 3 soleils (Théâtre) Avignon,https://osm.org/way/83751210,G,,
412479750,00025,41247975000025,O,2002-01-01,NN,,,2019-11-14T14:00:15,true,4,LE HAUT PIBOU,19,,RUE,DU MONT GUILLAUME,05200,PUY-SANIERES,,,05111,,,,,,,,,,,,,,,,,,,2003-06-01,F,,,,,92.6C,NAFRev1,N,6.420489,44.54759,0.93,housenumber,19 Rue du Mont Guillaume 05200 Puy-Sanières,05111_afwmew_00019,G,19 RUE DU MONT GUILLAUME,
412881518,00028,41288151800028,O,1997-08-01,NN,,,2019-11-14T14:00:15,true,3,,,,,LE SERRE,05200,PUY-SANIERES,,,05111,,,,,,,,,,,,,,,,,,,2008-01-01,A,,,,,71.11Z,NAFRev2,N,6.419845,44.547053,0.6,street,Rue du Serre Lombard 05200 Puy-Sanières,05111_0420,G,RUE DU SERRE LOMBARD,
418469391,00027,41846939100027,O,2003-01-01,NN,,,2019-11-14T14:00:15,false,3,,,,,LE SERRE,05200,PUY-SANIERES,,,05111,,,,,,,,,,,,,,,,,,,2008-01-01,A,,,,,68.20A,NAFRev2,N,6.419845,44.547053,0.6,street,Rue du Serre Lombard 05200 Puy-Sanières,05111_0420,G,RUE DU SERRE LOMBARD,
418811063,00019,41881106300019,O,1990-06-01,NN,,,2019-11-14T14:00:15,true,4,,,,,COTES CLAVELLES,05200,PUY-SANIERES,,,05111,,,,,,,,,,,,,,,,,,,2008-01-01,A,,,,,01.45Z,NAFRev2,N,6.436161,44.554813,0.93,locality,Côtes Clavelles 05200 Puy-Sanières,05111_b039,G,COTES CLAVELLES,
418951703,00010,41895170300010,O,1998-05-14,,,,2019-11-14T14:00:15,false,3,,,,,LES TRUCHETS,05200,PUY-SANIERES,,,05111,,,,,,,,,,,,,,,,,,,1999-06-30,F,,,,,51.1R,NAF1993,N,6.428321,44.562725,0.3,locality,Les Clauseards et Chp Cons 05200 Puy-Sanières,05111_b024,G,LES CLAUSEARDS ET CHP CONS,
418951703,00044,41895170300044,O,2015-07-01,,,,2019-11-14T14:00:15,false,2,LES TRUCHETS,,,,LE CHATEAU,05200,PUY-SANIERES,,,05111,,,,,,,,,,,,,,,,,,,2016-07-24,F,,,,,68.31Z,NAFRev2,N,6.416698,44.548931,0.34,street,Rue Pierre Chaumaure 05200 Puy-Sanières,05111_0220,G,RUE PIERRE CHAUMAURE,
418951703,00051,41895170300051,O,2015-07-01,,,,2019-11-14T14:00:15,true,2,LES TRUCHETS,,,LD,LES BOUTEILS,05200,PUY-SANIERES,,,05111,,,,,,,,,,,,,,,,,,,2016-07-24,A,,,,,68.31Z,NAFRev2,N,6.428321,44.562725,0.3,locality,Les Clauseards et Chp Cons 05200 Puy-Sanières,05111_b024,G,LES CLAUSEARDS ET CHP CONS,
421147836,00025,42114783600025,O,2005-05-01,NN,,,2019-11-14T14:00:15,true,2,,,,,LES BOUTEILS,05200,PUY-SANIERES,,,05111,,,,,,,,,,,,,,,,,,,2008-01-01,A,,,,,01.11Z,NAFRev2,N,6.428321,44.562725,0.3,locality,Les Clauseards et Chp Cons 05200 Puy-Sanières,05111_b024,G,LES CLAUSEARDS ET CHP CONS,
423126721,00012,42312672100012,O,1998-02-07,NN,,,2019-11-14T14:00:15,true,4,RESIDENCE ST ROCH,,,,LES CHAMOIS,05200,PUY-SANIERES,,,05111,,,,,,,,,,,,,,,,,,,2008-01-01,F,,,,,68.20B,NAFRev2,N,6.428321,44.562725,0.47,locality,Les Clauseards et Chp Cons 05200 Puy-Sanières,05111_b024,G,LES CLAUSEARDS ET CHP CONS,
423183763,00030,42318376300030,O,2003-06-01,NN,,,2019-11-14T14:00:15,true,3,,,,,LE SERRE,05200,PUY-SANIERES,,,05111,,,,,,,,,,,,,,,,,,,2008-01-01,A,,,,,85.51Z,NAFRev2,N,6.419845,44.547053,0.6,street,Rue du Serre Lombard 05200 Puy-Sanières,05111_0420,G,RUE DU SERRE LOMBARD,
423502384,00039,42350238400039,O,2005-07-01,NN,,,2019-11-14T14:00:15,true,3,,,,RTE,DE CHADENAS,05200,PUY-SANIERES,,,05111,,,,,,,,,,,,,,,,,,,2010-04-23,F,,,,,93.29Z,NAFRev2,O,,,0,,,,,,
424207090,00020,42420709000020,O,2010-10-26,,,,2019-11-14T14:00:15,false,2,HAMEAU DES BOUTEILS,,,,"BAS VIGNET, HAMEAU DES BOUTEILS",05200,PUY-SANIERES,,,05111,,,,,,,,,,,,,,,,,,,2011-02-20,F,,,,,47.59A,NAFRev2,N,6.433077,44.556944,0.38,locality,Bas Vignets 05200 Puy-Sanières,05111_b102,G,BAS VIGNETS,
424509966,00026,42450996600026,O,1996-10-29,NN,,,2019-11-14T14:00:15,false,3,,,,RES,,05200,PUY-SANIERES,,,05111,,,,,,,,,,,,,,,,,,,2001-12-31,F,,,,,70.2A,NAF1993,N,6.421433,44.548292,0.63,municipality,Puy-Sanières,05111,G,PUY SANIERES,
424948776,00010,42494877600010,O,1984-01-01,NN,,,2019-11-14T14:00:15,true,4,,,,,LE PIBOU BAS,05200,PUY-SANIERES,,,05111,,,,,,,,,,,,,,,,,,,2011-12-25,F,,,,,94.91Z,NAFRev2,N,6.417842,44.546632,0.93,street,Le Pibou Bas 05200 Puy-Sanières,05111_b112,G,LE PIBOU BAS,
430007567,00018,43000756700018,O,2000-04-01,NN,,,2019-11-14T14:00:15,false,4,LES TRUCHETS,,,,,05200,PUY-SANIERES,,,05111,,,,,,,,,,,,,,,,,,,2001-03-27,F,,,,,45.2V,NAF1993,N,6.428321,44.562725,0.3,locality,Les Clauseards et Chp Cons 05200 Puy-Sanières,05111_b024,D,LES CLAUSEARDS ET CHP CONS,
431653088,00010,43165308800010,O,2000-03-21,NN,,,2019-11-14T14:00:15,true,4,LES TRUCHETS,,,,,05200,PUY-SANIERES,,,05111,,,,,,,,,,,,,,,,,,,2008-01-01,A,,,,,81.30Z,NAFRev2,N,6.428321,44.562725,0.3,locality,Les Clauseards et Chp Cons 05200 Puy-Sanières,05111_b024,D,LES CLAUSEARDS ET CHP CONS,
432113306,00018,43211330600018,O,2000-07-03,NN,,,2019-11-14T14:00:15,false,4,,,,,LE PIBOU HAUT,05200,PUY-SANIERES,,,05111,,,,,,,,,,,,,,,,,,,2008-04-30,F,,,,,02.20Z,NAFRev2,N,6.420915,44.548016,0.77,street,Lieu Dit le Haut Pibou 05200 Puy-Sanières,05111_b108,G,LIEU DIT LE HAUT PIBOU,
432113306,00026,43211330600026,O,2006-05-01,,,,2019-11-14T14:00:15,false,3,LE PIBOU HAUT,7,,IMP,DES HERMES,05200,PUY-SANIERES,,,05111,,,,,,,,,,,,,,,,,,,2008-04-30,F,,,,,01.49Z,NAFRev2,N,6.420915,44.548016,0.4,street,Lieu Dit le Haut Pibou 05200 Puy-Sanières,05111_b108,D,LIEU DIT LE HAUT PIBOU,
432113306,00034,43211330600034,O,2013-04-03,,,1610AQ,2019-11-14T14:00:15,true,4,,,,,LES BOUTEILS,05200,PUY-SANIERES,,,05111,,,,,,,,,,,,,,,,,,,2019-09-02,A,SCIERIE MOBILE SYLVAIN IMBERT,,,SCIERIE MOBILE SYLVAIN IMBERT,16.10A,NAFRev2,O,6.428321,44.562725,0.3,locality,Les Clauseards et Chp Cons 05200 Puy-Sanières,05111_b024,G,LES CLAUSEARDS ET CHP CONS,
434263760,00036,43426376000036,O,2005-06-01,,,,2019-11-14T14:00:15,false,3,,28,,RUE,DU PONT GUILLAUME,05200,PUY-SANIERES,,,05111,,,,,,,,,,,,,,,,,,,2008-01-01,F,,,,,71.11Z,NAFRev2,N,6.422737,44.548042,0.83,housenumber,28 Rue du Mont Guillaume 05200 Puy-Sanières,05111_afwmew_00028,G,28 RUE DU MONT GUILLAUME,
441332277,00017,44133227700017,O,2002-03-01,NN,,,2019-11-14T14:00:15,false,4,,,,LOT,LE PIBOU,05200,PUY-SANIERES,,,05111,,,,,,,,,,,,,,,,,,,2009-01-02,F,,,,,68.20A,NAFRev2,N,6.420915,44.548016,0.64,street,Lieu Dit le Haut Pibou 05200 Puy-Sanières,05111_b108,G,LIEU DIT LE HAUT PIBOU,
442796512,00014,44279651200014,O,2002-07-01,NN,,,2019-11-14T14:00:15,false,6,,,,,LE SERRE,05200,PUY-SANIERES,,,05111,,,,,,,,,,,,,,,,,,,2011-01-01,F,,,,,66.19A,NAFRev2,O,6.419845,44.547053,0.6,street,Rue du Serre Lombard 05200 Puy-Sanières,05111_0420,G,RUE DU SERRE LOMBARD,
444022313,00027,44402231300027,O,2008-05-01,NN,,7420ZR,2019-11-14T14:00:15,true,2,,,,,LES BOUTEILS,05200,PUY-SANIERES,,,05111,,,,,,,,,,,,,,,,,,,2008-07-01,A,L'OEIL DE GAIA,,,,74.20Z,NAFRev2,O,6.428321,44.562725,0.3,locality,Les Clauseards et Chp Cons 05200 Puy-Sanières,05111_b024,G,LES CLAUSEARDS ET CHP CONS,
445005796,00013,44500579600013,O,2002-10-01,NN,,,2019-11-14T14:00:15,true,3,,,,,MAIRIE,05200,PUY-SANIERES,,,05111,,,,,,,,,,,,,,,,,,,2008-01-01,A,,,,,85.59B,NAFRev2,O,3.0709671,50.6304695,0.92,poi.townhall,Hôtel de Ville Lille,https://osm.org/way/40917078,G,,
448687558,00016,44868755800016,O,1989-08-07,NN,,,2019-11-14T14:00:15,true,3,MME AGNES GROSJEAN,,,,LES TRUCHETS,05200,PUY-SANIERES,,,05111,,,,,,,,,,,,,,,,,,,2008-01-01,A,,,,,93.12Z,NAFRev2,N,6.428321,44.562725,0.3,locality,Les Clauseards et Chp Cons 05200 Puy-Sanières,05111_b024,G,LES CLAUSEARDS ET CHP CONS,
448858589,00048,44885858900048,O,2015-09-01,,,2341ZZ,2019-11-14T14:00:15,true,2,,,,,LES TRUCHETS,05200,PUY-SANIERES,,,05111,,,,,,,,,,,,,,,,,,,2016-12-31,F,,,,,23.41Z,NAFRev2,N,6.428321,44.562725,0.3,locality,Les Clauseards et Chp Cons 05200 Puy-Sanières,05111_b024,G,LES CLAUSEARDS ET CHP CONS,
449761543,00015,44976154300015,O,2003-09-01,NN,,,2019-11-14T14:00:15,false,3,,,,HAM,LE SERRE,05200,PUY-SANIERES,,,05111,,,,,,,,,,,,,,,,,,,2004-04-01,F,,,,,85.1G,NAFRev1,N,6.419845,44.547053,0.6,street,Rue du Serre Lombard 05200 Puy-Sanières,05111_0420,G,RUE DU SERRE LOMBARD,
450570361,00029,45057036100029,O,2008-10-12,,,,2019-11-14T14:00:15,false,2,,2,,RUE,DE L'ORNE,05200,PUY-SANIERES,,,05111,,,,,,,,,,,,,,,,,,,2016-11-20,F,,,,,68.20B,NAFRev2,N,6.426505,44.549448,0.76,housenumber,2 Rue de l'Orme 05200 Puy-Sanières,05111_0180_00002,G,2 RUE DE L ORME,
451364368,00014,45136436800014,O,2004-01-02,NN,,,2019-11-14T14:00:15,true,5,,,,,LE SERRE,05200,PUY-SANIERES,,,05111,,,,,,,,,,,,,,,,,,,2010-01-01,F,,,,,96.09Z,NAFRev2,O,6.419845,44.547053,0.6,street,Rue du Serre Lombard 05200 Puy-Sanières,05111_0420,G,RUE DU SERRE LOMBARD,
451618870,00047,45161887000047,O,2014-05-02,,,,2019-11-14T14:00:15,false,2,LE CHATEAU,,,,LIEUDIT LES TRUCHETS,05200,PUY-SANIERES,,,05111,,,,,,,,,,,,,,,,,,,2015-09-19,F,,,,,43.31Z,NAFRev2,N,6.428321,44.562725,0.3,locality,Les Clauseards et Chp Cons 05200 Puy-Sanières,05111_b024,G,LES CLAUSEARDS ET CHP CONS,
452031644,00019,45203164400019,O,2004-02-06,NN,,,2019-11-14T14:00:15,false,3,,,,,LIEUDIT LES BOUTEILS,05200,PUY-SANIERES,,,05111,,,,,,,,,,,,,,,,,,,2006-02-01,F,,,,,74.6Z,NAFRev1,O,6.428321,44.562725,0.3,locality,Les Clauseards et Chp Cons 05200 Puy-Sanières,05111_b024,G,LES CLAUSEARDS ET CHP CONS,
480251818,00021,48025181800021,O,2008-01-01,,,,2019-11-14T14:00:15,true,1,LE FOREST,,,,LE FOREST,05200,PUY-SANIERES,,,05111,,,,,,,,,,,,,,,,,,,2008-01-01,A,,,,,01.11Z,NAFRev2,N,6.458984,44.546272,0.54,locality,Le Lac Est 05200 Puy-Sanières,05111_b109,G,LE LAC EST,
481042331,00035,48104233100035,O,2020-02-16,,,1629ZA,2020-04-10T03:48:33,true,1,LE SERRE,,,IMP,DU SERRE,05200,PUY-SANIERES,,,05111,,,,,,,,,,,,,,,,,,,2020-02-16,A,DU BOUT DES BOIS,,,,16.29Z,NAFRev2,N,6.419845,44.547053,0.63,street,Rue du Serre Lombard 05200 Puy-Sanières,05111_0420,G,RUE DU SERRE LOMBARD,
482209764,00018,48220976400018,O,2005-04-11,,,,2019-11-14T14:00:15,false,3,,,,,LIEU DIT LE SERRE,05200,PUY-SANIERES,,,05111,,,,,,,,,,,,,,,,,,,2010-01-01,F,,,,,85.51Z,NAFRev2,N,6.419845,44.547053,0.6,street,Rue du Serre Lombard 05200 Puy-Sanières,05111_0420,G,RUE DU SERRE LOMBARD,
483431961,00018,48343196100018,O,1994-01-01,,,,2019-11-14T14:00:15,true,4,,,,,LES BOUTEILS,05200,PUY-SANIERES,,,05111,,,,,,,,,,,,,,,,,,,2008-12-25,F,,,,,01.45Z,NAFRev2,N,6.428321,44.562725,0.3,locality,Les Clauseards et Chp Cons 05200 Puy-Sanières,05111_b024,G,LES CLAUSEARDS ET CHP CONS,
483799193,00022,48379919300022,O,2013-10-22,,,,2019-11-14T14:00:15,true,1,,,,,LES BOUTEILS,05200,PUY-SANIERES,,,05111,,,,,,,,,,,,,,,,,,,2013-10-22,A,,,,,93.19Z,NAFRev2,N,6.428321,44.562725,0.3,locality,Les Clauseards et Chp Cons 05200 Puy-Sanières,05111_b024,G,LES CLAUSEARDS ET CHP CONS,
484360268,00011,48436026800011,O,2005-09-01,NN,,,2019-11-14T14:00:15,false,4,,,,,LES BOUTEILS,05200,PUY-SANIERES,,,05111,,,,,,,,,,,,,,,,,,,2010-01-01,F,,,,,43.99C,NAFRev2,O,6.428321,44.562725,0.3,locality,Les Clauseards et Chp Cons 05200 Puy-Sanières,05111_b024,G,LES CLAUSEARDS ET CHP CONS,
485067532,00013,48506753200013,O,2005-10-01,NN,,,2019-11-14T14:00:15,true,2,,,,,MAIRIE,05200,PUY-SANIERES,,,05111,,,,,,,,,,,,,,,,,,,2008-01-01,A,,,,,90.01Z,NAFRev2,O,3.0709671,50.6304695,0.92,poi.townhall,Hôtel de Ville Lille,https://osm.org/way/40917078,G,,
498554856,00019,49855485600019,O,2007-06-01,02,2018,4120BA,2020-08-25T10:43:05,true,4,,,,,LE SERRE,05200,PUY-SANIERES,,,05111,,,,,,,,,,,,,,,,,,,2013-03-15,A,,,,,43.91A,NAFRev2,O,6.419845,44.547053,0.6,street,Rue du Serre Lombard 05200 Puy-Sanières,05111_0420,G,RUE DU SERRE LOMBARD,
499356962,00047,49935696200047,O,2020-06-25,,,,2020-07-23T08:32:39,true,1,LE BERCAIL,,,,COTE CLAVELLE,05200,PUY-SANIERES,,,05111,,,,,,,,,,,,,,,,,,,2020-06-25,A,,,,,71.12B,NAFRev2,N,6.436161,44.554813,0.74,locality,Côtes Clavelles 05200 Puy-Sanières,05111_b039,G,COTES CLAVELLES,
504200247,00014,50420024700014,O,2008-05-01,,,,2020-02-04T16:16:55,true,1,LES BOUTEILS,,,LD,LES BOUTEILS,05200,PUY-SANIERES,,,05111,,,,,,,,,,,,,,,,,,,2008-05-01,A,,,,,01.45Z,NAFRev2,N,6.428321,44.562725,0.3,locality,Les Clauseards et Chp Cons 05200 Puy-Sanières,05111_b024,G,LES CLAUSEARDS ET CHP CONS,
507786804,00017,50778680400017,O,2005-04-18,,,,2019-11-14T14:00:15,true,3,LOT LE HAUT PIBOU,2,,RUE,DE LA PIERRE BLANCHE,05200,PUY-SANIERES,,,05111,,,,,,,,,,,,,,,,,,,2010-04-18,F,,,,,94.99Z,NAFRev2,O,6.423789,44.548408,0.93,housenumber,2 Rue de la Pierre Blanche 05200 Puy-Sanières,05111_0070_00002,G,2 RUE DE LA PIERRE BLANCHE,
508728268,00022,50872826800022,O,2015-09-15,,,,2020-06-18T12:18:28,false,2,,,,,LIEU-DIT LES TRUCHETS,05200,PUY-SANIERES,,,05111,,,,,,,,,,,,,,,,,,,2020-05-01,F,,,,,85.51Z,NAFRev2,N,6.428321,44.562725,0.3,locality,Les Clauseards et Chp Cons 05200 Puy-Sanières,05111_b024,G,LES CLAUSEARDS ET CHP CONS,
509513719,00021,50951371900021,O,2012-09-10,,,,2019-11-14T14:00:15,true,1,,,,,LIEU DIT LE CERRE,05200,PUY-SANIERES,,,05111,,,,,,,,,,,,,,,,,,,2012-09-10,F,,,,,47.91A,NAFRev2,N,6.419845,44.547053,0.4,street,Rue du Serre Lombard 05200 Puy-Sanières,05111_0420,G,RUE DU SERRE LOMBARD,
510667470,00023,51066747000023,O,2010-10-01,,,,2019-11-14T14:00:15,false,2,,,,,HAMEAU LE SERRE,05200,PUY-SANIERES,,,05111,,,,,,,,,,,,,,,,,,,2011-09-30,F,,,,,85.51Z,NAFRev2,N,6.419845,44.547053,0.36,street,Rue du Serre Lombard 05200 Puy-Sanières,05111_0420,G,RUE DU SERRE LOMBARD,
511795296,00017,51179529600017,O,2009-04-14,,,,2019-11-14T14:00:15,false,2,LE SERRE,,,,LES RESIDENCES DU FAUCON,05200,PUY-SANIERES,,,05111,,,,,,,,,,,,,,,,,,,2012-12-05,F,,,,,43.21A,NAFRev2,N,,,0,,,,,,
512290172,00018,51229017200018,O,2009-05-11,,,9524ZZ,2019-11-14T14:00:15,true,3,,,,,LES BOUTEILS,05200,PUY-SANIERES,,,05111,,,,,,,,,,,,,,,,,,,2017-03-31,F,,,,,27.40Z,NAFRev2,N,6.428321,44.562725,0.3,locality,Les Clauseards et Chp Cons 05200 Puy-Sanières,05111_b024,G,LES CLAUSEARDS ET CHP CONS,
514646496,00018,51464649600018,O,2009-09-03,,,,2019-11-14T14:00:15,true,2,LE RESSOUST,,,,LE SERRE,05200,PUY-SANIERES,,,05111,,,,,,,,,,,,,,,,,,,2011-04-30,F,PROSERV05,,,,46.19B,NAFRev2,N,6.419845,44.547053,0.6,street,Rue du Serre Lombard 05200 Puy-Sanières,05111_0420,G,RUE DU SERRE LOMBARD,
519373344,00018,51937334400018,O,2009-12-29,,,,2019-11-14T14:00:15,true,2,,16,,IMP,PIERRE CHAUMAURE,05200,PUY-SANIERES,,,05111,,,,,,,,,,,,,,,,,,,2010-12-31,F,SUD ALP'ETUDES,,,,74.90A,NAFRev2,N,6.416258,44.549649,0.75,housenumber,16 Pierre Chaumaure 05200 Puy-Sanières,05111_b114_00016,G,16 PIERRE CHAUMAURE,
522701291,00018,52270129100018,O,2010-05-25,,,,2019-11-14T14:00:15,true,2,CHEZ PHIL BOHN,,,,LES TRUCHETS,05200,PUY-SANIERES,,,05111,,,,,,,,,,,,,,,,,,,2012-07-01,F,,,,,82.19Z,NAFRev2,N,6.428321,44.562725,0.3,locality,Les Clauseards et Chp Cons 05200 Puy-Sanières,05111_b024,G,LES CLAUSEARDS ET CHP CONS,