siren,nic,siret,statutDiffusionEtablissement,dateCreationEtablissement,trancheEffectifsEtablissement,anneeEffectifsEtablissement,activitePrincipaleRegistreMetiersEtablissement,dateDernierTraitementEtablissement,etablissementSiege,nombrePeriodesEtablissement,complementAdresseEtablissement,numeroVoieEtablissement,indiceRepetitionEtablissement,typeVoieEtablissement,libelleVoieEtablissement,codePostalEtablissement,libelleCommuneEtablissement,libelleCommuneEtrangerEtablissement,distributionSpecialeEtablissement,codeCommuneEtablissement,codeCedexEtablissement,libelleCedexEtablissement,codePaysEtrangerEtablissement,libellePaysEtrangerEtablissement,complementAdresse2Etablissement,numeroVoie2Etablissement,indiceRepetition2Etablissement,typeVoie2Etablissement,libelleVoie2Etablissement,codePostal2Etablissement,libelleCommune2Etablissement,libelleCommuneEtranger2Etablissement,distributionSpeciale2Etablissement,codeCommune2Etablissement,codeCedex2Etablissement,libelleCedex2Etablissement,codePaysEtranger2Etablissement,libellePaysEtranger2Etablissement,dateDebut,etatAdministratifEtablissement,enseigne1Etablissement,enseigne2Etablissement,enseigne3Etablissement,denominationUsuelleEtablissement,activitePrincipaleEtablissement,nomenclatureActivitePrincipaleEtablissement,caractereEmployeurEtablissement,longitude,latitude,geo_score,geo_type,geo_adresse,geo_id,geo_ligne,geo_l4,geo_l5
210700365,00013,21070036500013,O,1983-03-01,02,2018,,2020-08-25T10:15:36,true,4,HOTEL DE VILLE,,,,,07340,BOGY,,,07036,,,,,,,,,,,,,,,,,,,2008-01-01,A,MAIRIE,,,,84.11Z,NAFRev2,O,,,0,,,,,,
210700365,00021,21070036500021,O,1983-12-21,01,2018,,2020-08-25T10:15:36,false,3,,,,,,07340,BOGY,,,07036,,,,,,,,,,,,,,,,,,,2008-01-01,A,ECOLE MATERNELLE PUBLIQUE,,,,85.20Z,NAFRev2,N,,,0,,,,,,
210700365,00039,21070036500039,O,1998-01-01,NN,,,2018-06-26T15:56:19,false,4,MAIRIE,,,,,07340,BOGY,,,07036,,,,,,,,,,,,,,,,,,,2017-12-31,F,SERVICE ASSAINISSEMENT,,,,37.00Z,NAFRev2,N,,,0,,,,,,
260701503,00013,26070150300013,O,1992-01-01,NN,,,2016-11-20T14:08:59,true,4,,,,,MAIRIE,07340,BOGY,,,07036,,,,,,,,,,,,,,,,,,,2016-01-01,F,CCAS,,,,88.99B,NAFRev2,N,3.0709671,50.6304695,0.92,poi.townhall,Hôtel de Ville Lille,https://osm.org/way/40917078,G,,
260703830,00018,26070383000018,O,1991-01-01,NN,,,2009-04-15T15:30:31,true,4,,,,,MAIRIE,07340,BOGY,,,07036,,,,,,,,,,,,,,,,,,,2008-12-31,F,CDE,,,,88.99B,NAFRev2,N,3.0709671,50.6304695,0.92,poi.townhall,Hôtel de Ville Lille,https://osm.org/way/40917078,G,,
314617713,00040,31461771300040,O,,NN,,,,true,1,,,,CHE,DE LA VERONIQUE,07340,BOGY,,,07036,,,,,,,,,,,,,,,,,,,1987-03-30,F,,,,,84.12,NAP,N,4.762299,45.268616,0.65,street,Chemin de Véronique 07340 Bogy,07036_0100,G,CHEMIN DE VERONIQUE,
316501253,00017,31650125300017,O,,,,,,true,1,,,,,QUARTIER ROYAL,07340,BOGY,,,07036,,,,,,,,,,,,,,,,,,,1984-12-25,F,,,,,01.00,NAP,N,4.814575,46.794093,0.83,poi.community_centre,Salle des Fêtes de Châtenoy-Le-Royal Châtenoy-le-Royal,https://osm.org/way/126370203,G,,
322605163,00011,32260516300011,O,,NN,,,,true,1,,,,,,07340,BOGY,,,07036,,,,,,,,,,,,,,,,,,,,F,,,,,67.01,NAP,N,,,0,,,,,,
330006644,00018,33000664400018,O,1984-03-01,NN,,4399CZ,2015-03-18T01:01:41,true,6,,,,LD,LE LAC,07340,BOGY,,,07036,,,,,,,,,,,,,,,,,,,2008-12-31,F,,,,,43.99C,NAFRev2,N,4.759882,45.283078,0.51,street,Place de la Liberte 07340 Bogy,07036_0060,G,PLACE DE LA LIBERTE,
334101540,00014,33410154000014,O,1985-11-26,NN,,,,true,1,,,,,LE VILLAGE,07340,BOGY,,,07036,,,,,,,,,,,,,,,,,,,2001-09-30,F,,,,,45.2V,NAF1993,O,4.762486,45.282116,0.34,street,Le Vernas 07340 Bogy,07036_oh57vt,G,LE VERNAS,
334672714,00014,33467271400014,O,1986-01-01,NN,,,2012-05-27T05:10:13,true,4,,,,,,07340,BOGY,,,07036,,,,,,,,,,,,,,,,,,,2012-06-01,A,,,,,68.20B,NAFRev2,N,,,0,,,,,,
340737873,00018,34073787300018,O,1986-08-20,01,2018,,2020-08-25T10:39:29,true,4,,,,,BAYARD,07340,BOGY,,,07036,,,,,,,,,,,,,,,,,,,2012-12-31,A,,,,,01.24Z,NAFRev2,O,4.756236,45.27429,0.93,street,Bayard 07340 Bogy,07036_97mebc,G,BAYARD,
341727717,00025,34172771700025,O,1991-04-03,NN,,,2008-01-04T21:55:38,true,5,,,,,HAMEAU DE CHARBIEUX,07340,BOGY,,,07036,,,,,,,,,,,,,,,,,,,2008-01-01,A,,,,,87.90B,NAFRev2,N,4.762042,45.282215,0.61,street,Route de Charbieux 07340 Bogy,07036_0033,G,ROUTE DE CHARBIEUX,
342898038,00019,34289803800019,O,1987-01-10,NN,,,,true,1,,,,,,07340,BOGY,,,07036,,,,,,,,,,,,,,,,,,,2002-09-18,F,,,,,01.1A,NAF1993,N,,,0,,,,,,
344670104,00035,34467010400035,O,1997-04-15,NN,,,2008-01-04T22:31:04,true,5,LES GUNCHES,,,CHE,DE LA VERONIQUE,07340,BOGY,,,07036,,,,,,,,,,,,,,,,,,,2008-01-01,A,,,,,90.01Z,NAFRev2,N,4.762299,45.268616,0.65,street,Chemin de Véronique 07340 Bogy,07036_0100,G,CHEMIN DE VERONIQUE,
344670104,00043,34467010400043,O,2015-09-01,,,,2016-05-31T09:12:10,false,1,,260,,CHE,DE VERONIQUE,07340,BOGY,,,07036,,,,,,,,,,,,,,,,,,,2015-09-01,A,,,,,68.20A,NAFRev2,N,4.762299,45.268616,0.85,housenumber,260 Chemin de Véronique 07340 Bogy,07036_0100_00260,G,260 CHEMIN DE VERONIQUE,
348175571,00010,34817557100010,O,1988-03-01,NN,,,2007-01-18T09:26:11,true,3,,,,,LE CHATAIGNIER,07340,BOGY,,,07036,,,,,,,,,,,,,,,,,,,2003-12-31,F,,,,,01.1A,NAFRev1,N,4.764898,45.275885,0.32,street,Chemin de Chante Merle 07340 Bogy,07036_0032,G,CHEMIN DE CHANTE MERLE,
387866411,00011,38786641100011,O,1992-05-19,NN,,,2020-09-22T13:29:49,true,4,,,,,BRAD,07340,BOGY,,,07036,,,,,,,,,,,,,,,,,,,2020-09-21,F,,,,,68.20A,NAFRev2,N,3.0465179,50.6150381,0.88,poi.hardware,Brad'Eco (Quincaillerie) Lille,https://osm.org/node/2096374526,G,,
388117715,00044,38811771500044,O,1998-01-01,,,,,false,3,MR EVERS GERARD,,,,LES DORELS,07340,BOGY,,,07036,,,,,,,,,,,,,,,,,,,1998-12-29,F,STE HEALTHDYNE IN,,,,74.8K,NAF1993,N,4.762025,45.284844,0.35,street,Les Pras 07340 Bogy,07036_u6f0x0,G,LES PRAS,
390814721,00010,39081472100010,O,1992-01-01,NN,,,2018-09-29T12:18:27,true,3,,,,,CHARBIEUX,07340,BOGY,,,07036,,,,,,,,,,,,,,,,,,,2008-01-01,A,,,,,01.24Z,NAFRev2,N,4.762042,45.282215,0.91,street,Route de Charbieux 07340 Bogy,07036_0033,G,ROUTE DE CHARBIEUX,
392996369,00014,39299636900014,O,1993-11-01,NN,,,2017-05-04T04:00:04,true,3,,,,,LA VERNAS,07340,BOGY,,,07036,,,,,,,,,,,,,,,,,,,2008-01-01,A,,,,,01.24Z,NAFRev2,N,4.762488,45.282118,0.91,street,Chemin de la Vernas 07340 Bogy,07036_0099,G,CHEMIN DE LA VERNAS,
395300346,00016,39530034600016,O,1994-01-01,NN,,,2018-09-29T12:23:20,true,3,,5,,RUE,DES DEUX EGLISES,07340,BOGY,,,07036,,,,,,,,,,,,,,,,,,,2008-01-01,A,,,,,01.24Z,NAFRev2,N,4.760634,45.28304,0.73,housenumber,5 Rue des 2 Eglises 07340 Bogy,07036_0068_00005,G,5 RUE DES 2 EGLISES,
398437509,00019,39843750900019,O,1994-10-03,01,2018,4399CZ,2020-08-25T10:30:56,true,7,CHABRIEUX,194,,RTE,DE LA VALLEE,07340,BOGY,,,07036,,,,,,,,,,,,,,,,,,,2019-06-20,A,,,,,43.99C,NAFRev2,N,4.781714,45.284462,0.85,housenumber,194 Route de la Vallée 07340 Bogy,07036_0098_00194,G,194 ROUTE DE LA VALLEE,
399710433,00018,39971043300018,O,1984-06-01,NN,,,2016-03-15T03:26:55,true,4,,,,,CHARBIEUX,07340,BOGY,,,07036,,,,,,,,,,,,,,,,,,,2016-03-31,A,,,,,68.20B,NAFRev2,N,4.762042,45.282215,0.91,street,Route de Charbieux 07340 Bogy,07036_0033,G,ROUTE DE CHARBIEUX,
401347653,00016,40134765300016,O,1995-06-09,NN,,,,true,1,,,,,,07340,BOGY,,,07036,,,,,,,,,,,,,,,,,,,1996-12-20,F,,,,,74.1J,NAF1993,N,,,0,,,,,,
404713539,00017,40471353900017,O,1996-03-26,NN,,,2018-09-29T12:31:42,true,3,,,,QUAI,PIERRE BOUCHET,07340,BOGY,,,07036,,,,,,,,,,,,,,,,,,,2008-01-01,A,,,,,01.13Z,NAFRev2,N,4.752706,45.283913,0.73,locality,Pierre Bouchet 07340 Bogy,07036_b044,G,PIERRE BOUCHET,
407730662,00019,40773066200019,O,1980-01-01,NN,,,2016-05-13T08:55:04,true,5,,4,,,BAYARD LE HAUT,07340,BOGY,,,07036,,,,,,,,,,,,,,,,,,,2016-03-07,A,,,,,01.21Z,NAFRev2,N,4.756236,45.27429,0.49,street,Bayard 07340 Bogy,07036_97mebc,G,BAYARD,
407730670,00012,40773067000012,O,1983-01-01,NN,,,2008-11-04T13:33:58,true,4,CHARBIEUX,,,,,07340,BOGY,,,07036,,,,,,,,,,,,,,,,,,,2009-01-01,A,,,,,01.42Z,NAFRev2,N,4.762042,45.282215,0.91,street,Route de Charbieux 07340 Bogy,07036_0033,D,ROUTE DE CHARBIEUX,
407730688,00014,40773068800014,O,1993-03-01,00,2018,,2020-08-25T10:36:58,true,3,CHARBIEUX,,,,,07340,BOGY,,,07036,,,,,,,,,,,,,,,,,,,2008-01-01,A,,,,,01.24Z,NAFRev2,N,4.762042,45.282215,0.91,street,Route de Charbieux 07340 Bogy,07036_0033,D,ROUTE DE CHARBIEUX,
407730696,00017,40773069600017,O,1984-01-01,NN,,,2005-12-01T06:36:33,true,3,LE VILLAGE,,,,,07340,BOGY,,,07036,,,,,,,,,,,,,,,,,,,2000-11-01,F,,,,,01.1A,NAF1993,N,4.762486,45.282116,0.34,street,Le Vernas 07340 Bogy,07036_oh57vt,D,LE VERNAS,
407730704,00019,40773070400019,O,1994-10-09,NN,,,2012-12-02T05:26:46,true,4,,,,,,07340,BOGY,,,07036,,,,,,,,,,,,,,,,,,,2012-12-31,F,,,,,01.11Z,NAFRev2,N,,,0,,,,,,
408211969,00014,40821196900014,O,1985-04-01,NN,,,2016-04-26T03:50:43,true,3,,,,,LE VILLAGE,07340,BOGY,,,07036,,,,,,,,,,,,,,,,,,,2008-01-01,A,,,,,01.21Z,NAFRev2,N,4.762486,45.282116,0.34,street,Le Vernas 07340 Bogy,07036_oh57vt,G,LE VERNAS,
409850310,00015,40985031000015,O,1996-11-07,NN,,,2008-11-08T01:22:20,false,4,,,,,LE VILLAGE,07340,BOGY,,,07036,,,,,,,,,,,,,,,,,,,2001-06-01,F,,,,,28.5D,NAF1993,N,4.762486,45.282116,0.34,street,Le Vernas 07340 Bogy,07036_oh57vt,G,LE VERNAS,
412198780,00014,41219878000014,O,1980-01-01,NN,,,2006-10-28T04:02:11,true,3,,,,,,07340,BOGY,,,07036,,,,,,,,,,,,,,,,,,,2006-08-31,F,,,,,01.1A,NAFRev1,N,,,0,,,,,,
412198798,00016,41219879800016,O,1980-01-01,NN,,,2013-05-18T04:17:11,true,4,,,,,,07340,BOGY,,,07036,,,,,,,,,,,,,,,,,,,2012-01-31,F,,,,,01.24Z,NAFRev2,N,,,0,,,,,,
412198806,00017,41219880600017,O,1985-04-01,NN,,,2010-01-24T05:41:48,true,5,,,,,BAYARD,07340,BOGY,,,07036,,,,,,,,,,,,,,,,,,,2009-12-31,F,,,,,01.11Z,NAFRev2,N,4.756236,45.27429,0.93,street,Bayard 07340 Bogy,07036_97mebc,G,BAYARD,
419126883,00018,41912688300018,O,1997-01-01,NN,,,2008-11-04T11:54:03,true,4,,,,,CHARBIEUX,07340,BOGY,,,07036,,,,,,,,,,,,,,,,,,,2008-12-31,F,,,,,01.11Z,NAFRev2,N,4.762042,45.282215,0.91,street,Route de Charbieux 07340 Bogy,07036_0033,G,ROUTE DE CHARBIEUX,
421667148,00017,42166714800017,O,1999-01-25,NN,,,,false,4,,,,,CHAMP DE BRAD,07340,BOGY,,,07036,,,,,,,,,,,,,,,,,,,2003-04-02,F,,,,,80.4C,NAFRev1,N,4.755387,45.274507,0.41,street,Château de Bayard 07340 Bogy,07036_jfn1s6,G,CHATEAU DE BAYARD,
422233494,00026,42223349400026,O,1999-01-01,NN,,,,false,4,MR EVERS GERARD,,,,LES DORELS,07340,BOGY,,,07036,,,,,,,,,,,,,,,,,,,2000-06-30,F,,,,,51.4N,NAF1993,O,4.762025,45.284844,0.35,street,Les Pras 07340 Bogy,07036_u6f0x0,G,LES PRAS,
431106442,00012,43110644200012,O,1989-01-01,NN,,,2014-02-25T11:03:06,true,4,,,,,CHARBIEUX,07340,BOGY,,,07036,,,,,,,,,,,,,,,,,,,2014-01-23,F,,,,,01.21Z,NAFRev2,N,4.762042,45.282215,0.91,street,Route de Charbieux 07340 Bogy,07036_0033,G,ROUTE DE CHARBIEUX,
432317006,00018,43231700600018,O,2000-07-10,NN,,,,false,4,,,,,CHAMP DE BRAD,07340,BOGY,,,07036,,,,,,,,,,,,,,,,,,,2003-01-01,F,,,,,74.1C,NAF1993,O,4.755387,45.274507,0.41,street,Château de Bayard 07340 Bogy,07036_jfn1s6,G,CHATEAU DE BAYARD,
433594934,00021,43359493400021,O,2000-07-01,,,,2008-01-04T19:07:12,false,4,MR GERARD EVERS,,,,LES DARELS,07340,BOGY,,,07036,,,,,,,,,,,,,,,,,,,2008-01-01,A,MR GERARD EVERS,,,,32.50A,NAFRev2,N,4.762025,45.284844,0.35,street,Les Pras 07340 Bogy,07036_u6f0x0,G,LES PRAS,
434007936,00017,43400793600017,O,2000-12-26,NN,,,,false,3,,,,,BRAD,07340,BOGY,,,07036,,,,,,,,,,,,,,,,,,,2002-01-01,F,,,,,72.2Z,NAF1993,O,3.0465179,50.6150381,0.88,poi.hardware,Brad'Eco (Quincaillerie) Lille,https://osm.org/node/2096374526,G,,
435060439,00013,43506043900013,O,2001-04-03,NN,,,2012-09-03T08:27:12,true,4,,,,,CHARBIEUX,07340,BOGY,,,07036,,,,,,,,,,,,,,,,,,,2012-07-16,F,,,,,43.32A,NAFRev2,N,4.762042,45.282215,0.91,street,Route de Charbieux 07340 Bogy,07036_0033,G,ROUTE DE CHARBIEUX,
444588123,00018,44458812300018,O,2003-01-06,NN,,4332AA,2015-03-17T01:11:05,true,4,,225,,,RTE DE CHARBIEUX,07340,BOGY,,,07036,,,,,,,,,,,,,,,,,,,2010-09-04,A,,,,GOUDARD SEBASTIEN,43.32A,NAFRev2,N,4.763661,45.283475,0.85,housenumber,225 Route de Charbieux 07340 Bogy,07036_0033_00225,G,225 ROUTE DE CHARBIEUX,
444623383,00015,44462338300015,O,2003-01-01,NN,,,2016-05-13T11:08:06,true,4,BAYARD LE HAUT,,,,,07340,BOGY,,,07036,,,,,,,,,,,,,,,,,,,2016-03-06,F,,,,,01.21Z,NAFRev2,N,4.756236,45.27429,0.49,street,Bayard 07340 Bogy,07036_97mebc,D,BAYARD,
444623854,00015,44462385400015,O,2003-01-01,01,2018,,2020-08-25T10:32:28,true,4,QUARTIER CHARBIEUX,,,QUAI,CHARBIEUX,07340,BOGY,,,07036,,,,,,,,,,,,,,,,,,,2012-12-31,A,,,,,01.21Z,NAFRev2,O,4.762042,45.282215,0.62,street,Route de Charbieux 07340 Bogy,07036_0033,G,ROUTE DE CHARBIEUX,
479594103,00018,47959410300018,O,2004-12-20,NN,,,2008-01-05T04:05:53,true,3,,,,CHE,DE LA VERONIQUE,07340,BOGY,,,07036,,,,,,,,,,,,,,,,,,,2008-01-01,A,,,,,85.59A,NAFRev2,N,4.762299,45.268616,0.65,street,Chemin de Véronique 07340 Bogy,07036_0100,G,CHEMIN DE VERONIQUE,
481282788,00027,48128278800027,O,2007-04-01,,,,2009-08-21T10:55:44,false,3,LOT 1 LES PRES DE LA BOUISSOUNA,,,,LE VILLAGE,07340,BOGY,,,07036,,,,,,,,,,,,,,,,,,,2009-07-01,F,,,,,43.91A,NAFRev2,N,4.762486,45.282116,0.34,street,Le Vernas 07340 Bogy,07036_oh57vt,G,LE VERNAS,
488046236,00011,48804623600011,O,2006-01-01,31,2018,,2020-08-25T10:32:05,true,2,,,,,HAMEAU DE CHARBIEUX,07340,BOGY,,,07036,,,,,,,,,,,,,,,,,,,2008-01-01,A,,,,,88.99B,NAFRev2,O,4.762042,45.282215,0.61,street,Route de Charbieux 07340 Bogy,07036_0033,G,ROUTE DE CHARBIEUX,
491716882,00015,49171688200015,O,2006-09-01,,,,2008-01-05T22:16:16,true,2,,,,,CHARBIEUX,07340,BOGY,,,07036,,,,,,,,,,,,,,,,,,,2008-01-01,A,,,,,68.20B,NAFRev2,N,4.762042,45.282215,0.91,street,Route de Charbieux 07340 Bogy,07036_0033,G,ROUTE DE CHARBIEUX,
494414964,00010,49441496400010,O,2007-01-01,NN,,,2018-01-18T12:07:58,true,2,,182,,RTE,DE CHARBIEUX,07340,BOGY,,,07036,,,,,,,,,,,,,,,,,,,2008-01-01,A,,,,,01.42Z,NAFRev2,N,4.763195,45.283006,0.85,housenumber,182 Route de Charbieux 07340 Bogy,07036_0033_00182,G,182 ROUTE DE CHARBIEUX,
503681918,00028,50368191800028,O,2009-12-28,,,,2013-08-01T19:26:38,true,2,HORS D'AOU COI,140,,RUE,DU PUITS,07340,BOGY,,,07036,,,,,,,,,,,,,,,,,,,2013-08-01,F,,,,,96.02A,NAFRev2,N,4.783136,45.283931,0.78,housenumber,140 Route du Puits 07340 Bogy,07036_0076_00140,G,140 ROUTE DU PUITS,
505186833,00016,50518683300016,O,2008-08-16,NN,,4333ZZ,2015-03-18T00:17:55,true,3,N 8,,,LOT,LES PRES DE LA BOUISSOUNA,07340,BOGY,,,07036,,,,,,,,,,,,,,,,,,,2012-12-12,A,,,,,43.33Z,NAFRev2,N,4.761727,45.281894,0.43,street,La Buissouna 07340 Bogy,07036_8d1xg6,G,LA BUISSOUNA,
505186874,00010,50518687400010,O,2008-07-15,,,9602AB,2016-09-09T04:24:40,true,4,,330,,CHE,DE LA VERNAS,07340,BOGY,,,07036,,,,,,,,,,,,,,,,,,,2016-09-06,A,,,,STYL' FLO,96.02A,NAFRev2,N,4.766155,45.28084,0.85,housenumber,330 Chemin de la Vernas 07340 Bogy,07036_0099_00330,G,330 CHEMIN DE LA VERNAS,
507400976,00019,50740097600019,O,2008-07-14,NN,,,2011-04-23T17:30:48,true,4,,,,,LES DORELS,07340,BOGY,,,07036,,,,,,,,,,,,,,,,,,,2009-10-31,F,ARDIMED,,,,70.22Z,NAFRev2,N,4.762025,45.284844,0.35,street,Les Pras 07340 Bogy,07036_u6f0x0,G,LES PRAS,
508074069,00016,50807406900016,O,2008-09-15,,,,2010-04-08T14:35:14,true,2,,,,,LITTE JOURDE,07340,BOGY,,,07036,,,,,,,,,,,,,,,,,,,2009-12-31,F,,,,,95.11Z,NAFRev2,N,,,0,,,,,,
510327141,00022,51032714100022,O,2010-03-20,,,,2012-11-19T11:43:27,true,2,0,,,,LITTE JOURDE,07340,BOGY,,,07036,,,,,,,,,,,,,,,,,,,2010-08-31,F,,,,,95.11Z,NAFRev2,N,,,0,,,,,,
520996927,00015,52099692700015,O,2010-03-13,,,,2014-08-20T08:07:10,true,3,,6,,RUE,LES PRES DE LA BOUISSOUNA,07340,BOGY,,,07036,,,,,,,,,,,,,,,,,,,2014-07-10,A,,,,,95.11Z,NAFRev2,N,4.762147,45.281278,0.45,housenumber,6 La Buissouna 07340 Bogy,07036_8d1xg6_00006,G,6 LA BUISSOUNA,
527883672,00018,52788367200018,O,2010-10-17,,,5610CR,2020-02-17T19:35:09,true,1,LES JARDINS DE BOGY,78,,CHE,DU SUC DE LA GARDE,07340,BOGY,,,07036,,,,,,,,,,,,,,,,,,,2010-10-17,A,,,,,56.10C,NAFRev2,N,4.758519,45.282546,0.86,housenumber,78 Chemin du Suc de la Garde 07340 Bogy,07036_0087_00078,G,78 CHEMIN DU SUC DE LA GARDE,
530629682,00028,53062968200028,O,2012-01-02,,,,2016-10-28T04:37:43,false,2,LE VILLAGE,,,IMP,DE L'ECOLE,07340,BOGY,,,07036,,,,,,,,,,,,,,,,,,,2016-11-01,F,,,,,86.21Z,NAFRev2,N,4.760185,45.282961,0.81,street,Impasse de l'Ecole 07340 Bogy,07036_0041,G,IMPASSE DE L ECOLE,
531666832,00013,53166683200013,O,2011-05-11,,,,2018-05-03T11:06:46,false,2,CHARBIEUX,,,,COMMUNAUTE EMAUS,07340,BOGY,,,07036,,,,,,,,,,,,,,,,,,,2012-12-31,F,,,,,47.89Z,NAFRev2,N,0.0635148,48.4380439,0.84,poi.charity,communauté Emmaüs (Humanitaire) Alençon,https://osm.org/way/220884043,G,,
535120232,00017,53512023200017,O,2011-08-22,,,,2012-11-21T16:45:49,false,2,CHARBIEU,294,,RTE,DE VALEE,07340,BOGY,,,07036,,,,,,,,,,,,,,,,,,,2012-07-29,F,,,,,94.99Z,NAFRev2,N,4.782426,45.284881,0.72,housenumber,294 Route de la Vallée 07340 Bogy,07036_0098_00294,G,294 ROUTE DE LA VALLEE,
538757162,00010,53875716200010,O,2012-02-01,NN,,,2017-05-04T08:09:35,true,1,,7,,RUE,DE CHAZEL,07340,BOGY,,,07036,,,,,,,,,,,,,,,,,,,2012-02-01,A,,,,,01.24Z,NAFRev2,N,4.761933,45.28358,0.93,housenumber,7 Rue de Chazel 07340 Bogy,07036_0034_00007,G,7 RUE DE CHAZEL,
539114108,00019,53911410800019,O,2012-01-11,,,,2012-11-07T09:14:02,false,2,CHARBIEUX,480,,RTE,DE LA VALLEE,07340,BOGY,,,07036,,,,,,,,,,,,,,,,,,,2012-09-09,F,,,,FORCE BOISSON,46.34Z,NAFRev2,N,4.784378,45.284876,0.85,housenumber,480 Route de la Vallée 07340 Bogy,07036_0098_00480,G,480 ROUTE DE LA VALLEE,
539114108,00035,53911410800035,O,2012-01-01,01,2017,,2019-06-24T13:37:54,true,1,,,,,,07340,BOGY,,,07036,,,,,,,,,,,,,,,,,,,2012-01-01,A,,,,,01.21Z,NAFRev2,N,,,0,,,,,,
751335571,00012,75133557100012,O,2012-04-30,,,,2012-11-09T08:29:19,true,2,,160,,CHE,DU MOULIN,07340,BOGY,,,07036,,,,,,,,,,,,,,,,,,,2012-10-29,F,,,,,62.01Z,NAFRev2,N,4.759485,45.284935,0.83,housenumber,160 Chemin du Moulin 07340 Bogy,07036_0065_00160,G,160 CHEMIN DU MOULIN,
751862723,00010,75186272300010,O,2012-05-01,,,,2016-04-13T03:49:13,true,1,,15,,,LES PRES DE BOUISSOUNA,07340,BOGY,,,07036,,,,,,,,,,,,,,,,,,,2012-05-01,A,,,,,68.20B,NAFRev2,N,4.763081,45.280822,0.47,housenumber,15 La Buissouna 07340 Bogy,07036_8d1xg6_00015,G,15 LA BUISSOUNA,
752015354,00018,75201535400018,O,2012-06-01,NN,,,2018-09-29T13:12:13,true,1,ROYOL CHEMIN DE LA TOUR AUX OISEAUX,,,,,07340,BOGY,,,07036,,,,,,,,,,,,,,,,,,,2012-06-01,A,,,,,01.13Z,NAFRev2,N,4.775997,45.277309,0.79,street,Chemin de la Tour aux Oiseaux 07340 Bogy,07036_0093,D,CHEMIN DE LA TOUR AUX OISEAUX,
776235947,00012,77623594700012,O,1900-01-01,,,,2007-01-18T09:45:23,true,2,,,,LD,BAYARD,07340,BOGY,,,07036,,,,,,,,,,,,,,,,,,,1993-12-25,F,,,,,01.4A,NAF1993,N,4.756236,45.27429,0.93,street,Bayard 07340 Bogy,07036_97mebc,G,BAYARD,
776235970,00014,77623597000014,O,,,,,2006-11-25T22:07:58,true,1,,,,,,07340,BOGY,,,07036,,,,,,,,,,,,,,,,,,,1980-12-25,F,,,,,80.4D,NAF1993,N,,,0,,,,,,
780130944,00017,78013094400017,O,,NN,,,,true,1,,,,,,07340,BOGY,,,07036,,,,,,,,,,,,,,,,,,,1991-04-15,F,,,,,55.60,NAP,N,,,0,,,,,,
790870067,00010,79087006700010,O,2013-02-01,NN,,,2018-09-29T13:25:35,true,2,,64,,CHE,DU MOULIN,07340,BOGY,,,07036,,,,,,,,,,,,,,,,,,,2016-12-31,F,,,,,63.11Z,NAFRev2,O,4.759118,45.28432,0.83,housenumber,64 Chemin du Moulin 07340 Bogy,07036_0065_00064,G,64 CHEMIN DU MOULIN,
793829086,00024,79382908600024,O,2018-03-01,,,9602BB,2019-12-24T11:26:33,false,2,,2,,,MONTEE DU VIOLONISTE,07340,BOGY,,,07036,,,,,,,,,,,,,,,,,,,2019-03-07,F,,,,,96.02B,NAFRev2,N,4.761765,45.283099,0.93,housenumber,2 Montee du Violoniste 07340 Bogy,07036_0101_00002,G,2 MONTEE DU VIOLONISTE,
799262290,00015,79926229000015,O,2013-12-18,,,7420ZR,2020-03-06T03:59:52,true,1,LES AUCHES DE CHARBIEUX,393,,RTE,DE LA VALLEE,07340,BOGY,,,07036,,,,,,,,,,,,,,,,,,,2013-12-18,A,,,,,74.20Z,NAFRev2,N,4.783541,45.285547,0.85,housenumber,393 Route de la Vallée 07340 Bogy,07036_0098_00393,G,393 ROUTE DE LA VALLEE,
803034818,00010,80303481800010,O,2014-07-01,NN,,,2017-05-04T10:09:23,true,1,,,,,,07340,BOGY,,,07036,,,,,,,,,,,,,,,,,,,2014-07-01,A,,,,,01.24Z,NAFRev2,N,,,0,,,,,,
804536365,00013,80453636500013,O,2014-09-09,,,,2014-09-15T06:59:28,true,1,,,,,,07340,BOGY,,,07036,,,,,,,,,,,,,,,,,,,2014-09-09,A,LA BRUYERETTE,,,,01.21Z,NAFRev2,N,,,0,,,,,,
810480012,00014,81048001200014,O,2015-04-04,,,,2016-05-10T04:13:02,false,2,,149,,,CHEMIN DE SIGNALANGE,07340,BOGY,,,07036,,,,,,,,,,,,,,,,,,,2016-01-01,F,,,,,86.90D,NAFRev2,N,4.764272,45.280483,0.9,housenumber,149 Chemin de la Signalange 07340 Bogy,07036_0085_00149,G,149 CHEMIN DE LA SIGNALANGE,
813456241,00013,81345624100013,O,2015-09-01,,,,2015-11-20T14:32:11,true,1,,266,,CHE,DE GUETTE DINA,07340,BOGY,,,07036,,,,,,,,,,,,,,,,,,,2015-09-01,A,,,,,01.21Z,NAFRev2,N,4.76391,45.28627,0.89,housenumber,266 Chemin de Guette Dina 07340 Bogy,07036_0047_00266,G,266 CHEMIN DE GUETTE DINA,
813892718,00012,81389271800012,O,2015-10-01,,,,2015-10-05T11:57:42,true,1,,266,,CHE,DE GUETTE DINA,07340,BOGY,,,07036,,,,,,,,,,,,,,,,,,,2015-10-01,A,,,,,01.21Z,NAFRev2,N,4.76391,45.28627,0.89,housenumber,266 Chemin de Guette Dina 07340 Bogy,07036_0047_00266,G,266 CHEMIN DE GUETTE DINA,
815362900,00012,81536290000012,O,2016-01-18,,,,2019-05-21T15:14:37,false,2,,6,,RUE,DES DEUX EGLISES,07340,BOGY,,,07036,,,,,,,,,,,,,,,,,,,2019-06-01,F,,,,,86.21Z,NAFRev2,N,4.760548,45.282985,0.73,housenumber,6 Rue des 2 Eglises 07340 Bogy,07036_0068_00006,G,6 RUE DES 2 EGLISES,
819197740,00015,81919774000015,O,1995-11-21,,,,2016-03-21T14:41:26,true,1,,217,,CHE,DE LA VERNAS,07340,BOGY,,,07036,,,,,,,,,,,,,,,,,,,1995-11-21,A,,,,,93.12Z,NAFRev2,N,4.764775,45.281778,0.85,housenumber,217 Chemin de la Vernas 07340 Bogy,07036_0099_00217,G,217 CHEMIN DE LA VERNAS,
819725649,00019,81972564900019,O,2016-04-01,NN,,,2018-09-29T14:01:27,true,3,CHEMIN DE MARSEL,,,CHE,MARSEL CHARBRIEUX,07340,BOGY,,,07036,,,,,,,,,,,,,,,,,,,2018-03-31,F,,,,JV CONSULTING SAS,71.12B,NAFRev2,N,4.782041,45.285648,0.46,street,Chemin de Marsel 07340 Bogy,07036_0064,G,CHEMIN DE MARSEL,
821995792,00016,82199579200016,O,1976-01-01,,,,2016-08-11T07:49:48,true,1,,12,,RUE,DES 2 EGLISES,07340,BOGY,,,07036,,,,,,,,,,,,,,,,,,,1976-01-01,A,,,,,01.24Z,NAFRev2,N,4.761242,45.2831,0.93,housenumber,12 Rue des 2 Eglises 07340 Bogy,07036_0068_00012,G,12 RUE DES 2 EGLISES,
822567632,00010,82256763200010,O,2016-08-24,,,,2016-09-19T03:45:30,true,1,,217,,,CHEMIN DE SIGNALANGE,07340,BOGY,,,07036,,,,,,,,,,,,,,,,,,,2016-08-24,A,,,,,68.20B,NAFRev2,N,4.764773,45.28012,0.9,housenumber,217 Chemin de la Signalange 07340 Bogy,07036_0085_00217,G,217 CHEMIN DE LA SIGNALANGE,
824119770,00017,82411977000017,O,2017-01-02,,,8211ZP,2016-12-06T05:04:34,true,1,,30,,IMP,CHANTE ALOUETTE,07340,BOGY,,,07036,,,,,,,,,,,,,,,,,,,2017-01-02,A,,,,DU CLIC @ LA SOURIS,82.19Z,NAFRev2,N,4.759192,45.281427,0.85,housenumber,30 Impasse Chante Alouette 07340 Bogy,07036_0031_00030,G,30 IMPASSE CHANTE ALOUETTE,
824353544,00011,82435354400011,O,2016-12-03,,,,2016-12-15T08:42:40,true,1,,3,,IMP,IMPASE DE L'ECOLE,07340,BOGY,,,07036,,,,,,,,,,,,,,,,,,,2016-12-03,A,,,,,47.99A,NAFRev2,N,4.760318,45.283347,0.81,housenumber,3 Impasse de l'Ecole 07340 Bogy,07036_0041_00003,G,3 IMPASSE DE L ECOLE,
829160662,00013,82916066200013,O,2017-04-17,,,4322AZ,2019-12-06T12:56:01,true,2,,488,,RTE,DE CHARBIEUX,07340,BOGY,,,07036,,,,,,,,,,,,,,,,,,,2019-12-31,F,,,,,43.22A,NAFRev2,N,4.767101,45.283587,0.85,housenumber,488 Route de Charbieux 07340 Bogy,07036_0033_00488,G,488 ROUTE DE CHARBIEUX,
829878081,00019,82987808100019,O,2017-04-20,,,,2017-05-30T10:12:39,true,1,CHARBIEUX,116,,,ROUTE DU PUITS,07340,BOGY,,,07036,,,,,,,,,,,,,,,,,,,2017-04-20,A,,,,,68.20B,NAFRev2,N,4.782965,45.283767,0.93,housenumber,116 Route du Puits 07340 Bogy,07036_0076_00116,G,116 ROUTE DU PUITS,
832347082,00014,83234708200014,O,2017-09-08,,,,2017-10-04T13:57:48,true,1,,6,,,RUE DES DEUX EGLISES,07340,BOGY,,,07036,,,,,,,,,,,,,,,,,,,2017-09-08,A,,,,,68.20B,NAFRev2,N,4.760548,45.282985,0.73,housenumber,6 Rue des 2 Eglises 07340 Bogy,07036_0068_00006,G,6 RUE DES 2 EGLISES,