siren,nic,siret,statutDiffusionEtablissement,dateCreationEtablissement,trancheEffectifsEtablissement,anneeEffectifsEtablissement,activitePrincipaleRegistreMetiersEtablissement,dateDernierTraitementEtablissement,etablissementSiege,nombrePeriodesEtablissement,complementAdresseEtablissement,numeroVoieEtablissement,indiceRepetitionEtablissement,typeVoieEtablissement,libelleVoieEtablissement,codePostalEtablissement,libelleCommuneEtablissement,libelleCommuneEtrangerEtablissement,distributionSpecialeEtablissement,codeCommuneEtablissement,codeCedexEtablissement,libelleCedexEtablissement,codePaysEtrangerEtablissement,libellePaysEtrangerEtablissement,complementAdresse2Etablissement,numeroVoie2Etablissement,indiceRepetition2Etablissement,typeVoie2Etablissement,libelleVoie2Etablissement,codePostal2Etablissement,libelleCommune2Etablissement,libelleCommuneEtranger2Etablissement,distributionSpeciale2Etablissement,codeCommune2Etablissement,codeCedex2Etablissement,libelleCedex2Etablissement,codePaysEtranger2Etablissement,libellePaysEtranger2Etablissement,dateDebut,etatAdministratifEtablissement,enseigne1Etablissement,enseigne2Etablissement,enseigne3Etablissement,denominationUsuelleEtablissement,activitePrincipaleEtablissement,nomenclatureActivitePrincipaleEtablissement,caractereEmployeurEtablissement,longitude,latitude,geo_score,geo_type,geo_adresse,geo_id,geo_ligne,geo_l4,geo_l5
096341565,00016,09634156500016,O,1993-01-01,NN,,,2019-11-14T14:00:41,true,3,,9,,RUE,DE LA COOPERATIVE,51530,BRUGNY-VAUDANCOURT,,,51093,,,,,,,,,,,,,,,,,,,1999-12-31,F,,,,,01.1G,NAF1993,N,3.900835,49.002824,0.94,housenumber,9 Rue de la Coopérative 51530 Brugny-Vaudancourt,51093_0050_00009,G,9 RUE DE LA COOPERATIVE,
096740758,00030,09674075800030,O,1981-06-20,NN,,,2019-11-14T14:00:41,true,1,,3,B,RUE,DE CHAMPAGNE,51530,BRUGNY-VAUDANCOURT,,,51093,,,,,,,,,,,,,,,,,,,2002-05-31,F,,,,,60.2L,NAF1993,O,3.899307,49.002674,0.81,housenumber,3 bis Rue de Champagne 51530 Brugny-Vaudancourt,51093_0020_00003_bis,G,3 BIS RUE DE CHAMPAGNE,
097340764,00048,09734076400048,O,1993-01-01,NN,,,2019-11-14T14:00:41,false,5,,13,,RTE,DE BREUX,51530,BRUGNY-VAUDANCOURT,,,51093,,,,,,,,,,,,,,,,,,,2010-12-31,F,,,,,01.21Z,NAFRev2,N,3.886857,49.002465,0.77,housenumber,13 Rue de Breux 51530 Brugny-Vaudancourt,51093_0010_00013,G,13 RUE DE BREUX,
215100876,00014,21510087600014,O,1983-03-01,02,2018,,2020-08-25T10:17:34,true,4,,,,RUE,DE LA MAIRIE,51530,BRUGNY-VAUDANCOURT,,,51093,,,,,,,,,,,,,,,,,,,2008-01-01,A,MAIRIE,,,,84.11Z,NAFRev2,O,3.886639,48.999856,0.94,street,Rue de la Mairie 51530 Brugny-Vaudancourt,51093_0130,G,RUE DE LA MAIRIE,
215100876,00022,21510087600022,O,1983-12-21,NN,,,2019-11-14T14:00:41,false,4,,,,,,51530,BRUGNY-VAUDANCOURT,,,51093,,,,,,,,,,,,,,,,,,,2001-08-31,F,ECOLE PRIMAIRE PUBLIQUE,,,,80.1Z,NAF1993,N,,,0,,,,,,
215100876,00030,21510087600030,O,1994-12-25,NN,,,2019-11-14T14:00:41,false,3,MAIRIE,,,RUE,DE LA MAIRIE,51530,BRUGNY-VAUDANCOURT,,,51093,,,,,,,,,,,,,,,,,,,2011-01-01,F,SERVICE D'EAU,,,,36.00Z,NAFRev2,N,3.886639,48.999856,0.94,street,Rue de la Mairie 51530 Brugny-Vaudancourt,51093_0130,G,RUE DE LA MAIRIE,
255102261,00013,25510226100013,O,1993-01-20,NN,,,2019-11-14T14:00:41,true,3,MAIRIE,,,RUE,DE LA MAIRIE,51530,BRUGNY-VAUDANCOURT,,,51093,,,,,,,,,,,,,,,,,,,2008-01-01,A,,,,,84.12Z,NAFRev2,N,3.886639,48.999856,0.94,street,Rue de la Mairie 51530 Brugny-Vaudancourt,51093_0130,G,RUE DE LA MAIRIE,
265100859,00015,26510085900015,O,1983-03-01,NN,,,2019-11-14T14:00:41,true,4,MAIRIE,,,RUE,DE LA MAIRIE,51530,BRUGNY-VAUDANCOURT,,,51093,,,,,,,,,,,,,,,,,,,2016-01-01,F,CCAS,,,,88.99B,NAFRev2,N,3.886639,48.999856,0.94,street,Rue de la Mairie 51530 Brugny-Vaudancourt,51093_0130,G,RUE DE LA MAIRIE,
265106203,00010,26510620300010,O,1983-03-01,NN,,,2019-11-14T14:00:41,true,4,,,,,,51530,BRUGNY-VAUDANCOURT,,,51093,,,,,,,,,,,,,,,,,,,1993-12-25,F,CDE,,,,85.3K,NAF1993,N,,,0,,,,,,
302661350,00017,30266135000017,O,1900-01-01,NN,,,2019-11-14T14:00:41,true,3,,8,,RUE,DE LA CLOTERIE,51530,BRUGNY-VAUDANCOURT,,,51093,,,,,,,,,,,,,,,,,,,2008-01-01,A,,,,,01.21Z,NAFRev2,N,3.885078,48.998789,0.94,housenumber,8 Rue de la Cloterie 51530 Brugny-Vaudancourt,51093_0040_00008,G,8 RUE DE LA CLOTERIE,
302683982,00011,30268398200011,O,,,,,2019-11-14T14:00:41,true,1,,3,,RUE,DE CHAMPAGNE,51530,BRUGNY-VAUDANCOURT,,,51093,,,,,,,,,,,,,,,,,,,1997-09-07,F,,,,,01.1G,NAF1993,N,3.899874,49.002764,0.94,housenumber,3 Rue de Champagne 51530 Brugny-Vaudancourt,51093_0020_00003,G,3 RUE DE CHAMPAGNE,
302700323,00017,30270032300017,O,1900-01-01,NN,,,2019-11-14T14:00:41,false,4,,7,,RUE,DE LA GROSSE FERME,51530,BRUGNY-VAUDANCOURT,,,51093,,,,,,,,,,,,,,,,,,,2005-03-10,F,,,,,01.1A,NAFRev1,N,3.884703,48.996921,0.94,housenumber,7 Rue de la Grosse Ferme 51530 Brugny-Vaudancourt,51093_0100_00007,G,7 RUE DE LA GROSSE FERME,
302700323,00025,30270032300025,O,2005-03-10,01,2018,,2020-08-25T10:22:23,true,2,FERME DE LA GRANGE LE COMT,,,,,51530,BRUGNY-VAUDANCOURT,,,51093,,,,,,,,,,,,,,,,,,,2008-01-01,A,,,,,01.11Z,NAFRev2,O,,,0,,,,,,
302715966,00776,30271596600776,O,1987-07-01,01,2018,,2020-08-25T10:22:23,false,4,RUE DE MORANGIS,,,,LE VILLAGE,51530,BRUGNY-VAUDANCOURT,,,51093,,,,,,,,,,,,,,,,,,,2013-12-31,A,,,,,46.21Z,NAFRev2,O,3.87021,48.979914,0.34,locality,La Grange le Comte 51530 Brugny-Vaudancourt,51093_b034,G,LA GRANGE LE COMTE,
307271460,00023,30727146000023,O,1998-09-01,NN,,,2019-11-14T14:00:41,true,3,,,,,,51530,BRUGNY-VAUDANCOURT,,,51093,,,,,,,,,,,,,,,,,,,2008-01-01,A,,,,,01.21Z,NAFRev2,N,,,0,,,,,,
308030402,00017,30803040200017,O,1900-01-01,NN,,,2019-11-14T14:00:41,true,4,,13,,RUE,DE LA COOPERATIVE,51530,BRUGNY-VAUDANCOURT,,,51093,,,,,,,,,,,,,,,,,,,2014-12-31,F,,,,,01.21Z,NAFRev2,N,3.899609,49.002138,0.94,housenumber,13 Rue de la Coopérative 51530 Brugny-Vaudancourt,51093_0050_00013,G,13 RUE DE LA COOPERATIVE,
308935006,00012,30893500600012,O,1900-01-01,NN,,,2019-11-14T14:00:41,true,4,,10,,RUE,DE L EGLISE,51530,BRUGNY-VAUDANCOURT,,,51093,,,,,,,,,,,,,,,,,,,2016-12-31,F,,,,,01.21Z,NAFRev2,N,3.899228,49.002175,0.94,housenumber,10 Rue de l'Eglise 51530 Brugny-Vaudancourt,51093_0070_00010,G,10 RUE DE L EGLISE,
310213566,00014,31021356600014,O,1900-01-01,NN,,,2019-11-14T14:00:41,true,3,,7,,RTE,NATIONALE,51530,BRUGNY-VAUDANCOURT,,,51093,,,,,,,,,,,,,,,,,,,2008-01-01,A,,,,,01.21Z,NAFRev2,N,3.897388,49.002505,0.82,housenumber,7 Route Nationale 51530 Brugny-Vaudancourt,51093_1j4xiu_00007,G,7 ROUTE NATIONALE,
310213566,00022,31021356600022,O,2002-04-12,NN,,,2019-11-14T14:00:41,false,4,,7,,RTE,NATIONALE,51530,BRUGNY-VAUDANCOURT,,,51093,,,,,,,,,,,,,,,,,,,2012-12-31,F,,,,,68.20A,NAFRev2,N,3.897388,49.002505,0.82,housenumber,7 Route Nationale 51530 Brugny-Vaudancourt,51093_1j4xiu_00007,G,7 ROUTE NATIONALE,
311331896,00028,31133189600028,O,1991-01-01,NN,,,2019-11-14T14:00:41,true,3,,,,LD,VILLAGE,51530,BRUGNY-VAUDANCOURT,,,51093,,,,,,,,,,,,,,,,,,,2007-06-30,A,,,,,01.21Z,NAFRev2,N,4.39087,45.4547668,0.89,poi.cafe,Village Café Saint-Étienne,https://osm.org/node/5321738834,G,,
311752729,00013,31175272900013,O,1900-01-01,NN,,,2019-11-14T14:00:41,true,4,,,,,,51530,BRUGNY-VAUDANCOURT,,,51093,,,,,,,,,,,,,,,,,,,2010-12-25,F,,,,,01.21Z,NAFRev2,N,,,0,,,,,,
311880439,00014,31188043900014,O,,NN,,,2019-11-14T14:00:41,true,1,,3,,RUE,DE L EGLISE,51530,BRUGNY-VAUDANCOURT,,,51093,,,,,,,,,,,,,,,,,,,1985-09-16,F,,,,,01.17,NAP,N,3.898178,49.002037,0.94,housenumber,3 Rue de l'Eglise 51530 Brugny-Vaudancourt,51093_0070_00003,G,3 RUE DE L EGLISE,
313359143,00010,31335914300010,O,1978-01-01,NN,,,2019-11-14T14:00:41,true,3,,13,,RUE,DU CHATEAU,51530,BRUGNY-VAUDANCOURT,,,51093,,,,,,,,,,,,,,,,,,,2004-07-31,F,,,,,01.1G,NAFRev1,N,3.88665,48.997902,0.94,housenumber,13 Rue du Château 51530 Brugny-Vaudancourt,51093_0030_00013,G,13 RUE DU CHATEAU,
313716110,00017,31371611000017,O,,NN,,,2019-11-14T14:00:41,true,1,,8,,RUE,D EPERNAY,51530,BRUGNY-VAUDANCOURT,,,51093,,,,,,,,,,,,,,,,,,,1988-12-25,F,,,,,51.10,NAP,N,3.888109,48.999194,0.94,housenumber,8 Rue d'Epernay 51530 Brugny-Vaudancourt,51093_0080_00008,G,8 RUE D EPERNAY,
314060872,00012,31406087200012,O,1978-01-01,NN,,,2019-11-14T14:00:41,true,3,,7,,RUE,DE CHAMPAGNE,51530,BRUGNY-VAUDANCOURT,,,51093,,,,,,,,,,,,,,,,,,,2003-12-31,F,,,,,01.1G,NAFRev1,N,3.898563,49.002478,0.94,housenumber,7 Rue de Champagne 51530 Brugny-Vaudancourt,51093_0020_00007,G,7 RUE DE CHAMPAGNE,
314583873,00414,31458387300414,O,1996-10-14,NN,,,2019-11-14T14:00:41,false,4,,,,,,51530,BRUGNY-VAUDANCOURT,,,51093,,,,,,,,,,,,,,,,,,,2013-03-29,F,,,,,42.11Z,NAFRev2,N,,,0,,,,,,
317629566,00025,31762956600025,O,1984-06-01,NN,,,2019-11-14T14:00:41,true,4,,,,CHE,DU MOULIN,51530,BRUGNY-VAUDANCOURT,,,51093,,,,,,,,,,,,,,,,,,,2016-08-03,F,,,,,93.11Z,NAFRev2,N,3.886795,48.998974,0.35,street,Rue du Château 51530 Brugny-Vaudancourt,51093_0030,G,RUE DU CHATEAU,
327980892,00027,32798089200027,O,1989-11-01,NN,,,2019-11-14T14:00:41,false,8,,1,,RUE,DES CORDONNIERS,51530,BRUGNY-VAUDANCOURT,,,51093,,,,,,,,,,,,,,,,,,,2017-07-01,F,,,,,93.29Z,NAFRev2,N,3.883751,48.9999,0.94,housenumber,1 Rue des Cordonniers 51530 Brugny-Vaudancourt,51093_0060_00001,G,1 RUE DES CORDONNIERS,
330207325,00011,33020732500011,O,1984-07-01,NN,,,2019-11-14T14:00:41,true,3,,,,,,51530,BRUGNY-VAUDANCOURT,,,51093,,,,,,,,,,,,,,,,,,,1996-12-25,F,,,,,01.1A,NAF1993,N,,,0,,,,,,
332584259,00011,33258425900011,O,,NN,,,2019-11-14T14:00:41,true,1,,11,,RUE,DE BREUX,51530,BRUGNY-VAUDANCOURT,,,51093,,,,,,,,,,,,,,,,,,,,F,,,,,77.14,NAP,N,3.887083,49.002204,0.94,housenumber,11 Rue de Breux 51530 Brugny-Vaudancourt,51093_0010_00011,G,11 RUE DE BREUX,
334131273,00016,33413127300016,O,1985-10-31,NN,,,2019-11-14T14:00:41,false,3,,3,,RUE,D EPERNAY,51530,BRUGNY-VAUDANCOURT,,,51093,,,,,,,,,,,,,,,,,,,1994-07-01,F,,,,,70.2A,NAF1993,N,3.889303,48.999452,0.94,housenumber,3 Rue d'Epernay 51530 Brugny-Vaudancourt,51093_0080_00003,G,3 RUE D EPERNAY,
335054946,00017,33505494600017,O,1986-03-01,NN,,,2019-11-14T14:00:41,true,3,,14,,RUE,DE LA CLOTERIE,51530,BRUGNY-VAUDANCOURT,,,51093,,,,,,,,,,,,,,,,,,,2008-01-01,A,,,,,01.21Z,NAFRev2,N,3.884292,48.99762,0.94,housenumber,14 Rue de la Cloterie 51530 Brugny-Vaudancourt,51093_0040_00014,G,14 RUE DE LA CLOTERIE,
340149780,00017,34014978000017,O,1986-12-29,02,2018,4399CZ,2020-08-25T10:39:05,true,6,,,,,PETITE GRANGE LECONTE,51530,BRUGNY-VAUDANCOURT,,,51093,,,,,,,,,,,,,,,,,,,2011-01-07,A,,,,,02.40Z,NAFRev2,N,3.87021,48.979914,0.47,locality,La Grange le Comte 51530 Brugny-Vaudancourt,51093_b034,G,LA GRANGE LE COMTE,
340344944,00012,34034494400012,O,1987-01-01,NN,,,2019-11-14T14:00:41,true,3,,,,,,51530,BRUGNY-VAUDANCOURT,,,51093,,,,,,,,,,,,,,,,,,,2008-01-01,A,,,,,01.21Z,NAFRev2,N,,,0,,,,,,
341366425,00013,34136642500013,O,1987-06-05,NN,,,2019-11-14T14:00:41,true,4,,6,,RUE,D 'EPERNAY,51530,BRUGNY-VAUDANCOURT,,,51093,,,,,,,,,,,,,,,,,,,2009-01-01,F,,,,,01.21Z,NAFRev2,N,3.887806,48.999198,0.94,housenumber,6 Rue d'Epernay 51530 Brugny-Vaudancourt,51093_0080_00006,G,6 RUE D EPERNAY,
343251211,00029,34325121100029,O,2008-12-22,,,,2019-11-14T14:00:41,true,1,,8,,RUE,DE LA LIBERTE,51530,BRUGNY-VAUDANCOURT,,,51093,,,,,,,,,,,,,,,,,,,2008-12-22,A,,,,,68.20A,NAFRev2,N,3.896152,49.002977,0.94,housenumber,8 Rue de la Liberté 51530 Brugny-Vaudancourt,51093_0110_00008,G,8 RUE DE LA LIBERTE,
343480448,00038,34348044800038,O,1994-04-01,NN,,,2019-11-14T14:00:41,true,4,,,,RUE,DES CORDONNIERS,51530,BRUGNY-VAUDANCOURT,,,51093,,,,,,,,,,,,,,,,,,,1996-12-25,F,,,,,51.1G,NAF1993,N,3.883751,48.9999,0.94,street,Rue des Cordonniers 51530 Brugny-Vaudancourt,51093_0060,G,RUE DES CORDONNIERS,
345246359,00011,34524635900011,O,1988-05-10,NN,,,2019-11-14T14:00:41,true,4,,8,,RUE,D'EPERNAY,51530,BRUGNY-VAUDANCOURT,,,51093,,,,,,,,,,,,,,,,,,,2008-02-18,F,,,,,68.20B,NAFRev2,N,3.888109,48.999194,0.94,housenumber,8 Rue d'Epernay 51530 Brugny-Vaudancourt,51093_0080_00008,G,8 RUE D EPERNAY,
348099573,00019,34809957300019,O,1988-01-01,NN,,,2019-11-14T14:00:41,true,3,,3,,RUE,DE L'EGLISE,51530,BRUGNY-VAUDANCOURT,,,51093,,,,,,,,,,,,,,,,,,,2008-01-01,A,,,,,01.21Z,NAFRev2,N,3.898178,49.002037,0.94,housenumber,3 Rue de l'Eglise 51530 Brugny-Vaudancourt,51093_0070_00003,G,3 RUE DE L EGLISE,
348690785,00012,34869078500012,O,1988-11-01,NN,,,2019-11-14T14:00:41,true,3,,5,,RUE,DE BREUX,51530,BRUGNY-VAUDANCOURT,,,51093,,,,,,,,,,,,,,,,,,,2008-01-01,A,,,,,68.20B,NAFRev2,N,3.887553,49.000623,0.94,housenumber,5 Rue de Breux 51530 Brugny-Vaudancourt,51093_0010_00005,G,5 RUE DE BREUX,
349322933,00038,34932293300038,O,1999-01-01,NN,,,2019-11-14T14:00:41,true,3,,,,,,51530,BRUGNY-VAUDANCOURT,,,51093,,,,,,,,,,,,,,,,,,,2008-01-01,A,,,,,01.21Z,NAFRev2,N,,,0,,,,,,
349483982,00030,34948398200030,O,1999-01-01,NN,,,2019-11-14T14:00:41,true,3,,,,,,51530,BRUGNY-VAUDANCOURT,,,51093,,,,,,,,,,,,,,,,,,,2008-01-01,A,,,,,01.21Z,NAFRev2,N,,,0,,,,,,
350953352,00027,35095335200027,O,1990-06-05,NN,,,2019-11-14T14:00:41,true,4,,,,,,51530,BRUGNY-VAUDANCOURT,,,51093,,,,,,,,,,,,,,,,,,,1992-12-25,F,,,,,52.2E,NAF1993,N,,,0,,,,,,
377933734,00024,37793373400024,O,1995-01-01,NN,,,2019-11-14T14:00:41,true,3,,,,RUE,DES PLANTES,51530,BRUGNY-VAUDANCOURT,,,51093,,,,,,,,,,,,,,,,,,,2008-01-01,A,,,,,71.11Z,NAFRev2,N,3.900884,49.003062,0.94,street,Rue des Plantes 51530 Brugny-Vaudancourt,51093_0150,G,RUE DES PLANTES,
378233647,00015,37823364700015,O,1990-06-01,NN,,,2019-11-14T14:00:41,false,3,,,,RUE,DE LA GRANGE,51530,BRUGNY-VAUDANCOURT,,,51093,,,,,,,,,,,,,,,,,,,2004-01-01,F,,,,,52.6E,NAFRev1,N,3.8868,48.999532,0.92,street,Rue de la Grange Jabled 51530 Brugny-Vaudancourt,51093_0090,G,RUE DE LA GRANGE JABLED,
378233647,00023,37823364700023,O,1990-06-01,NN,,,2019-11-14T14:00:41,true,5,,,,RUE,DE LA GRANGE JABLED,51530,BRUGNY-VAUDANCOURT,,,51093,,,,,,,,,,,,,,,,,,,2014-12-28,F,,,,,47.79Z,NAFRev2,N,3.8868,48.999532,0.94,street,Rue de la Grange Jabled 51530 Brugny-Vaudancourt,51093_0090,G,RUE DE LA GRANGE JABLED,
378233647,00031,37823364700031,O,2004-01-01,NN,,,2019-11-14T14:00:41,false,3,,,,RUE,DE LA MAIRIE,51530,BRUGNY-VAUDANCOURT,,,51093,,,,,,,,,,,,,,,,,,,2005-12-31,F,,,,,52.5Z,NAFRev1,N,3.886639,48.999856,0.94,street,Rue de la Mairie 51530 Brugny-Vaudancourt,51093_0130,G,RUE DE LA MAIRIE,
378387419,00013,37838741900013,O,1990-05-01,NN,,,2019-11-14T14:00:41,false,4,CHEZ MR OUDART JEROME,,,,FERMES DES TUYAS,51530,BRUGNY-VAUDANCOURT,,,51093,,,,,,,,,,,,,,,,,,,2001-06-01,F,,,,,01.1A,NAF1993,N,3.885696,48.997969,0.37,street,Rue de la Grosse Ferme 51530 Brugny-Vaudancourt,51093_0100,G,RUE DE LA GROSSE FERME,
378387419,00021,37838741900021,O,2001-06-01,01,2018,,2020-08-25T10:15:22,true,4,,,,,LA GRANGE JABLED,51530,BRUGNY-VAUDANCOURT,,,51093,,,,,,,,,,,,,,,,,,,2010-03-01,A,,,,,01.50Z,NAFRev2,O,3.872766,48.9969,0.94,locality,La Grange Jabled 51530 Brugny-Vaudancourt,51093_b033,G,LA GRANGE JABLED,
378552533,00010,37855253300010,O,1990-03-08,NN,,,2019-11-14T14:00:41,true,3,,,,,,51530,BRUGNY-VAUDANCOURT,,,51093,,,,,,,,,,,,,,,,,,,2008-01-01,A,,,,,93.12Z,NAFRev2,N,,,0,,,,,,
379761729,00027,37976172900027,O,2000-01-10,NN,,,2019-11-14T14:00:41,true,4,,12,,RUE,DU CHATEAU,51530,BRUGNY-VAUDANCOURT,,,51093,,,,,,,,,,,,,,,,,,,2002-10-08,F,,,,,02.0B,NAF1993,N,3.886548,48.998104,0.94,housenumber,12 Rue du Château 51530 Brugny-Vaudancourt,51093_0030_00012,G,12 RUE DU CHATEAU,
380845065,00016,38084506500016,O,1919-01-01,NN,,,2019-11-14T14:00:41,true,3,,,,,,51530,BRUGNY-VAUDANCOURT,,,51093,,,,,,,,,,,,,,,,,,,2008-01-01,A,,,,,01.21Z,NAFRev2,N,,,0,,,,,,
382894616,00020,38289461600020,O,2019-10-15,,,,2019-11-14T14:00:41,true,1,,,,,FERME DE LA GRANGE LE COMTE,51530,BRUGNY-VAUDANCOURT,,,51093,,,,,,,,,,,,,,,,,,,2019-10-15,A,,,,,01.21Z,NAFRev2,N,3.87021,48.979914,0.7,locality,La Grange le Comte 51530 Brugny-Vaudancourt,51093_b034,G,LA GRANGE LE COMTE,
383243524,00014,38324352400014,O,1991-09-19,NN,,,2019-11-14T14:00:41,true,3,,2,,PL,DES TILLEULS,51530,BRUGNY-VAUDANCOURT,,,51093,,,,,,,,,,,,,,,,,,,1996-12-25,F,,,,,01.1G,NAF1993,N,3.887425,48.999673,0.83,housenumber,2 Place des Tilleuls 51530 Brugny-Vaudancourt,51093_0160_00002,G,2 PLACE DES TILLEULS,
384187100,00019,38418710000019,O,1992-02-01,NN,,,2019-11-14T14:00:41,false,3,,6,,RUE,DE LIMONS,51530,BRUGNY-VAUDANCOURT,,,51093,,,,,,,,,,,,,,,,,,,2005-12-08,F,,,,,01.1G,NAFRev1,N,3.88541,49.001133,0.82,housenumber,6 Rue des Limons 51530 Brugny-Vaudancourt,51093_0120_00006,G,6 RUE DES LIMONS,
384187100,00027,38418710000027,O,2005-12-08,02,2018,,2020-08-25T10:21:16,true,3,,10,,RUE,DES LIMONS,51530,BRUGNY-VAUDANCOURT,,,51093,,,,,,,,,,,,,,,,,,,2013-12-31,A,EARL HENRY-BOURDELAT,,,,01.21Z,NAFRev2,O,3.882174,49.001519,0.94,housenumber,10 Rue des Limons 51530 Brugny-Vaudancourt,51093_0120_00010,G,10 RUE DES LIMONS,
384257937,00035,38425793700035,O,2007-11-01,02,2018,,2020-08-25T10:21:21,true,3,HAMEAU DES LIMONS,,,,HAM DES LIMONS,51530,BRUGNY-VAUDANCOURT,,,51093,,,,,,,,,,,,,,,,,,,2011-12-31,A,,,,,01.21Z,NAFRev2,O,3.885635,48.999493,0.92,street,Rue des Limons 51530 Brugny-Vaudancourt,51093_0120,G,RUE DES LIMONS,
384257937,00043,38425793700043,O,2007-07-20,00,2017,,2019-11-14T14:00:41,false,3,HAMEAU DES LIMONS,,,,LES LIMONS,51530,BRUGNY-VAUDANCOURT,,,51093,,,,,,,,,,,,,,,,,,,2017-12-31,F,,,,,01.61Z,NAFRev2,N,3.878677,49.003535,0.94,street,Les Limons 51530 Brugny-Vaudancourt,51093_etybr7,G,LES LIMONS,
385162508,00019,38516250800019,O,1992-01-01,NN,,,2019-11-14T14:00:41,true,3,,8,,RUE,DE BREUX,51530,BRUGNY-VAUDANCOURT,,,51093,,,,,,,,,,,,,,,,,,,2008-01-01,A,,,,,01.21Z,NAFRev2,N,3.887419,49.001753,0.94,housenumber,8 Rue de Breux 51530 Brugny-Vaudancourt,51093_0010_00008,G,8 RUE DE BREUX,
388014979,00016,38801497900016,O,1992-07-08,NN,,,2019-11-14T14:00:41,false,3,,8,,RUE,DE LA CLOTERIE,51530,BRUGNY-VAUDANCOURT,,,51093,,,,,,,,,,,,,,,,,,,2007-01-20,F,,,,,01.1G,NAFRev1,N,3.885078,48.998789,0.94,housenumber,8 Rue de la Cloterie 51530 Brugny-Vaudancourt,51093_0040_00008,G,8 RUE DE LA CLOTERIE,
388014979,00024,38801497900024,O,2007-01-20,NN,,,2019-11-14T14:00:41,false,3,,7,,RUE,DE LA CLOTERIE,51530,BRUGNY-VAUDANCOURT,,,51093,,,,,,,,,,,,,,,,,,,2012-01-25,F,,,,,01.21Z,NAFRev2,O,3.884522,48.998586,0.94,housenumber,7 Rue de la Cloterie 51530 Brugny-Vaudancourt,51093_0040_00007,G,7 RUE DE LA CLOTERIE,
388014979,00032,38801497900032,O,2012-01-25,02,2018,,2020-08-25T10:23:07,true,1,,15,,RUE,DE LA GRANGE JABLED,51530,BRUGNY-VAUDANCOURT,,,51093,,,,,,,,,,,,,,,,,,,2012-01-25,A,,,,,01.21Z,NAFRev2,O,3.882503,48.996269,0.94,housenumber,15 Rue de la Grange Jabled 51530 Brugny-Vaudancourt,51093_0090_00015,G,15 RUE DE LA GRANGE JABLED,
388018822,00014,38801882200014,O,1992-07-15,01,2017,,2019-11-14T14:00:41,true,3,,9,,RUE,DE LA COOPERATIVE,51530,BRUGNY-VAUDANCOURT,,,51093,,,,,,,,,,,,,,,,,,,2008-01-01,A,,,,,01.21Z,NAFRev2,N,3.900835,49.002824,0.94,housenumber,9 Rue de la Coopérative 51530 Brugny-Vaudancourt,51093_0050_00009,G,9 RUE DE LA COOPERATIVE,
388744559,00013,38874455900013,O,1992-09-05,NN,,,2020-08-24T14:58:01,true,4,,11,,RUE,DE LA GRANGE JABLED,51530,BRUGNY-VAUDANCOURT,,,51093,,,,,,,,,,,,,,,,,,,2020-08-21,F,,,,,66.19A,NAFRev2,N,3.882903,48.997897,0.94,housenumber,11 Rue de la Grange Jabled 51530 Brugny-Vaudancourt,51093_0090_00011,G,11 RUE DE LA GRANGE JABLED,
388868655,00027,38886865500027,O,1994-12-01,,,,2019-11-14T14:00:41,true,4,,3,,RUE,DE CHAMPAGNE,51530,BRUGNY-VAUDANCOURT,,,51093,,,,,,,,,,,,,,,,,,,2008-01-01,F,,,,,01.21Z,NAFRev2,N,3.899874,49.002764,0.94,housenumber,3 Rue de Champagne 51530 Brugny-Vaudancourt,51093_0020_00003,G,3 RUE DE CHAMPAGNE,
391384740,00018,39138474000018,O,1992-01-01,NN,,,2019-11-14T14:00:41,true,3,,16,,RUE,DE LA GRANGE JABLESD,51530,BRUGNY-VAUDANCOURT,,,51093,,,,,,,,,,,,,,,,,,,2008-01-01,A,,,,,01.21Z,NAFRev2,N,3.881965,48.997272,0.85,housenumber,16 Rue de la Grange Jabled 51530 Brugny-Vaudancourt,51093_0090_00016,G,16 RUE DE LA GRANGE JABLED,
391447257,00018,39144725700018,O,1992-01-01,NN,,,2019-11-14T14:00:41,true,3,,3,,RUE,DE LA COOPERATIVE,51530,BRUGNY-VAUDANCOURT,,,51093,,,,,,,,,,,,,,,,,,,2003-08-15,F,,,,,01.1A,NAFRev1,N,3.900426,49.003284,0.94,housenumber,3 Rue de la Coopérative 51530 Brugny-Vaudancourt,51093_0050_00003,G,3 RUE DE LA COOPERATIVE,
392337184,00023,39233718400023,O,2005-06-06,NN,,,2019-11-14T14:00:41,true,2,,7,,RUE,DE LA LIBERTE,51530,BRUGNY-VAUDANCOURT,,,51093,,,,,,,,,,,,,,,,,,,2008-01-01,A,,,,,01.21Z,NAFRev2,N,3.895948,49.003349,0.94,housenumber,7 Rue de la Liberté 51530 Brugny-Vaudancourt,51093_0110_00007,G,7 RUE DE LA LIBERTE,
393781166,00029,39378116600029,O,2001-03-15,,,,2019-11-14T14:00:41,true,4,,8,,RUE,DE LA LIBERTE,51530,BRUGNY-VAUDANCOURT,,,51093,,,,,,,,,,,,,,,,,,,2008-01-01,F,VIGNOBLES ARNAUD TABOURIN,,,,01.21Z,NAFRev2,N,3.896152,49.002977,0.94,housenumber,8 Rue de la Liberté 51530 Brugny-Vaudancourt,51093_0110_00008,G,8 RUE DE LA LIBERTE,
393912829,00016,39391282900016,O,1994-01-14,NN,,,2019-11-14T14:00:41,true,3,,3,,RUE,D'EPERNAY,51530,BRUGNY-VAUDANCOURT,,,51093,,,,,,,,,,,,,,,,,,,2008-01-01,A,,,,,68.20A,NAFRev2,N,3.889303,48.999452,0.94,housenumber,3 Rue d'Epernay 51530 Brugny-Vaudancourt,51093_0080_00003,G,3 RUE D EPERNAY,
394445415,00018,39444541500018,O,1993-01-01,NN,,,2019-11-14T14:00:41,true,3,,5,,RUE,DE LA GROSSE FERME,51530,BRUGNY-VAUDANCOURT,,,51093,,,,,,,,,,,,,,,,,,,2005-08-17,F,,,,,01.1G,NAFRev1,N,3.884773,48.997246,0.94,housenumber,5 Rue de la Grosse Ferme 51530 Brugny-Vaudancourt,51093_0100_00005,G,5 RUE DE LA GROSSE FERME,
394526123,00028,39452612300028,O,1900-01-01,,,,2019-11-14T14:00:41,false,3,,,,RUE,DE LA GROSSE FERME,51530,BRUGNY-VAUDANCOURT,,,51093,,,,,,,,,,,,,,,,,,,2000-12-25,F,,,,,01.1G,NAF1993,N,3.885696,48.997969,0.94,street,Rue de la Grosse Ferme 51530 Brugny-Vaudancourt,51093_0100,G,RUE DE LA GROSSE FERME,
394957591,00024,39495759100024,O,2007-01-01,,,,2019-11-14T14:00:41,true,1,,2,,RUE,DE LA PILE,51530,BRUGNY-VAUDANCOURT,,,51093,,,,,,,,,,,,,,,,,,,2007-01-01,A,,,,,01.21Z,NAFRev2,N,3.894764,49.002898,0.88,housenumber,2 Rue de la Pille 51530 Brugny-Vaudancourt,51093_0145_00002,G,2 RUE DE LA PILLE,
397487687,00014,39748768700014,O,1994-05-05,02,2018,,2020-08-25T10:30:01,true,3,,7,,RTE,NATIONALE,51530,BRUGNY-VAUDANCOURT,,,51093,,,,,,,,,,,,,,,,,,,2008-01-01,A,,,,,01.21Z,NAFRev2,N,3.897388,49.002505,0.82,housenumber,7 Route Nationale 51530 Brugny-Vaudancourt,51093_1j4xiu_00007,G,7 ROUTE NATIONALE,
398513382,00018,39851338200018,O,1994-01-01,NN,,,2019-11-14T14:00:41,false,3,,,,,,51530,BRUGNY-VAUDANCOURT,,,51093,,,,,,,,,,,,,,,,,,,2007-10-22,F,,,,,01.1G,NAFRev1,N,,,0,,,,,,
400035689,00027,40003568900027,O,2003-05-01,NN,,,2019-11-14T14:00:41,false,3,,,,,LES LIMONS,51530,BRUGNY-VAUDANCOURT,,,51093,,,,,,,,,,,,,,,,,,,2007-07-22,F,,,,,01.1G,NAFRev1,N,3.878677,49.003535,0.94,street,Les Limons 51530 Brugny-Vaudancourt,51093_etybr7,G,LES LIMONS,
400756466,00019,40075646600019,O,1995-03-06,NN,,,2019-11-14T14:00:41,true,3,,4,,RUE,DE L'EGLISE,51530,BRUGNY-VAUDANCOURT,,,51093,,,,,,,,,,,,,,,,,,,2004-02-27,F,,,,,51.3J,NAFRev1,N,3.898055,49.002028,0.94,housenumber,4 Rue de l'Eglise 51530 Brugny-Vaudancourt,51093_0070_00004,G,4 RUE DE L EGLISE,
402300222,00021,40230022200021,O,2020-03-01,,,,2020-03-17T03:54:20,true,1,,,,IMP,DE LA CLOTERIE,51530,BRUGNY-VAUDANCOURT,,,51093,,,,,,,,,,,,,,,,,,,2020-03-01,A,,,,,68.20B,NAFRev2,N,3.883466,48.997189,0.84,locality,Impasse de la Cloterie 51530 Brugny-Vaudancourt,51093_0045,G,IMPASSE DE LA CLOTERIE,
402818611,00012,40281861100012,O,1995-11-01,NN,,,2019-11-14T14:00:41,true,1,,12,,RUE,DU CHATEAU,51530,BRUGNY-VAUDANCOURT,,,51093,,,,,,,,,,,,,,,,,,,1999-04-20,F,,,,,02.0B,NAF1993,N,3.886548,48.998104,0.94,housenumber,12 Rue du Château 51530 Brugny-Vaudancourt,51093_0030_00012,G,12 RUE DU CHATEAU,
405368283,00017,40536828300017,O,1996-03-15,NN,,,2019-11-14T14:00:41,true,4,,,,,LA GROSSE FERME,51530,BRUGNY-VAUDANCOURT,,,51093,,,,,,,,,,,,,,,,,,,2019-07-01,F,,,,,01.61Z,NAFRev2,N,3.883511,48.993952,0.94,locality,La Grosse Ferme 51530 Brugny-Vaudancourt,51093_b037,G,LA GROSSE FERME,