siren,nic,siret,statutDiffusionEtablissement,dateCreationEtablissement,trancheEffectifsEtablissement,anneeEffectifsEtablissement,activitePrincipaleRegistreMetiersEtablissement,dateDernierTraitementEtablissement,etablissementSiege,nombrePeriodesEtablissement,complementAdresseEtablissement,numeroVoieEtablissement,indiceRepetitionEtablissement,typeVoieEtablissement,libelleVoieEtablissement,codePostalEtablissement,libelleCommuneEtablissement,libelleCommuneEtrangerEtablissement,distributionSpecialeEtablissement,codeCommuneEtablissement,codeCedexEtablissement,libelleCedexEtablissement,codePaysEtrangerEtablissement,libellePaysEtrangerEtablissement,complementAdresse2Etablissement,numeroVoie2Etablissement,indiceRepetition2Etablissement,typeVoie2Etablissement,libelleVoie2Etablissement,codePostal2Etablissement,libelleCommune2Etablissement,libelleCommuneEtranger2Etablissement,distributionSpeciale2Etablissement,codeCommune2Etablissement,codeCedex2Etablissement,libelleCedex2Etablissement,codePaysEtranger2Etablissement,libellePaysEtranger2Etablissement,dateDebut,etatAdministratifEtablissement,enseigne1Etablissement,enseigne2Etablissement,enseigne3Etablissement,denominationUsuelleEtablissement,activitePrincipaleEtablissement,nomenclatureActivitePrincipaleEtablissement,caractereEmployeurEtablissement,longitude,latitude,geo_score,geo_type,geo_adresse,geo_id,geo_ligne,geo_l4,geo_l5
176102119,00375,17610211900375,O,1983-01-01,,,,2012-08-01T15:19:55,false,5,,,,RUE,DE LA FERTE MACE,61220,BRIOUZE,,,61063,,,,,,,,,,,,,,,,,,,2009-12-21,F,TRESORERIE DE BRIOUZE,,,,84.11Z,NAFRev2,N,-0.367664,48.698297,0.94,street,Rue de la Ferté - Macé 61220 Briouze,61063_0060,G,RUE DE LA FERTE  MACE,
196110241,00011,19611024100011,O,1983-03-01,11,2018,,2020-08-25T10:14:17,true,5,,,,RUE,POULINE,61220,BRIOUZE,,BP 25,61063,,,,,,,,,,,,,,,,,,,2011-01-16,A,,,,,85.31Z,NAFRev2,O,-0.3658,48.699082,0.94,street,Rue Pouline 61220 Briouze,61063_0128,G,RUE POULINE,
200073484,00012,20007348400012,O,2016-12-31,11,2018,,2020-08-25T10:15:17,true,1,MAIRIE,10,,PL,DU GENERAL LECLERC,61220,BRIOUZE,,,61063,,,,,,,,,,,,,,,,,,,2016-12-31,A,,,,,84.12Z,NAFRev2,O,-0.366563,48.698129,0.87,housenumber,10 Place du Général Leclerc 61220 Briouze,61063_0090_00010,G,10 PLACE DU GENERAL LECLERC,
216100636,00010,21610063600010,O,1983-03-01,03,2018,,2020-08-25T10:18:12,true,4,,10,,PL,DU GENERAL LECLERC,61220,BRIOUZE,,,61063,,,,,,,,,,,,,,,,,,,2008-01-01,A,MAIRIE,,,,84.11Z,NAFRev2,O,-0.366563,48.698129,0.87,housenumber,10 Place du Général Leclerc 61220 Briouze,61063_0090_00010,G,10 PLACE DU GENERAL LECLERC,
216100636,00028,21610063600028,O,1983-12-21,NN,,,2006-10-26T23:41:17,false,4,,14,,RUE,DES GLYCINES,61220,BRIOUZE,,,61063,,,,,,,,,,,,,,,,,,,2005-08-31,F,ECOLE MATERNELLE PUBLIQUE VAL DU BREUIL,,,,80.1Z,NAFRev1,N,-0.362727,48.699522,0.79,housenumber,14 Avenue des Glycines 61220 Briouze,61063_0092_00014,G,14 AVENUE DES GLYCINES,
216100636,00036,21610063600036,O,1983-12-21,11,2018,,2020-08-25T10:18:12,false,5,,20,,RUE,DE LA GARE,61220,BRIOUZE,,,61063,,,,,,,,,,,,,,,,,,,2008-01-01,A,ECOLE PRIMAIRE PRIMAIRE  GRAND HA,,,,85.20Z,NAFRev2,N,-0.368347,48.70083,0.94,housenumber,20 Rue de la Gare 61220 Briouze,61063_0085_00020,G,20 RUE DE LA GARE,
216100636,00044,21610063600044,O,1998-12-25,NN,,,2020-07-30T07:57:20,false,3,MAIRIE,10,,PL,DU GENERAL LECLERC,61220,BRIOUZE,,,61063,,,,,,,,,,,,,,,,,,,2020-02-26,F,SERVICE D'ASSAINISSEMENT,,,,84.12Z,NAFRev2,N,-0.366563,48.698129,0.87,housenumber,10 Place du Général Leclerc 61220 Briouze,61063_0090_00010,G,10 PLACE DU GENERAL LECLERC,
216100636,00051,21610063600051,O,2002-01-02,NN,,,2009-01-16T09:11:17,false,4,MAIRIE,10,,PL,DU GENERAL LECLERC,61220,BRIOUZE,,,61063,,,,,,,,,,,,,,,,,,,2008-01-01,F,LOTISSEMENT LES CHARMILLES,,,,42.99Z,NAFRev2,N,-0.366563,48.698129,0.87,housenumber,10 Place du Général Leclerc 61220 Briouze,61063_0090_00010,G,10 PLACE DU GENERAL LECLERC,
216100636,00069,21610063600069,O,1984-05-01,NN,,,2008-01-04T18:38:09,false,3,,,,RUE,D'ARGENTAN,61220,BRIOUZE,,,61063,,,,,,,,,,,,,,,,,,,2008-01-01,A,CAMPING MUNICIPAL,,,,55.30Z,NAFRev2,N,-0.367267,48.698641,0.94,street,Rue d'Argentan 61220 Briouze,61063_0015,G,RUE D ARGENTAN,
246100242,00014,24610024200014,O,,NN,,,,true,1,,,,,,61220,BRIOUZE,,,61063,,,,,,,,,,,,,,,,,,,1987-12-31,F,,,,,90.11,NAP,N,,,0,,,,,,
246100739,00019,24610073900019,O,1997-01-01,NN,,,2013-05-18T02:18:38,false,4,MAIRIE,10,,PL,DU GENERAL LECLERC,61220,BRIOUZE,,,61063,,,,,,,,,,,,,,,,,,,2011-01-31,F,,,,,84.11Z,NAFRev2,O,-0.366563,48.698129,0.87,housenumber,10 Place du Général Leclerc 61220 Briouze,61063_0090_00010,G,10 PLACE DU GENERAL LECLERC,
246100739,00027,24610073900027,O,1999-01-01,NN,,,2018-01-03T15:07:56,false,4,,5,,PL,DU GENERAL DE GAULLE,61220,BRIOUZE,,,61063,,,,,,,,,,,,,,,,,,,2017-12-29,F,ZONE ACTIVITE INTERCOMMUNALE,,,,42.99Z,NAFRev2,N,-0.367817,48.697978,0.9,housenumber,5 Place du Général de Gaulle 61220 Briouze,61063_0086_00005,G,5 PLACE DU GENERAL DE GAULLE,
246100739,00035,24610073900035,O,2003-01-01,NN,,,2018-01-03T15:07:56,false,4,,5,,PL,GENERAL DE GAULLE,61220,BRIOUZE,,,61063,,,,,,,,,,,,,,,,,,,2017-12-29,F,SERVICE ORDURES MENAGERES,,,,38.12Z,NAFRev2,N,-0.367817,48.697978,0.86,housenumber,5 Place du Général de Gaulle 61220 Briouze,61063_0086_00005,G,5 PLACE DU GENERAL DE GAULLE,
246100739,00043,24610073900043,O,2003-01-01,NN,,,2018-01-03T15:07:56,false,6,,5,,PL,DU GENERAL DE GAULLE,61220,BRIOUZE,,,61063,,,,,,,,,,,,,,,,,,,2017-12-29,F,SPANC,,,,84.12Z,NAFRev2,N,-0.367817,48.697978,0.9,housenumber,5 Place du Général de Gaulle 61220 Briouze,61063_0086_00005,G,5 PLACE DU GENERAL DE GAULLE,
246100739,00050,24610073900050,O,2003-12-19,NN,,,2018-01-03T15:07:56,false,4,,5,,PL,GENERAL DE GAULLE,61220,BRIOUZE,,,61063,,,,,,,,,,,,,,,,,,,2017-12-29,F,ATELIERS RELAIS GAUQUELIN,,,,68.20B,NAFRev2,N,-0.367817,48.697978,0.86,housenumber,5 Place du Général de Gaulle 61220 Briouze,61063_0086_00005,G,5 PLACE DU GENERAL DE GAULLE,
246100739,00068,24610073900068,O,2004-02-06,NN,,,2018-01-03T15:07:56,false,4,,5,,PL,DU GENERAL DE GAULLE,61220,BRIOUZE,,,61063,,,,,,,,,,,,,,,,,,,2017-12-29,F,BOULANGERIE DE STE OPPORTUNE,,,,68.20B,NAFRev2,N,-0.367817,48.697978,0.9,housenumber,5 Place du Général de Gaulle 61220 Briouze,61063_0086_00005,G,5 PLACE DU GENERAL DE GAULLE,
246100739,00076,24610073900076,O,2011-01-31,00,2017,,2019-06-24T13:13:15,true,2,,5,,PL,DU GENERAL DE GAULLE,61220,BRIOUZE,,,61063,,,,,,,,,,,,,,,,,,,2017-12-29,F,,,,,84.11Z,NAFRev2,O,-0.367817,48.697978,0.9,housenumber,5 Place du Général de Gaulle 61220 Briouze,61063_0086_00005,G,5 PLACE DU GENERAL DE GAULLE,
256100850,00013,25610085000013,O,1983-03-01,NN,,,,true,1,,10,,PL,DU GENERAL LECLERC,61220,BRIOUZE,,,61063,,,,,,,,,,,,,,,,,,,2001-06-15,F,,,,,41.0Z,NAF1993,N,-0.366563,48.698129,0.87,housenumber,10 Place du Général Leclerc 61220 Briouze,61063_0090_00010,G,10 PLACE DU GENERAL LECLERC,
256101825,00014,25610182500014,O,,,,,,true,1,,,,,,61220,BRIOUZE,,,61063,,,,,,,,,,,,,,,,,,,1987-10-31,F,,,,,90.11,NAP,N,,,0,,,,,,
256102047,00022,25610204700022,O,2011-06-15,02,2018,,2020-08-25T10:20:31,true,1,,10,,PL,DU GENERAL LECLERC,61220,BRIOUZE,,,61063,,,,,,,,,,,,,,,,,,,2011-06-15,A,,,,,84.12Z,NAFRev2,O,-0.366563,48.698129,0.87,housenumber,10 Place du Général Leclerc 61220 Briouze,61063_0090_00010,G,10 PLACE DU GENERAL LECLERC,
256102880,00018,25610288000018,O,1983-03-01,NN,,,2009-06-27T03:29:26,true,4,MAIRIE,10,,PL,DU GENERAL LECLERC,61220,BRIOUZE,,,61063,,,,,,,,,,,,,,,,,,,2007-07-31,F,,,,,90.0A,NAFRev1,N,-0.366563,48.698129,0.87,housenumber,10 Place du Général Leclerc 61220 Briouze,61063_0090_00010,G,10 PLACE DU GENERAL LECLERC,
256103276,00018,25610327600018,O,,NN,,,,true,1,,10,,PL,DU GENERAL LECLERC,61220,BRIOUZE,,,61063,,,,,,,,,,,,,,,,,,,1994-11-15,F,,,,,75.1A,NAF1993,N,-0.366563,48.698129,0.87,housenumber,10 Place du Général Leclerc 61220 Briouze,61063_0090_00010,G,10 PLACE DU GENERAL LECLERC,
256103839,00013,25610383900013,O,1997-07-10,NN,,,,true,1,,10,,PL,DU GENERAL LECLERC,61220,BRIOUZE,,,61063,,,,,,,,,,,,,,,,,,,2002-10-15,F,,,,,75.2J,NAF1993,N,-0.366563,48.698129,0.87,housenumber,10 Place du Général Leclerc 61220 Briouze,61063_0090_00010,G,10 PLACE DU GENERAL LECLERC,
266104769,00010,26610476900010,O,1995-12-25,,,,2010-06-26T03:13:10,true,2,MAIRIE,10,,PL,DU GENERAL LECLERC,61220,BRIOUZE,,,61063,,,,,,,,,,,,,,,,,,,2008-01-01,A,CCAS,,,,88.99B,NAFRev2,N,-0.366563,48.698129,0.87,housenumber,10 Place du Général Leclerc 61220 Briouze,61063_0090_00010,G,10 PLACE DU GENERAL LECLERC,
276100773,00015,27610077300015,O,,,,,,true,1,,,,PL,DU GENERAL LECLERC,61220,BRIOUZE,,,61063,,,,,,,,,,,,,,,,,,,1995-12-25,F,,,,,41.0Z,NAF1993,N,-0.367321,48.698363,0.86,street,Place du Général Leclerc 61220 Briouze,61063_0090,G,PLACE DU GENERAL LECLERC,
300052388,00018,30005238800018,O,,NN,,,,true,1,,,,RUE,DE FLERS,61220,BRIOUZE,,,61063,,,,,,,,,,,,,,,,,,,,F,,,,,64.43,NAP,N,-0.368307,48.69869,0.58,street,Rue de Falaise 61220 Briouze,61063_0055,G,RUE DE FALAISE,
300104379,00015,30010437900015,O,,NN,,,,true,1,,,,LD,LAUNAY,61220,BRIOUZE,,,61063,,,,,,,,,,,,,,,,,,,1988-12-19,F,,,,,90.0B,NAF1993,N,-0.365336,48.71449,0.91,street,Lieu Dit Launay 61220 Briouze,61063_wsl1ne,G,LIEU DIT LAUNAY,
300261062,00016,30026106200016,O,1964-01-01,NN,,,2012-06-06T04:21:05,true,7,,,,PL,DU MONUMENT,61220,BRIOUZE,,,61063,,,,,,,,,,,,,,,,,,,2012-05-16,F,,,,,25.99A,NAFRev2,O,-0.367412,48.69826,0.34,street,Place du Général de Gaulle 61220 Briouze,61063_0086,G,PLACE DU GENERAL DE GAULLE,
301962353,00043,30196235300043,O,2007-04-01,,,,2009-04-02T13:04:21,false,3,,44,,,GRANDE RUE,61220,BRIOUZE,,,61063,,,,,,,,,,,,,,,,,,,2008-09-30,F,,,,,43.91B,NAFRev2,N,-0.367598,48.696672,0.94,housenumber,44 Grande Rue 61220 Briouze,61063_0096_00044,G,44 GRANDE RUE,
302648332,00021,30264833200021,O,1900-01-01,NN,,,2015-04-21T11:08:29,false,4,,,,RUE,DE LA GARE,61220,BRIOUZE,,,61063,,,,,,,,,,,,,,,,,,,2015-04-20,F,,,,,66.22Z,NAFRev2,N,-0.36899,48.699214,0.94,street,Rue de la Gare 61220 Briouze,61063_0085,G,RUE DE LA GARE,
303568232,00019,30356823200019,O,1975-01-01,NN,,,,true,1,,,,PL,CROCHET,61220,BRIOUZE,,,61063,,,,,,,,,,,,,,,,,,,1996-08-20,F,,,,,55.1A,NAF1993,N,-0.367114,48.724754,0.35,street,Lieu Dit les Roches 61220 Briouze,61063_f0b0hg,G,LIEU DIT LES ROCHES,
304376148,00033,30437614800033,O,1900-01-01,NN,,,2011-04-28T00:11:34,false,3,,,,,CTRE COMMERCIAL BRIOUZAINE,61220,BRIOUZE,,,61063,,,,,,,,,,,,,,,,,,,1995-12-25,F,,,,,70.2C,NAF1993,N,-0.367702,48.701583,0.35,street,Rue Laquaine 61220 Briouze,61063_0110,G,RUE LAQUAINE,
304376148,00041,30437614800041,O,1993-01-01,NN,,,2019-12-24T12:38:46,true,4,,3,,ALL,DES CEDRES,61220,BRIOUZE,,,61063,,,,,,,,,,,,,,,,,,,2019-12-31,F,,,,,01.41Z,NAFRev2,N,-0.360423,48.699312,0.83,housenumber,3 Allée des Cêdres 61220 Briouze,61063_0022_00003,G,3 ALLEE DES CEDRES,
305172850,00011,30517285000011,O,,NN,,,,true,1,,,,RUE,DE FLERS,61220,BRIOUZE,,,61063,,,,,,,,,,,,,,,,,,,,F,,,,,67.05,NAP,N,-0.368307,48.69869,0.58,street,Rue de Falaise 61220 Briouze,61063_0055,G,RUE DE FALAISE,
306150327,00014,30615032700014,O,1964-01-01,NN,,,2008-11-07T00:21:54,true,4,,,,,GRANDE-RUE,61220,BRIOUZE,,,61063,,,,,,,,,,,,,,,,,,,2003-08-31,F,,,,,52.2C,NAFRev1,N,-0.369001,48.697368,0.94,street,Grande Rue 61220 Briouze,61063_0096,G,GRANDE RUE,
307672824,00017,30767282400017,O,,,,,,true,1,,,,,LA BRUYERE,61220,BRIOUZE,,,61063,,,,,,,,,,,,,,,,,,,1997-06-30,F,,,,,01.2C,NAF1993,N,-0.359457,48.710187,0.94,street,La Bruyere 61220 Briouze,61063_16vvtx,G,LA BRUYERE,
307717751,00043,30771775100043,O,1994-07-01,,,,,false,3,LD LE GRAND PONT,,,RTE,DE DOMFRONT,61220,BRIOUZE,,,61063,,,,,,,,,,,,,,,,,,,1997-07-01,F,,,,,51.2A,NAF1993,N,-0.375207,48.693856,0.82,street,Route de Domfront 61220 Briouze,61063_0030,G,ROUTE DE DOMFRONT,
307920553,00012,30792055300012,O,1900-01-01,NN,,,2008-01-04T19:48:27,true,3,,,,PL,DU GENERAL LECLERC,61220,BRIOUZE,,,61063,,,,,,,,,,,,,,,,,,,2008-01-01,A,,,,,94.11Z,NAFRev2,N,-0.367321,48.698363,0.86,street,Place du Général Leclerc 61220 Briouze,61063_0090,G,PLACE DU GENERAL LECLERC,
308168905,00013,30816890500013,O,,NN,,,,true,1,,,,RUE,DE LA FERTE MACE,61220,BRIOUZE,,,61063,,,,,,,,,,,,,,,,,,,1990-09-30,F,,,,,69.23,NAP,N,-0.367664,48.698297,0.94,street,Rue de la Ferté - Macé 61220 Briouze,61063_0060,G,RUE DE LA FERTE  MACE,
308917293,00018,30891729300018,O,1900-01-01,NN,,,,false,4,,,,PL,DE LA MAIRIE,61220,BRIOUZE,,,61063,,,,,,,,,,,,,,,,,,,1999-01-01,F,,,,,85.1G,NAF1993,N,-0.381381,48.690613,0.54,street,Les Landes de la Marriere 61220 Briouze,61063_b053,G,LES LANDES DE LA MARRIERE,
308917293,00026,30891729300026,O,1999-01-01,NN,,,2016-06-15T11:39:19,true,4,SCP LEGRAND MARRIERE DUVAL,6,,PL,DU GENERAL LECLERC,61220,BRIOUZE,,,61063,,,,,,,,,,,,,,,,,,,2016-06-30,F,,,,,86.90D,NAFRev2,N,-0.366871,48.698195,0.86,housenumber,6 Place du Général Leclerc 61220 Briouze,61063_0090_00006,G,6 PLACE DU GENERAL LECLERC,
309243129,00033,30924312900033,O,1987-11-25,NN,,,2006-12-15T00:16:41,false,3,CENTRE COMMERC LA BRIOUZAI,,,RTE,D'ARGENTAN,61220,BRIOUZE,,,61063,,,,,,,,,,,,,,,,,,,1993-09-30,F,,,,,52.4C,NAF1993,N,-0.367267,48.698641,0.76,street,Rue d'Argentan 61220 Briouze,61063_0015,G,RUE D ARGENTAN,
309748606,00014,30974860600014,O,1977-01-01,NN,,,2007-05-19T08:44:55,true,4,,,,RUE,DE LA GARE,61220,BRIOUZE,,,61063,,,,,,,,,,,,,,,,,,,2005-05-31,F,,,,,55.1A,NAFRev1,O,-0.36899,48.699214,0.94,street,Rue de la Gare 61220 Briouze,61063_0085,G,RUE DE LA GARE,
311028120,00047,31102812000047,O,1996-07-01,NN,,,2006-12-15T00:17:13,false,4,,2,,PL,ALBERT 1ER,61220,BRIOUZE,,,61063,,,,,,,,,,,,,,,,,,,2004-03-11,F,,,,,74.1J,NAFRev1,N,-0.368197,48.697405,0.82,housenumber,2 Place Albert 1er 61220 Briouze,61063_8eb8z2_00002,G,2 PLACE ALBERT 1ER,
311515845,00015,31151584500015,O,,,,,,true,1,,,,PL,ALBERT 1ER,61220,BRIOUZE,,,61063,,,,,,,,,,,,,,,,,,,1985-12-25,F,,,,,64.23,NAP,N,-0.368161,48.697448,0.81,street,Place Albert 1er 61220 Briouze,61063_8eb8z2,G,PLACE ALBERT 1ER,
312015415,00010,31201541500010,O,1978-01-01,NN,,,2010-05-04T15:26:37,false,4,,,,RUE,DE LA GARE,61220,BRIOUZE,,,61063,,,,,,,,,,,,,,,,,,,2010-01-01,F,,,,,43.34Z,NAFRev2,N,-0.36899,48.699214,0.94,street,Rue de la Gare 61220 Briouze,61063_0085,G,RUE DE LA GARE,
312015415,00028,31201541500028,O,2010-01-01,,,4334ZB,2015-11-19T04:03:11,true,2,,26,,RUE,DU DOCTEUR PETIT,61220,BRIOUZE,,,61063,,,,,,,,,,,,,,,,,,,2015-10-31,F,,,,,43.34Z,NAFRev2,N,-0.369499,48.699307,0.94,housenumber,26 Rue du Docteur Petit 61220 Briouze,61063_0029_00026,G,26 RUE DU DOCTEUR PETIT,
312107154,00030,31210715400030,O,1989-01-01,NN,,,2006-11-25T09:29:50,true,3,,10,,PL,ALBERT 1ER,61220,BRIOUZE,,,61063,,,,,,,,,,,,,,,,,,,2006-04-15,F,,,,,85.2Z,NAFRev1,N,-0.368279,48.697849,0.83,housenumber,10 Place Albert 1er 61220 Briouze,61063_8eb8z2_00010,G,10 PLACE ALBERT 1ER,
313018905,00015,31301890500015,O,1978-01-01,NN,,,2008-11-07T00:28:13,true,4,,,,,LES JONCHERETS,61220,BRIOUZE,,,61063,,,,,,,,,,,,,,,,,,,2003-12-31,F,,,,,51.3J,NAFRev1,O,-0.373456,48.701226,0.94,street,Les Joncherets 61220 Briouze,61063_alyval,G,LES JONCHERETS,
313516197,00016,31351619700016,O,1969-01-01,NN,,,2008-11-07T00:28:47,false,4,,35,,RUE,DE DOMFRONT,61220,BRIOUZE,,,61063,,,,,,,,,,,,,,,,,,,1997-06-20,F,,,,,28.3C,NAF1993,O,-0.368305,48.698478,0.8,street,Rue de Domfront 61220 Briouze,61063_0035,G,RUE DE DOMFRONT,
313966103,00092,31396610300092,O,1997-01-01,NN,,,2008-01-04T20:25:51,false,3,,,,,LA HAIE,61220,BRIOUZE,,,61063,,,,,,,,,,,,,,,,,,,2008-01-01,A,,,,,49.41A,NAFRev2,N,-0.375223,48.734451,0.58,street,La Haye 61220 Briouze,61063_8wv7v7,G,LA HAYE,
314129180,00027,31412918000027,O,,,,,,true,1,,,,RUE,DE LA FERTE MACE,61220,BRIOUZE,,,61063,,,,,,,,,,,,,,,,,,,1988-07-31,F,,,,,67.01,NAP,N,-0.367664,48.698297,0.94,street,Rue de la Ferté - Macé 61220 Briouze,61063_0060,G,RUE DE LA FERTE  MACE,
314138702,00076,31413870200076,O,1989-04-28,,,,2008-01-04T20:27:15,false,3,,,,RUE,DU DOCTEUR PETIT,61220,BRIOUZE,,,61063,,,,,,,,,,,,,,,,,,,2008-01-01,A,,,,,64.19Z,NAFRev2,N,-0.368392,48.69863,0.94,street,Rue du Docteur Petit 61220 Briouze,61063_0029,G,RUE DU DOCTEUR PETIT,
314138827,00022,31413882700022,O,,,,,,true,1,,,,RUE,DU DOCTEUR PETIT,61220,BRIOUZE,,,61063,,,,,,,,,,,,,,,,,,,1989-01-01,F,,,,,65.1D,NAF1993,N,-0.368392,48.69863,0.94,street,Rue du Docteur Petit 61220 Briouze,61063_0029,G,RUE DU DOCTEUR PETIT,
314187782,00011,31418778200011,O,,,,,,true,1,,,,RUE,DE FLERS,61220,BRIOUZE,,,61063,,,,,,,,,,,,,,,,,,,1984-12-25,F,,,,,56.02,NAP,N,-0.368307,48.69869,0.58,street,Rue de Falaise 61220 Briouze,61063_0055,G,RUE DE FALAISE,
314870791,00030,31487079100030,O,1900-01-01,,,,2007-07-30T19:55:22,false,3,,,,RUE,D'ARGENTAN,61220,BRIOUZE,,,61063,,,,,,,,,,,,,,,,,,,2007-05-24,F,,,,,45.4J,NAFRev1,N,-0.367267,48.698641,0.94,street,Rue d'Argentan 61220 Briouze,61063_0015,G,RUE D ARGENTAN,
315068544,00016,31506854400016,O,,NN,,,,true,1,,,,PL,DU GENERAL LECLERC,61220,BRIOUZE,,,61063,,,,,,,,,,,,,,,,,,,,F,,,,,87.10,NAP,N,-0.367321,48.698363,0.86,street,Place du Général Leclerc 61220 Briouze,61063_0090,G,PLACE DU GENERAL LECLERC,
315282699,00018,31528269900018,O,1900-01-01,03,2018,,2020-08-25T10:26:26,true,4,,,,RUE,D'ARGENTAN,61220,BRIOUZE,,,61063,,,,,,,,,,,,,,,,,,,2008-01-01,A,,,,,85.20Z,NAFRev2,O,-0.367267,48.698641,0.94,street,Rue d'Argentan 61220 Briouze,61063_0015,G,RUE D ARGENTAN,
315282699,00026,31528269900026,O,1986-09-25,02,2018,,2020-08-25T10:26:26,false,5,,,,RUE,DE LA FERTE MACE,61220,BRIOUZE,,,61063,,,,,,,,,,,,,,,,,,,2008-01-01,A,ECOLE MATERNELLE NOTRE-DAME,,,,85.20Z,NAFRev2,O,-0.367664,48.698297,0.94,street,Rue de la Ferté - Macé 61220 Briouze,61063_0060,G,RUE DE LA FERTE  MACE,
315282699,00034,31528269900034,O,1986-09-25,11,2018,,2020-08-25T10:26:26,false,4,,,,,SAINT GERVAIS,61220,BRIOUZE,,,61063,,,,,,,,,,,,,,,,,,,2008-01-01,A,COLLEGE PRIVE NOTRE-DAME,,,,85.31Z,NAFRev2,O,-0.367476,48.702612,0.93,street,Rue Saint Gervais 61220 Briouze,61063_0146,G,RUE SAINT GERVAIS,
315617712,00015,31561771200015,O,1979-01-01,NN,,,2015-06-25T08:57:36,false,4,,,,RUE,DE FLERS,61220,BRIOUZE,,,61063,,,,,,,,,,,,,,,,,,,2015-06-08,F,,,,,86.21Z,NAFRev2,N,-0.368307,48.69869,0.58,street,Rue de Falaise 61220 Briouze,61063_0055,G,RUE DE FALAISE,
315617712,00023,31561771200023,O,2015-06-08,,,,2018-06-22T04:20:59,true,2,MAISON MEDICALE,5,,CHE,DU VIEUX MOULIN,61220,BRIOUZE,,,61063,,,,,,,,,,,,,,,,,,,2018-06-30,F,,,,,86.21Z,NAFRev2,N,-0.363642,48.698478,0.86,housenumber,5 Chemin du Vieux Moulin 61220 Briouze,61063_b020_00005,G,5 CHEMIN DU VIEUX MOULIN,
315863381,00010,31586338100010,O,1972-01-01,NN,,,,true,1,,,,RUE,DES VERGERS,61220,BRIOUZE,,,61063,,,,,,,,,,,,,,,,,,,1999-12-31,F,,,,,60.2E,NAF1993,N,-0.366415,48.698807,0.94,street,Rue des Vergers 61220 Briouze,61063_0160,G,RUE DES VERGERS,
315884320,00054,31588432000054,O,1998-06-01,NN,,,2009-06-27T04:06:05,false,4,,5,,RUE,DU DOCTEUR PETIT,61220,BRIOUZE,,,61063,,,,,,,,,,,,,,,,,,,2007-10-22,F,,,,,52.2C,NAFRev1,N,-0.368678,48.69878,0.94,housenumber,5 Rue du Docteur Petit 61220 Briouze,61063_0029_00005,G,5 RUE DU DOCTEUR PETIT,
316101682,00029,31610168200029,O,1988-09-10,11,2018,,2020-08-25T10:26:47,true,4,CENTR COMMERCIAL LA BRIOUZ,,,RTE,D'ARGENTAN,61220,BRIOUZE,,,61063,,,,,,,,,,,,,,,,,,,2008-01-01,A,,,,,47.11D,NAFRev2,O,-0.367267,48.698641,0.76,street,Rue d'Argentan 61220 Briouze,61063_0015,G,RUE D ARGENTAN,
316127448,00017,31612744800017,O,,NN,,,,true,1,,,,RUE,DE FLERS,61220,BRIOUZE,,,61063,,,,,,,,,,,,,,,,,,,1989-12-31,F,,,,,55.40,NAP,N,-0.368307,48.69869,0.58,street,Rue de Falaise 61220 Briouze,61063_0055,G,RUE DE FALAISE,
316445709,00017,31644570900017,O,,,,,,true,1,,,,PL,ALBERT 1ER,61220,BRIOUZE,,,61063,,,,,,,,,,,,,,,,,,,,F,,,,,67.01,NAP,N,-0.368161,48.697448,0.81,street,Place Albert 1er 61220 Briouze,61063_8eb8z2,G,PLACE ALBERT 1ER,
316445717,00010,31644571700010,O,1968-01-01,NN,,,2009-06-27T04:07:37,true,5,,,,PL,DE L EGLISE,61220,BRIOUZE,,,61063,,,,,,,,,,,,,,,,,,,2008-01-01,F,,,,,96.02A,NAFRev2,O,-0.367548,48.698519,0.82,street,Place de l'Eglise 61220 Briouze,61063_0045,G,PLACE DE L EGLISE,
317096741,00028,31709674100028,O,,NN,,,,true,1,,,,RUE,DE FALAISE,61220,BRIOUZE,,,61063,,,,,,,,,,,,,,,,,,,1996-11-01,F,,,,,52.4C,NAF1993,N,-0.368307,48.69869,0.94,street,Rue de Falaise 61220 Briouze,61063_0055,G,RUE DE FALAISE,
317516938,00014,31751693800014,O,,NN,,,,true,1,,,,RTE,DE DOMFRONT,61220,BRIOUZE,,,61063,,,,,,,,,,,,,,,,,,,1986-07-10,F,,,,,59.08,NAP,N,-0.375207,48.693856,0.82,street,Route de Domfront 61220 Briouze,61063_0030,G,ROUTE DE DOMFRONT,
317611044,00023,31761104400023,O,2004-05-01,NN,,,2006-11-25T09:40:52,true,3,,,,,ZA DES 5 CHEMINS,61220,BRIOUZE,,,61063,,,,,,,,,,,,,,,,,,,2005-06-18,F,,,,,51.1T,NAFRev1,N,6.4185788,46.3443128,0.74,poi.retail,Zone Artisanale Les 5 Chemins (Zone commerciale) Margencel,https://osm.org/way/42017629,G,,
318610300,00010,31861030000010,O,1980-01-01,NN,,,2011-12-09T14:38:58,true,4,,,,RUE,SAINT JACQUES,61220,BRIOUZE,,,61063,,,,,,,,,,,,,,,,,,,2011-09-30,F,,,,,68.20A,NAFRev2,N,-0.366263,48.698531,0.94,street,Rue Saint Jacques 61220 Briouze,61063_0150,G,RUE SAINT JACQUES,
318904380,00017,31890438000017,O,,,,,,true,1,,,,RUE,FALAISE,61220,BRIOUZE,,,61063,,,,,,,,,,,,,,,,,,,1984-12-25,F,,,,,78.02,NAP,N,-0.368307,48.69869,0.93,street,Rue de Falaise 61220 Briouze,61063_0055,G,RUE DE FALAISE,
318944261,00011,31894426100011,O,1980-05-01,NN,,,2008-11-07T00:34:48,true,4,,,,PL,ALBERT 1ER,61220,BRIOUZE,,,61063,,,,,,,,,,,,,,,,,,,2004-01-23,F,,,,,55.1A,NAFRev1,O,-0.368161,48.697448,0.81,street,Place Albert 1er 61220 Briouze,61063_8eb8z2,G,PLACE ALBERT 1ER,
319147260,00057,31914726000057,O,2000-07-08,NN,,,2016-01-12T12:15:43,true,4,,4,,RUE,ALBERT 1ER,61220,BRIOUZE,,,61063,,,,,,,,,,,,,,,,,,,2008-01-01,A,,,,,68.20B,NAFRev2,N,-0.368798,48.697343,0.72,housenumber,4 Place Albert 1er 61220 Briouze,61063_8eb8z2_00004,G,4 PLACE ALBERT 1ER,
319686762,00018,31968676200018,O,1980-08-01,NN,,,2009-12-31T14:56:52,false,7,,,,LD,LA HARDOUILLERE,61220,BRIOUZE,,,61063,,,,,,,,,,,,,,,,,,,2009-12-31,F,,,,,49.41A,NAFRev2,N,-0.361045,48.715861,0.76,street,Lieu Dit Hardouillere 61220 Briouze,61063_t1xcqu,G,LIEU DIT HARDOUILLERE,
319686762,00026,31968676200026,O,1990-01-01,NN,,,2012-10-08T14:23:58,true,3,,,,,LA HARDOUILLERE,61220,BRIOUZE,,,61063,,,,,,,,,,,,,,,,,,,2008-01-01,A,,,,,01.42Z,NAFRev2,N,-0.361045,48.715861,0.76,street,Lieu Dit Hardouillere 61220 Briouze,61063_t1xcqu,G,LIEU DIT HARDOUILLERE,
320456247,00016,32045624700016,O,,,,,,true,1,,,,RUE,GRANDE RUE,61220,BRIOUZE,,,61063,,,,,,,,,,,,,,,,,,,1987-04-30,F,,,,,84.14,NAP,N,-0.369001,48.697368,0.87,street,Grande Rue 61220 Briouze,61063_0096,G,GRANDE RUE,
320634215,00026,32063421500026,O,,NN,,,,true,1,,,,RUE,NOTRE DAME,61220,BRIOUZE,,,61063,,,,,,,,,,,,,,,,,,,1992-07-01,F,,,,,18.2C,NAF1993,N,-0.369079,48.697805,0.94,street,Rue Notre Dame 61220 Briouze,61063_0125,G,RUE NOTRE DAME,
320669740,00039,32066974000039,O,1990-05-15,NN,,,2008-11-07T00:36:41,true,3,,4,,ALL,DES PERVENCHES,61220,BRIOUZE,,,61063,,,,,,,,,,,,,,,,,,,2004-03-31,F,,,,,45.3A,NAFRev1,N,-0.360836,48.697922,0.85,housenumber,4 Allée des Pervenches 61220 Briouze,61063_0127_00004,G,4 ALLEE DES PERVENCHES,
320833510,00011,32083351000011,O,,,,,,true,1,,,,RUE,DE FALAISE,61220,BRIOUZE,,,61063,,,,,,,,,,,,,,,,,,,1984-12-25,F,,,,,64.11,NAP,N,-0.368307,48.69869,0.94,street,Rue de Falaise 61220 Briouze,61063_0055,G,RUE DE FALAISE,
321346454,00010,32134645400010,O,1981-04-01,NN,,,,false,3,,,,,VIEUX MOULIN,61220,BRIOUZE,,,61063,,,,,,,,,,,,,,,,,,,1994-12-01,F,,,,,60.2L,NAF1993,N,-0.364013,48.697744,0.92,street,Cite du Vieux Moulin 61220 Briouze,61063_b022,G,CITE DU VIEUX MOULIN,
322209495,00025,32220949500025,O,,NN,,,,true,1,,,,RUE,DOCTEUR PETIT,61220,BRIOUZE,,,61063,,,,,,,,,,,,,,,,,,,,F,,,,,64.46,NAP,N,-0.368392,48.69863,0.93,street,Rue du Docteur Petit 61220 Briouze,61063_0029,G,RUE DU DOCTEUR PETIT,
322588856,00011,32258885600011,O,,,,,,true,1,,,,RUE,DU DOCTEUR PETIT,61220,BRIOUZE,,,61063,,,,,,,,,,,,,,,,,,,1985-12-25,F,,,,,64.49,NAP,N,-0.368392,48.69863,0.94,street,Rue du Docteur Petit 61220 Briouze,61063_0029,G,RUE DU DOCTEUR PETIT,