siren,nic,siret,statutDiffusionEtablissement,dateCreationEtablissement,trancheEffectifsEtablissement,anneeEffectifsEtablissement,activitePrincipaleRegistreMetiersEtablissement,dateDernierTraitementEtablissement,etablissementSiege,nombrePeriodesEtablissement,complementAdresseEtablissement,numeroVoieEtablissement,indiceRepetitionEtablissement,typeVoieEtablissement,libelleVoieEtablissement,codePostalEtablissement,libelleCommuneEtablissement,libelleCommuneEtrangerEtablissement,distributionSpecialeEtablissement,codeCommuneEtablissement,codeCedexEtablissement,libelleCedexEtablissement,codePaysEtrangerEtablissement,libellePaysEtrangerEtablissement,complementAdresse2Etablissement,numeroVoie2Etablissement,indiceRepetition2Etablissement,typeVoie2Etablissement,libelleVoie2Etablissement,codePostal2Etablissement,libelleCommune2Etablissement,libelleCommuneEtranger2Etablissement,distributionSpeciale2Etablissement,codeCommune2Etablissement,codeCedex2Etablissement,libelleCedex2Etablissement,codePaysEtranger2Etablissement,libellePaysEtranger2Etablissement,dateDebut,etatAdministratifEtablissement,enseigne1Etablissement,enseigne2Etablissement,enseigne3Etablissement,denominationUsuelleEtablissement,activitePrincipaleEtablissement,nomenclatureActivitePrincipaleEtablissement,caractereEmployeurEtablissement,longitude,latitude,geo_score,geo_type,geo_adresse,geo_id,geo_ligne,geo_l4,geo_l5
312458177,00036,31245817700036,O,,NN,,,2019-01-15T08:16:16,true,1,,,,,LA PREILLE,86470,MONTREUIL BONNIN,,,86166,,,,,,,,,,,,,,,,,,,1988-09-13,F,,,,,57.01,NAP,N,0.098412,46.557328,0.92,street,Rue de la Preille 86470 Boivre-la-Vallée,86166_0280,G,RUE DE LA PREILLE,
312893548,00015,31289354800015,O,,,,,2019-01-15T08:16:16,true,1,,,,,,86470,MONTREUIL BONNIN,,,86166,,,,,,,,,,,,,,,,,,,1985-12-25,F,,,,,55.73,NAP,N,,,0,,,,,,
315221051,00024,31522105100024,O,,,,,2019-01-15T08:16:16,true,1,,41,,LOT,DU BARDEAU,86470,MONTREUIL BONNIN,,,86166,,,,,,,,,,,,,,,,,,,1985-12-25,F,,,,,55.40,NAP,N,0.139053,46.554391,0.57,locality,Champs du Bardeau (Montreuil-Bonnin) 86470 Boivre-la-Vallée,86166_b029,G,CHAMPS DU BARDEAU,MONTREUIL BONNIN
316352087,00035,31635208700035,O,,,,,2019-01-15T08:16:16,true,1,,,,,,86470,MONTREUIL BONNIN,,,86166,,,,,,,,,,,,,,,,,,,1984-12-25,F,,,,,00.20,NAP,N,,,0,,,,,,
320003122,00027,32000312200027,O,1900-01-01,NN,,,2019-01-15T08:16:16,false,4,,,,,LE BOURG,86470,MONTREUIL BONNIN,,,86166,,,,,,,,,,,,,,,,,,,1994-06-30,F,,,,,93.0D,NAF1993,N,0.142517,46.550269,0.91,locality,Le Bourg Montreuil-bonnin (Montreuil-Bonnin) 86470 Boivre-la-Vallée,86166_b013,G,LE BOURG MONTREUIL BONNIN,MONTREUIL BONNIN
320769698,00012,32076969800012,O,,NN,,,2019-01-15T08:16:16,true,1,,1,,,CHAMP DU BARDEAU,86470,MONTREUIL BONNIN,,,86166,,,,,,,,,,,,,,,,,,,1992-12-31,F,,,,,18.2C,NAF1993,N,0.139053,46.554391,0.73,locality,Champs du Bardeau (Montreuil-Bonnin) 86470 Boivre-la-Vallée,86166_b029,G,CHAMPS DU BARDEAU,MONTREUIL BONNIN
320970643,00013,32097064300013,O,1900-01-01,,,,2020-07-01T08:16:52,false,2,,,,,LE BOURQUET,86470,MONTREUIL BONNIN,,,86166,,,,,,,,,,,,,,,,,,,1985-12-25,F,,,,,55.40,NAP,N,0.142517,46.550269,0.55,locality,Le Bourg Montreuil-bonnin (Montreuil-Bonnin) 86470 Boivre-la-Vallée,86166_b013,G,LE BOURG MONTREUIL BONNIN,MONTREUIL BONNIN
322844572,00014,32284457200014,O,,NN,,,2019-01-15T08:16:16,true,1,,25,,,CHAMP DU BARDEAU,86470,MONTREUIL BONNIN,,,86166,,,,,,,,,,,,,,,,,,,,F,,,,,55.71,NAP,N,0.139053,46.554391,0.69,locality,Champs du Bardeau (Montreuil-Bonnin) 86470 Boivre-la-Vallée,86166_b029,G,CHAMPS DU BARDEAU,MONTREUIL BONNIN
325483543,00014,32548354300014,O,,NN,,,2019-01-15T08:16:16,true,1,,,,LD,LE FRESNE,86470,MONTREUIL BONNIN,,,86166,,,,,,,,,,,,,,,,,,,1991-12-31,F,,,,,01.80,NAP,N,0.124077,46.546075,0.64,locality,Fontaine du Fresne (Montreuil-Bonnin) 86470 Boivre-la-Vallée,86166_b040,G,FONTAINE DU FRESNE,MONTREUIL BONNIN
326002268,00018,32600226800018,O,,NN,,,2019-01-15T08:16:16,true,1,,,,,,86470,MONTREUIL BONNIN,,,86166,,,,,,,,,,,,,,,,,,,1991-03-31,F,,,,,67.07,NAP,N,,,0,,,,,,
326077906,00013,32607790600013,O,,,,,2019-01-15T08:16:16,true,1,,,,,,86470,MONTREUIL BONNIN,,,86166,,,,,,,,,,,,,,,,,,,1984-12-25,F,,,,,64.48,NAP,N,,,0,,,,,,
326170107,00014,32617010700014,O,,,,,2019-01-15T08:16:16,true,1,,,,,,86470,MONTREUIL BONNIN,,,86166,,,,,,,,,,,,,,,,,,,1984-12-25,F,,,,,55.71,NAP,N,,,0,,,,,,
326370194,00010,32637019400010,O,,,,,2019-01-15T08:16:16,true,1,,,,,,86470,MONTREUIL BONNIN,,,86166,,,,,,,,,,,,,,,,,,,1984-12-25,F,,,,,38.40,NAP,N,,,0,,,,,,
326570397,00017,32657039700017,O,,NN,,,2019-01-15T08:16:16,true,1,,,,LD,LES GATINELLES,86470,MONTREUIL BONNIN,,,86166,,,,,,,,,,,,,,,,,,,1987-04-27,F,,,,,01.57,NAP,N,0.140764,46.542015,0.51,street,Lieu Dit les Garnaudieres 86470 Boivre-la-Vallée,86123_f5xi6k,G,LIEU DIT LES GARNAUDIERES,
326674546,00014,32667454600014,O,,NN,,,2019-01-15T08:16:16,true,1,,,,,,86470,MONTREUIL BONNIN,,,86166,,,,,,,,,,,,,,,,,,,1991-09-20,F,,,,,81.21,NAP,N,,,0,,,,,,
328567458,00018,32856745800018,O,,NN,,,2019-01-15T08:16:16,true,1,,,,LD,LE CHAMP DU BARDEAU,86470,MONTREUIL BONNIN,,,86166,,,,,,,,,,,,,,,,,,,1989-04-12,F,,,,,77.14,NAP,N,0.139053,46.554391,0.69,locality,Champs du Bardeau (Montreuil-Bonnin) 86470 Boivre-la-Vallée,86166_b029,G,CHAMPS DU BARDEAU,MONTREUIL BONNIN
331670380,00012,33167038000012,O,1985-01-01,NN,,,2019-01-15T08:16:16,false,4,,,,LD,LES BRUERES,86470,MONTREUIL BONNIN,,,86166,,,,,,,,,,,,,,,,,,,1998-12-31,F,,,,,01.2A,NAF1993,N,0.140764,46.542015,0.59,street,Lieu Dit les Garnaudieres 86470 Boivre-la-Vallée,86123_f5xi6k,G,LIEU DIT LES GARNAUDIERES,
333950673,00017,33395067300017,O,,NN,,,2019-01-15T08:16:16,true,1,,,,,LE BOURG,86470,MONTREUIL BONNIN,,,86166,,,,,,,,,,,,,,,,,,,1989-02-01,F,,,,,38.40,NAP,N,0.142517,46.550269,0.91,locality,Le Bourg Montreuil-bonnin (Montreuil-Bonnin) 86470 Boivre-la-Vallée,86166_b013,G,LE BOURG MONTREUIL BONNIN,MONTREUIL BONNIN
333954881,00012,33395488100012,O,,NN,,,2019-01-15T08:16:16,true,1,,,,,LE BOURG,86470,MONTREUIL BONNIN,,,86166,,,,,,,,,,,,,,,,,,,1989-02-01,F,,,,,38.40,NAP,N,0.142517,46.550269,0.91,locality,Le Bourg Montreuil-bonnin (Montreuil-Bonnin) 86470 Boivre-la-Vallée,86166_b013,G,LE BOURG MONTREUIL BONNIN,MONTREUIL BONNIN
334268083,00014,33426808300014,O,,NN,,,2019-01-15T08:16:16,true,1,,,,LD,FRENE,86470,MONTREUIL BONNIN,,,86166,,,,,,,,,,,,,,,,,,,1990-12-31,F,,,,,01.80,NAP,N,0.124077,46.546075,0.59,locality,Fontaine du Fresne (Montreuil-Bonnin) 86470 Boivre-la-Vallée,86166_b040,G,FONTAINE DU FRESNE,MONTREUIL BONNIN
337491971,00012,33749197100012,O,1986-04-17,NN,,,2019-01-15T08:16:16,true,1,,,,,,86470,MONTREUIL BONNIN,,,86166,,,,,,,,,,,,,,,,,,,1998-02-21,F,,,,,01.3Z,NAF1993,N,,,0,,,,,,
337502801,00018,33750280100018,O,,NN,,,2019-01-15T08:16:16,true,1,,,,LD,LE PETIT BOUCHET,86470,MONTREUIL BONNIN,,,86166,,,,,,,,,,,,,,,,,,,1993-09-29,F,,,,,01.2A,NAF1993,N,0.147506,46.548894,0.56,locality,Le Petit Etang (Montreuil-Bonnin) 86470 Boivre-la-Vallée,86166_b077,G,LE PETIT ETANG,MONTREUIL BONNIN
343396453,00015,34339645300015,O,,NN,,,2019-01-15T08:16:16,true,1,,,,,CHATEAU,86470,MONTREUIL BONNIN,,,86166,,,,,,,,,,,,,,,,,,,1988-02-25,F,,,,,60.01,NAP,N,0.139864,46.553167,0.91,street,Rue du Château 86470 Boivre-la-Vallée,86166_0020,G,RUE DU CHATEAU,
378205579,00014,37820557900014,O,,NN,,,2019-01-15T08:16:16,true,1,,,,LD,LA GARNAUDIERE,86470,MONTREUIL BONNIN,,,86166,,,,,,,,,,,,,,,,,,,1992-12-31,F,,,,,01.1A,NAF1993,N,0.140764,46.542015,0.85,street,Lieu Dit les Garnaudieres 86470 Boivre-la-Vallée,86123_f5xi6k,G,LIEU DIT LES GARNAUDIERES,
383151636,00016,38315163600016,O,1989-10-01,NN,,,2019-01-15T08:16:16,true,1,,,,,,86470,MONTREUIL BONNIN,,,86166,,,,,,,,,,,,,,,,,,,1997-12-31,F,,,,,91.3E,NAF1993,N,,,0,,,,,,
401207501,00016,40120750100016,O,1995-05-15,NN,,,2019-01-15T08:16:16,true,1,,,,,LE BOURG,86470,MONTREUIL BONNIN,,,86166,,,,,,,,,,,,,,,,,,,2001-07-27,F,,,,,15.8C,NAF1993,O,0.142517,46.550269,0.91,locality,Le Bourg Montreuil-bonnin (Montreuil-Bonnin) 86470 Boivre-la-Vallée,86166_b013,G,LE BOURG MONTREUIL BONNIN,MONTREUIL BONNIN
414241596,00017,41424159600017,O,1997-10-22,,,,2019-01-15T08:16:16,true,1,,7,,RUE,DE LA BOIVRE,86470,MONTREUIL BONNIN,,,86166,,,,,,,,,,,,,,,,,,,1998-12-31,F,,,,,72.1Z,NAF1993,N,0.139394,46.548532,0.94,housenumber,7 Rue de la Boivre 86470 Boivre-la-Vallée,86166_0010_00007,G,7 RUE DE LA BOIVRE,
431007079,00012,43100707900012,O,1989-01-01,NN,,,2019-01-15T08:16:16,true,1,,,,,LES GATINELLES,86470,MONTREUIL BONNIN,,,86166,,,,,,,,,,,,,,,,,,,2001-10-01,F,,,,,01.1A,NAF1993,N,0.140764,46.542015,0.51,street,Lieu Dit les Garnaudieres 86470 Boivre-la-Vallée,86123_f5xi6k,G,LIEU DIT LES GARNAUDIERES,
781543806,00017,78154380600017,O,,NN,,,2019-01-15T08:16:16,true,1,,,,,,86470,MONTREUIL BONNIN,,,86166,,,,,,,,,,,,,,,,,,,,F,,,,,55.71,NAP,N,,,0,,,,,,
781543814,00011,78154381400011,O,,,,,2019-01-15T08:16:16,true,1,,,,RUE,DE LA GENDARMERIE,86470,MONTREUIL BONNIN,,,86166,,,,,,,,,,,,,,,,,,,1984-12-25,F,,,,,55.72,NAP,N,0.137368,46.555247,0.5,street,Rue de la Monnaie 86470 Boivre-la-Vallée,86166_0005,G,RUE DE LA MONNAIE,
781543822,00014,78154382200014,O,,,,,2019-01-15T08:16:16,true,1,,,,,,86470,MONTREUIL BONNIN,,,86166,,,,,,,,,,,,,,,,,,,1984-12-25,F,,,,,38.40,NAP,N,,,0,,,,,,
781543830,00017,78154383000017,O,,,,,2019-01-15T08:16:16,true,1,,,,,,86470,MONTREUIL BONNIN,,,86166,,,,,,,,,,,,,,,,,,,,F,,,,,45.23,NAP,N,,,0,,,,,,
